{"text_format":"3","workbook":"xlsx","n_sheets":17,"sheets":["Allgemein","Personalstamm","Zeitkonten","Fehlzeiten","Kalendarium","Jan.","Feb.","Mrz.","Apr.","Mai","Jun.","Jul.","Aug.","Sep.","Okt.","Nov.","Dez."],"not_rendered":{"images":5},"read":"whole","date_system":"1900"}

{"sheet":"Allgemein","index":0,"n_rows":64,"n_cols":42,"rows_kept":64,"merged":[[5,0,5,4],[5,6,5,8],[18,0,18,2],[46,6,46,9],[59,6,59,7]]}
[]
[]
[]
[]
[]
["Allgemein",{"$nulls":5},"Feiertage",{"$nulls":4},{"v":1,"d":"01"},{"v":2,"d":"02"},{"v":3,"d":"03"},{"v":4,"d":"04"},{"v":5,"d":"05"},{"v":6,"d":"06"},{"v":7,"d":"07"},{"v":8,"d":"08"},{"v":9,"d":"09"},10,11,12,13,14,15,16,17,18,19,20,21,22,23,24,25,26,27,28,29,30,31]
["Beschäftigungsart","Funktion","Firma","Werk","Abteilung",null,"Bezeichnung","Datum","Anteil Tag",null,"2023-01-01",{"$f":"IF(Jan.!$C10=\"Anwesenheit\",Allgemein!$H$62,IF(Jan.!$C10=\"Fehlzeit\",VLOOKUP(Jan.!$M10,Allgemein!$I$50:$J$58,2,FALSE),IF(Jan.!$C10=\"Wochenende\",VLOOKUP(Jan.!$B10,Allgemein!$G$63:$H$64,2,FALSE),\"\")))","v":"F"},{"$f":"IF(Jan.!$C11=\"Anwesenheit\",Allgemein!$H$62,IF(Jan.!$C11=\"Fehlzeit\",VLOOKUP(Jan.!$M11,Allgemein!$I$50:$J$58,2,FALSE),IF(Jan.!$C11=\"Wochenende\",VLOOKUP(Jan.!$B11,Allgemein!$G$63:$H$64,2,FALSE),\"\")))","v":""},{"$f":"IF(Jan.!$C12=\"Anwesenheit\",Allgemein!$H$62,IF(Jan.!$C12=\"Fehlzeit\",VLOOKUP(Jan.!$M12,Allgemein!$I$50:$J$58,2,FALSE),IF(Jan.!$C12=\"Wochenende\",VLOOKUP(Jan.!$B12,Allgemein!$G$63:$H$64,2,FALSE),\"\")))","v":":"},{"$f":"IF(Jan.!$C13=\"Anwesenheit\",Allgemein!$H$62,IF(Jan.!$C13=\"Fehlzeit\",VLOOKUP(Jan.!$M13,Allgemein!$I$50:$J$58,2,FALSE),IF(Jan.!$C13=\"Wochenende\",VLOOKUP(Jan.!$B13,Allgemein!$G$63:$H$64,2,FALSE),\"\")))","v":"#"},{"$f":"IF(Jan.!$C14=\"Anwesenheit\",Allgemein!$H$62,IF(Jan.!$C14=\"Fehlzeit\",VLOOKUP(Jan.!$M14,Allgemein!$I$50:$J$58,2,FALSE),IF(Jan.!$C14=\"Wochenende\",VLOOKUP(Jan.!$B14,Allgemein!$G$63:$H$64,2,FALSE),\"\")))","v":""},{"$f":"IF(Jan.!$C15=\"Anwesenheit\",Allgemein!$H$62,IF(Jan.!$C15=\"Fehlzeit\",VLOOKUP(Jan.!$M15,Allgemein!$I$50:$J$58,2,FALSE),IF(Jan.!$C15=\"Wochenende\",VLOOKUP(Jan.!$B15,Allgemein!$G$63:$H$64,2,FALSE),\"\")))","v":"F"},{"$f":"IF(Jan.!$C16=\"Anwesenheit\",Allgemein!$H$62,IF(Jan.!$C16=\"Fehlzeit\",VLOOKUP(Jan.!$M16,Allgemein!$I$50:$J$58,2,FALSE),IF(Jan.!$C16=\"Wochenende\",VLOOKUP(Jan.!$B16,Allgemein!$G$63:$H$64,2,FALSE),\"\")))","v":""},{"$f":"IF(Jan.!$C17=\"Anwesenheit\",Allgemein!$H$62,IF(Jan.!$C17=\"Fehlzeit\",VLOOKUP(Jan.!$M17,Allgemein!$I$50:$J$58,2,FALSE),IF(Jan.!$C17=\"Wochenende\",VLOOKUP(Jan.!$B17,Allgemein!$G$63:$H$64,2,FALSE),\"\")))","v":""},{"$f":"IF(Jan.!$C18=\"Anwesenheit\",Allgemein!$H$62,IF(Jan.!$C18=\"Fehlzeit\",VLOOKUP(Jan.!$M18,Allgemein!$I$50:$J$58,2,FALSE),IF(Jan.!$C18=\"Wochenende\",VLOOKUP(Jan.!$B18,Allgemein!$G$63:$H$64,2,FALSE),\"\")))","v":""},{"$f":"IF(Jan.!$C19=\"Anwesenheit\",Allgemein!$H$62,IF(Jan.!$C19=\"Fehlzeit\",VLOOKUP(Jan.!$M19,Allgemein!$I$50:$J$58,2,FALSE),IF(Jan.!$C19=\"Wochenende\",VLOOKUP(Jan.!$B19,Allgemein!$G$63:$H$64,2,FALSE),\"\")))","v":":"},{"$f":"IF(Jan.!$C20=\"Anwesenheit\",Allgemein!$H$62,IF(Jan.!$C20=\"Fehlzeit\",VLOOKUP(Jan.!$M20,Allgemein!$I$50:$J$58,2,FALSE),IF(Jan.!$C20=\"Wochenende\",VLOOKUP(Jan.!$B20,Allgemein!$G$63:$H$64,2,FALSE),\"\")))","v":"#"},{"$f":"IF(Jan.!$C21=\"Anwesenheit\",Allgemein!$H$62,IF(Jan.!$C21=\"Fehlzeit\",VLOOKUP(Jan.!$M21,Allgemein!$I$50:$J$58,2,FALSE),IF(Jan.!$C21=\"Wochenende\",VLOOKUP(Jan.!$B21,Allgemein!$G$63:$H$64,2,FALSE),\"\")))","v":""},{"$f":"IF(Jan.!$C22=\"Anwesenheit\",Allgemein!$H$62,IF(Jan.!$C22=\"Fehlzeit\",VLOOKUP(Jan.!$M22,Allgemein!$I$50:$J$58,2,FALSE),IF(Jan.!$C22=\"Wochenende\",VLOOKUP(Jan.!$B22,Allgemein!$G$63:$H$64,2,FALSE),\"\")))","v":""},{"$f":"IF(Jan.!$C23=\"Anwesenheit\",Allgemein!$H$62,IF(Jan.!$C23=\"Fehlzeit\",VLOOKUP(Jan.!$M23,Allgemein!$I$50:$J$58,2,FALSE),IF(Jan.!$C23=\"Wochenende\",VLOOKUP(Jan.!$B23,Allgemein!$G$63:$H$64,2,FALSE),\"\")))","v":""},{"$f":"IF(Jan.!$C24=\"Anwesenheit\",Allgemein!$H$62,IF(Jan.!$C24=\"Fehlzeit\",VLOOKUP(Jan.!$M24,Allgemein!$I$50:$J$58,2,FALSE),IF(Jan.!$C24=\"Wochenende\",VLOOKUP(Jan.!$B24,Allgemein!$G$63:$H$64,2,FALSE),\"\")))","v":""},{"$f":"IF(Jan.!$C25=\"Anwesenheit\",Allgemein!$H$62,IF(Jan.!$C25=\"Fehlzeit\",VLOOKUP(Jan.!$M25,Allgemein!$I$50:$J$58,2,FALSE),IF(Jan.!$C25=\"Wochenende\",VLOOKUP(Jan.!$B25,Allgemein!$G$63:$H$64,2,FALSE),\"\")))","v":""},{"$f":"IF(Jan.!$C26=\"Anwesenheit\",Allgemein!$H$62,IF(Jan.!$C26=\"Fehlzeit\",VLOOKUP(Jan.!$M26,Allgemein!$I$50:$J$58,2,FALSE),IF(Jan.!$C26=\"Wochenende\",VLOOKUP(Jan.!$B26,Allgemein!$G$63:$H$64,2,FALSE),\"\")))","v":":"},{"$f":"IF(Jan.!$C27=\"Anwesenheit\",Allgemein!$H$62,IF(Jan.!$C27=\"Fehlzeit\",VLOOKUP(Jan.!$M27,Allgemein!$I$50:$J$58,2,FALSE),IF(Jan.!$C27=\"Wochenende\",VLOOKUP(Jan.!$B27,Allgemein!$G$63:$H$64,2,FALSE),\"\")))","v":"#"},{"$f":"IF(Jan.!$C28=\"Anwesenheit\",Allgemein!$H$62,IF(Jan.!$C28=\"Fehlzeit\",VLOOKUP(Jan.!$M28,Allgemein!$I$50:$J$58,2,FALSE),IF(Jan.!$C28=\"Wochenende\",VLOOKUP(Jan.!$B28,Allgemein!$G$63:$H$64,2,FALSE),\"\")))","v":""},{"$f":"IF(Jan.!$C29=\"Anwesenheit\",Allgemein!$H$62,IF(Jan.!$C29=\"Fehlzeit\",VLOOKUP(Jan.!$M29,Allgemein!$I$50:$J$58,2,FALSE),IF(Jan.!$C29=\"Wochenende\",VLOOKUP(Jan.!$B29,Allgemein!$G$63:$H$64,2,FALSE),\"\")))","v":""},{"$f":"IF(Jan.!$C30=\"Anwesenheit\",Allgemein!$H$62,IF(Jan.!$C30=\"Fehlzeit\",VLOOKUP(Jan.!$M30,Allgemein!$I$50:$J$58,2,FALSE),IF(Jan.!$C30=\"Wochenende\",VLOOKUP(Jan.!$B30,Allgemein!$G$63:$H$64,2,FALSE),\"\")))","v":""},{"$f":"IF(Jan.!$C31=\"Anwesenheit\",Allgemein!$H$62,IF(Jan.!$C31=\"Fehlzeit\",VLOOKUP(Jan.!$M31,Allgemein!$I$50:$J$58,2,FALSE),IF(Jan.!$C31=\"Wochenende\",VLOOKUP(Jan.!$B31,Allgemein!$G$63:$H$64,2,FALSE),\"\")))","v":""},{"$f":"IF(Jan.!$C32=\"Anwesenheit\",Allgemein!$H$62,IF(Jan.!$C32=\"Fehlzeit\",VLOOKUP(Jan.!$M32,Allgemein!$I$50:$J$58,2,FALSE),IF(Jan.!$C32=\"Wochenende\",VLOOKUP(Jan.!$B32,Allgemein!$G$63:$H$64,2,FALSE),\"\")))","v":""},{"$f":"IF(Jan.!$C33=\"Anwesenheit\",Allgemein!$H$62,IF(Jan.!$C33=\"Fehlzeit\",VLOOKUP(Jan.!$M33,Allgemein!$I$50:$J$58,2,FALSE),IF(Jan.!$C33=\"Wochenende\",VLOOKUP(Jan.!$B33,Allgemein!$G$63:$H$64,2,FALSE),\"\")))","v":":"},{"$f":"IF(Jan.!$C34=\"Anwesenheit\",Allgemein!$H$62,IF(Jan.!$C34=\"Fehlzeit\",VLOOKUP(Jan.!$M34,Allgemein!$I$50:$J$58,2,FALSE),IF(Jan.!$C34=\"Wochenende\",VLOOKUP(Jan.!$B34,Allgemein!$G$63:$H$64,2,FALSE),\"\")))","v":"#"},{"$f":"IF(Jan.!$C35=\"Anwesenheit\",Allgemein!$H$62,IF(Jan.!$C35=\"Fehlzeit\",VLOOKUP(Jan.!$M35,Allgemein!$I$50:$J$58,2,FALSE),IF(Jan.!$C35=\"Wochenende\",VLOOKUP(Jan.!$B35,Allgemein!$G$63:$H$64,2,FALSE),\"\")))","v":""},{"$f":"IF(Jan.!$C36=\"Anwesenheit\",Allgemein!$H$62,IF(Jan.!$C36=\"Fehlzeit\",VLOOKUP(Jan.!$M36,Allgemein!$I$50:$J$58,2,FALSE),IF(Jan.!$C36=\"Wochenende\",VLOOKUP(Jan.!$B36,Allgemein!$G$63:$H$64,2,FALSE),\"\")))","v":""},{"$f":"IF(Jan.!$C37=\"Anwesenheit\",Allgemein!$H$62,IF(Jan.!$C37=\"Fehlzeit\",VLOOKUP(Jan.!$M37,Allgemein!$I$50:$J$58,2,FALSE),IF(Jan.!$C37=\"Wochenende\",VLOOKUP(Jan.!$B37,Allgemein!$G$63:$H$64,2,FALSE),\"\")))","v":""},{"$f":"IF(Jan.!$C38=\"Anwesenheit\",Allgemein!$H$62,IF(Jan.!$C38=\"Fehlzeit\",VLOOKUP(Jan.!$M38,Allgemein!$I$50:$J$58,2,FALSE),IF(Jan.!$C38=\"Wochenende\",VLOOKUP(Jan.!$B38,Allgemein!$G$63:$H$64,2,FALSE),\"\")))","v":""},{"$f":"IF(Jan.!$C39=\"Anwesenheit\",Allgemein!$H$62,IF(Jan.!$C39=\"Fehlzeit\",VLOOKUP(Jan.!$M39,Allgemein!$I$50:$J$58,2,FALSE),IF(Jan.!$C39=\"Wochenende\",VLOOKUP(Jan.!$B39,Allgemein!$G$63:$H$64,2,FALSE),\"\")))","v":""},{"$f":"IF(Jan.!$C40=\"Anwesenheit\",Allgemein!$H$62,IF(Jan.!$C40=\"Fehlzeit\",VLOOKUP(Jan.!$M40,Allgemein!$I$50:$J$58,2,FALSE),IF(Jan.!$C40=\"Wochenende\",VLOOKUP(Jan.!$B40,Allgemein!$G$63:$H$64,2,FALSE),\"\")))","v":":"}]
["Bitte auswählen","Bitte auswählen","Bitte auswählen","Bitte auswählen","Bitte auswählen",null,"Neujahr","2026-01-01",{"v":1,"d":"1.00"},null,"2023-02-01",{"$f":"IF(Feb.!$C10=\"Anwesenheit\",Allgemein!$H$62,IF(Feb.!$C10=\"Fehlzeit\",VLOOKUP(Feb.!$M10,Allgemein!$I$50:$J$58,2,FALSE),IF(Feb.!$C10=\"Wochenende\",VLOOKUP(Feb.!$B10,Allgemein!$G$63:$H$64,2,FALSE),\"\")))","v":"#"},{"$f":"IF(Feb.!$C11=\"Anwesenheit\",Allgemein!$H$62,IF(Feb.!$C11=\"Fehlzeit\",VLOOKUP(Feb.!$M11,Allgemein!$I$50:$J$58,2,FALSE),IF(Feb.!$C11=\"Wochenende\",VLOOKUP(Feb.!$B11,Allgemein!$G$63:$H$64,2,FALSE),\"\")))","v":""},{"$f":"IF(Feb.!$C12=\"Anwesenheit\",Allgemein!$H$62,IF(Feb.!$C12=\"Fehlzeit\",VLOOKUP(Feb.!$M12,Allgemein!$I$50:$J$58,2,FALSE),IF(Feb.!$C12=\"Wochenende\",VLOOKUP(Feb.!$B12,Allgemein!$G$63:$H$64,2,FALSE),\"\")))","v":""},{"$f":"IF(Feb.!$C13=\"Anwesenheit\",Allgemein!$H$62,IF(Feb.!$C13=\"Fehlzeit\",VLOOKUP(Feb.!$M13,Allgemein!$I$50:$J$58,2,FALSE),IF(Feb.!$C13=\"Wochenende\",VLOOKUP(Feb.!$B13,Allgemein!$G$63:$H$64,2,FALSE),\"\")))","v":""},{"$f":"IF(Feb.!$C14=\"Anwesenheit\",Allgemein!$H$62,IF(Feb.!$C14=\"Fehlzeit\",VLOOKUP(Feb.!$M14,Allgemein!$I$50:$J$58,2,FALSE),IF(Feb.!$C14=\"Wochenende\",VLOOKUP(Feb.!$B14,Allgemein!$G$63:$H$64,2,FALSE),\"\")))","v":""},{"$f":"IF(Feb.!$C15=\"Anwesenheit\",Allgemein!$H$62,IF(Feb.!$C15=\"Fehlzeit\",VLOOKUP(Feb.!$M15,Allgemein!$I$50:$J$58,2,FALSE),IF(Feb.!$C15=\"Wochenende\",VLOOKUP(Feb.!$B15,Allgemein!$G$63:$H$64,2,FALSE),\"\")))","v":""},{"$f":"IF(Feb.!$C16=\"Anwesenheit\",Allgemein!$H$62,IF(Feb.!$C16=\"Fehlzeit\",VLOOKUP(Feb.!$M16,Allgemein!$I$50:$J$58,2,FALSE),IF(Feb.!$C16=\"Wochenende\",VLOOKUP(Feb.!$B16,Allgemein!$G$63:$H$64,2,FALSE),\"\")))","v":":"},{"$f":"IF(Feb.!$C17=\"Anwesenheit\",Allgemein!$H$62,IF(Feb.!$C17=\"Fehlzeit\",VLOOKUP(Feb.!$M17,Allgemein!$I$50:$J$58,2,FALSE),IF(Feb.!$C17=\"Wochenende\",VLOOKUP(Feb.!$B17,Allgemein!$G$63:$H$64,2,FALSE),\"\")))","v":"#"},{"$f":"IF(Feb.!$C18=\"Anwesenheit\",Allgemein!$H$62,IF(Feb.!$C18=\"Fehlzeit\",VLOOKUP(Feb.!$M18,Allgemein!$I$50:$J$58,2,FALSE),IF(Feb.!$C18=\"Wochenende\",VLOOKUP(Feb.!$B18,Allgemein!$G$63:$H$64,2,FALSE),\"\")))","v":""},{"$f":"IF(Feb.!$C19=\"Anwesenheit\",Allgemein!$H$62,IF(Feb.!$C19=\"Fehlzeit\",VLOOKUP(Feb.!$M19,Allgemein!$I$50:$J$58,2,FALSE),IF(Feb.!$C19=\"Wochenende\",VLOOKUP(Feb.!$B19,Allgemein!$G$63:$H$64,2,FALSE),\"\")))","v":""},{"$f":"IF(Feb.!$C20=\"Anwesenheit\",Allgemein!$H$62,IF(Feb.!$C20=\"Fehlzeit\",VLOOKUP(Feb.!$M20,Allgemein!$I$50:$J$58,2,FALSE),IF(Feb.!$C20=\"Wochenende\",VLOOKUP(Feb.!$B20,Allgemein!$G$63:$H$64,2,FALSE),\"\")))","v":""},{"$f":"IF(Feb.!$C21=\"Anwesenheit\",Allgemein!$H$62,IF(Feb.!$C21=\"Fehlzeit\",VLOOKUP(Feb.!$M21,Allgemein!$I$50:$J$58,2,FALSE),IF(Feb.!$C21=\"Wochenende\",VLOOKUP(Feb.!$B21,Allgemein!$G$63:$H$64,2,FALSE),\"\")))","v":""},{"$f":"IF(Feb.!$C22=\"Anwesenheit\",Allgemein!$H$62,IF(Feb.!$C22=\"Fehlzeit\",VLOOKUP(Feb.!$M22,Allgemein!$I$50:$J$58,2,FALSE),IF(Feb.!$C22=\"Wochenende\",VLOOKUP(Feb.!$B22,Allgemein!$G$63:$H$64,2,FALSE),\"\")))","v":""},{"$f":"IF(Feb.!$C23=\"Anwesenheit\",Allgemein!$H$62,IF(Feb.!$C23=\"Fehlzeit\",VLOOKUP(Feb.!$M23,Allgemein!$I$50:$J$58,2,FALSE),IF(Feb.!$C23=\"Wochenende\",VLOOKUP(Feb.!$B23,Allgemein!$G$63:$H$64,2,FALSE),\"\")))","v":":"},{"$f":"IF(Feb.!$C24=\"Anwesenheit\",Allgemein!$H$62,IF(Feb.!$C24=\"Fehlzeit\",VLOOKUP(Feb.!$M24,Allgemein!$I$50:$J$58,2,FALSE),IF(Feb.!$C24=\"Wochenende\",VLOOKUP(Feb.!$B24,Allgemein!$G$63:$H$64,2,FALSE),\"\")))","v":"#"},{"$f":"IF(Feb.!$C25=\"Anwesenheit\",Allgemein!$H$62,IF(Feb.!$C25=\"Fehlzeit\",VLOOKUP(Feb.!$M25,Allgemein!$I$50:$J$58,2,FALSE),IF(Feb.!$C25=\"Wochenende\",VLOOKUP(Feb.!$B25,Allgemein!$G$63:$H$64,2,FALSE),\"\")))","v":""},{"$f":"IF(Feb.!$C26=\"Anwesenheit\",Allgemein!$H$62,IF(Feb.!$C26=\"Fehlzeit\",VLOOKUP(Feb.!$M26,Allgemein!$I$50:$J$58,2,FALSE),IF(Feb.!$C26=\"Wochenende\",VLOOKUP(Feb.!$B26,Allgemein!$G$63:$H$64,2,FALSE),\"\")))","v":""},{"$f":"IF(Feb.!$C27=\"Anwesenheit\",Allgemein!$H$62,IF(Feb.!$C27=\"Fehlzeit\",VLOOKUP(Feb.!$M27,Allgemein!$I$50:$J$58,2,FALSE),IF(Feb.!$C27=\"Wochenende\",VLOOKUP(Feb.!$B27,Allgemein!$G$63:$H$64,2,FALSE),\"\")))","v":""},{"$f":"IF(Feb.!$C28=\"Anwesenheit\",Allgemein!$H$62,IF(Feb.!$C28=\"Fehlzeit\",VLOOKUP(Feb.!$M28,Allgemein!$I$50:$J$58,2,FALSE),IF(Feb.!$C28=\"Wochenende\",VLOOKUP(Feb.!$B28,Allgemein!$G$63:$H$64,2,FALSE),\"\")))","v":""},{"$f":"IF(Feb.!$C29=\"Anwesenheit\",Allgemein!$H$62,IF(Feb.!$C29=\"Fehlzeit\",VLOOKUP(Feb.!$M29,Allgemein!$I$50:$J$58,2,FALSE),IF(Feb.!$C29=\"Wochenende\",VLOOKUP(Feb.!$B29,Allgemein!$G$63:$H$64,2,FALSE),\"\")))","v":""},{"$f":"IF(Feb.!$C30=\"Anwesenheit\",Allgemein!$H$62,IF(Feb.!$C30=\"Fehlzeit\",VLOOKUP(Feb.!$M30,Allgemein!$I$50:$J$58,2,FALSE),IF(Feb.!$C30=\"Wochenende\",VLOOKUP(Feb.!$B30,Allgemein!$G$63:$H$64,2,FALSE),\"\")))","v":":"},{"$f":"IF(Feb.!$C31=\"Anwesenheit\",Allgemein!$H$62,IF(Feb.!$C31=\"Fehlzeit\",VLOOKUP(Feb.!$M31,Allgemein!$I$50:$J$58,2,FALSE),IF(Feb.!$C31=\"Wochenende\",VLOOKUP(Feb.!$B31,Allgemein!$G$63:$H$64,2,FALSE),\"\")))","v":"#"},{"$f":"IF(Feb.!$C32=\"Anwesenheit\",Allgemein!$H$62,IF(Feb.!$C32=\"Fehlzeit\",VLOOKUP(Feb.!$M32,Allgemein!$I$50:$J$58,2,FALSE),IF(Feb.!$C32=\"Wochenende\",VLOOKUP(Feb.!$B32,Allgemein!$G$63:$H$64,2,FALSE),\"\")))","v":""},{"$f":"IF(Feb.!$C33=\"Anwesenheit\",Allgemein!$H$62,IF(Feb.!$C33=\"Fehlzeit\",VLOOKUP(Feb.!$M33,Allgemein!$I$50:$J$58,2,FALSE),IF(Feb.!$C33=\"Wochenende\",VLOOKUP(Feb.!$B33,Allgemein!$G$63:$H$64,2,FALSE),\"\")))","v":""},{"$f":"IF(Feb.!$C34=\"Anwesenheit\",Allgemein!$H$62,IF(Feb.!$C34=\"Fehlzeit\",VLOOKUP(Feb.!$M34,Allgemein!$I$50:$J$58,2,FALSE),IF(Feb.!$C34=\"Wochenende\",VLOOKUP(Feb.!$B34,Allgemein!$G$63:$H$64,2,FALSE),\"\")))","v":""},{"$f":"IF(Feb.!$C35=\"Anwesenheit\",Allgemein!$H$62,IF(Feb.!$C35=\"Fehlzeit\",VLOOKUP(Feb.!$M35,Allgemein!$I$50:$J$58,2,FALSE),IF(Feb.!$C35=\"Wochenende\",VLOOKUP(Feb.!$B35,Allgemein!$G$63:$H$64,2,FALSE),\"\")))","v":""},{"$f":"IF(Feb.!$C36=\"Anwesenheit\",Allgemein!$H$62,IF(Feb.!$C36=\"Fehlzeit\",VLOOKUP(Feb.!$M36,Allgemein!$I$50:$J$58,2,FALSE),IF(Feb.!$C36=\"Wochenende\",VLOOKUP(Feb.!$B36,Allgemein!$G$63:$H$64,2,FALSE),\"\")))","v":""},{"$f":"IF(Feb.!$C37=\"Anwesenheit\",Allgemein!$H$62,IF(Feb.!$C37=\"Fehlzeit\",VLOOKUP(Feb.!$M37,Allgemein!$I$50:$J$58,2,FALSE),IF(Feb.!$C37=\"Wochenende\",VLOOKUP(Feb.!$B37,Allgemein!$G$63:$H$64,2,FALSE),\"\")))","v":":"}]
{"$rows_left_out":57}
{"sheet":"Personalstamm","index":1,"n_rows":29,"n_cols":9,"rows_kept":29,"merged":[[5,0,5,1],[5,3,5,5],[5,7,5,8],[14,0,14,1],[16,3,16,4],[18,7,18,8],[21,3,21,5]]}
[]
[]
[]
[]
[]
["Allgemein",null,null,"Verrechnung",{"$nulls":3},"Urlaub"]
["Personalnummer",null,null,"Wochentag","Sollstunden","FZ-Gutschrift",null,"Kontenart","Anzahl Tage"]
["Name, Vorname",null,null,"Montag",{"v":8,"d":"8.00"},{"v":8,"d":"8.00"},null,"Urlaubsvortrag",{"v":2,"d":"2.00"}]
{"$rows_left_out":22}
{"sheet":"Zeitkonten","index":2,"n_rows":19,"n_cols":7,"rows_kept":19}
[]
[]
[]
[]
[]
["Monat","Bruttoarbeitszeit","Pause","Nettoarbeitszeit","Fehlstunden","Sollstunden","Saldoänderung"]
["2026-01-01",{"$f":"Jan.!$I$41","v":{"v":0,"d":"0.00"}},{"$f":"Jan.!$J$41+Jan.!$K$41","v":{"v":0,"d":"0.00"}},{"$f":"Jan.!$L$41","v":{"v":0,"d":"0.00"}},{"$f":"Jan.!$N$41","v":{"v":16,"d":"16.00"}},{"$f":"Jan.!$O$41","v":{"v":176,"d":"176.00"}},{"$f":"Jan.!$P$41","v":{"v":0,"d":"0.00"}}]
["2026-02-01",{"$f":"Feb.!$I$38","v":{"v":0,"d":"0.00"}},{"$f":"Feb.!$J$38+Feb.!$K$38","v":{"v":0,"d":"0.00"}},{"$f":"Feb.!$L$38","v":{"v":0,"d":"0.00"}},{"$f":"Feb.!$N$38","v":{"v":0,"d":"0.00"}},{"$f":"Feb.!$O$38","v":{"v":160,"d":"160.00"}},{"$f":"Feb.!$P$38","v":{"v":0,"d":"0.00"}}]
{"$rows_left_out":12}
{"sheet":"Fehlzeiten","index":3,"n_rows":19,"n_cols":10,"rows_kept":19}
[]
[]
[]
[]
[]
["Monat","Urlaub","Krankheit","Kurzarbeit","Mutterschutz","Fortbildung","Elternzeit","Gleittag","Schule","Feiertag"]
["2026-01-01",{"$f":"Jan.!$F$44","v":{"v":0,"d":"0.00"}},{"$f":"Jan.!$F$45","v":{"v":0,"d":"0.00"}},{"$f":"Jan.!$F$46","v":{"v":0,"d":"0.00"}},{"$f":"Jan.!$F$47","v":{"v":0,"d":"0.00"}},{"$f":"Jan.!$F$48","v":{"v":0,"d":"0.00"}},{"$f":"Jan.!$F$49","v":{"v":0,"d":"0.00"}},{"$f":"Jan.!$F$50","v":{"v":0,"d":"0.00"}},{"$f":"Jan.!$F$51","v":{"v":0,"d":"0.00"}},{"$f":"Jan.!$F$52","v":{"v":16,"d":"16.00"}}]
["2026-02-01",{"$f":"Feb.!$F$41","v":{"v":0,"d":"0.00"}},{"$f":"Feb.!$F$42","v":{"v":0,"d":"0.00"}},{"$f":"Feb.!$F$43","v":{"v":0,"d":"0.00"}},{"$f":"Feb.!$F$44","v":{"v":0,"d":"0.00"}},{"$f":"Feb.!$F$45","v":{"v":0,"d":"0.00"}},{"$f":"Feb.!$F$46","v":{"v":0,"d":"0.00"}},{"$f":"Feb.!$F$47","v":{"v":0,"d":"0.00"}},{"$f":"Feb.!$F$48","v":{"v":0,"d":"0.00"}},{"$f":"Feb.!$F$49","v":{"v":0,"d":"0.00"}}]
{"$rows_left_out":12}
{"sheet":"Kalendarium","index":4,"n_rows":22,"n_cols":32,"rows_kept":22,"merged":[[19,2,19,5],[19,10,19,13],[19,18,19,21],[19,26,19,29],[20,2,20,5],[20,10,20,13],[20,18,20,21],[20,26,20,29],[21,2,21,5],[21,10,21,13],[21,18,21,21],[21,26,21,29]]}
[]
[]
[]
[]
[]
[null,{"v":1,"d":"01"},{"v":2,"d":"02"},{"v":3,"d":"03"},{"v":4,"d":"04"},{"v":5,"d":"05"},{"v":6,"d":"06"},{"v":7,"d":"07"},{"v":8,"d":"08"},{"v":9,"d":"09"},10,11,12,13,14,15,16,17,18,19,20,21,22,23,24,25,26,27,28,29,30,31]
["2026-01-01",{"$f":"Allgemein!L$7","v":"F"},{"$f":"Allgemein!M$7","v":""},{"$f":"Allgemein!N$7","v":":"},{"$f":"Allgemein!O$7","v":"#"},{"$f":"Allgemein!P$7","v":""},{"$f":"Allgemein!Q$7","v":"F"},{"$f":"Allgemein!R$7","v":""},{"$f":"Allgemein!S$7","v":""},{"$f":"Allgemein!T$7","v":""},{"$f":"Allgemein!U$7","v":":"},{"$f":"Allgemein!V$7","v":"#"},{"$f":"Allgemein!W$7","v":""},{"$f":"Allgemein!X$7","v":""},{"$f":"Allgemein!Y$7","v":""},{"$f":"Allgemein!Z$7","v":""},{"$f":"Allgemein!AA$7","v":""},{"$f":"Allgemein!AB$7","v":":"},{"$f":"Allgemein!AC$7","v":"#"},{"$f":"Allgemein!AD$7","v":""},{"$f":"Allgemein!AE$7","v":""},{"$f":"Allgemein!AF$7","v":""},{"$f":"Allgemein!AG$7","v":""},{"$f":"Allgemein!AH$7","v":""},{"$f":"Allgemein!AI$7","v":":"},{"$f":"Allgemein!AJ$7","v":"#"},{"$f":"Allgemein!AK$7","v":""},{"$f":"Allgemein!AL$7","v":""},{"$f":"Allgemein!AM$7","v":""},{"$f":"Allgemein!AN$7","v":""},{"$f":"Allgemein!AO$7","v":""},{"$f":"Allgemein!AP$7","v":":"}]
["2026-02-01",{"$f":"Allgemein!L$8","v":"#"},{"$f":"Allgemein!M$8","v":""},{"$f":"Allgemein!N$8","v":""},{"$f":"Allgemein!O$8","v":""},{"$f":"Allgemein!P$8","v":""},{"$f":"Allgemein!Q$8","v":""},{"$f":"Allgemein!R$8","v":":"},{"$f":"Allgemein!S$8","v":"#"},{"$f":"Allgemein!T$8","v":""},{"$f":"Allgemein!U$8","v":""},{"$f":"Allgemein!V$8","v":""},{"$f":"Allgemein!W$8","v":""},{"$f":"Allgemein!X$8","v":""},{"$f":"Allgemein!Y$8","v":":"},{"$f":"Allgemein!Z$8","v":"#"},{"$f":"Allgemein!AA$8","v":""},{"$f":"Allgemein!AB$8","v":""},{"$f":"Allgemein!AC$8","v":""},{"$f":"Allgemein!AD$8","v":""},{"$f":"Allgemein!AE$8","v":""},{"$f":"Allgemein!AF$8","v":":"},{"$f":"Allgemein!AG$8","v":"#"},{"$f":"Allgemein!AH$8","v":""},{"$f":"Allgemein!AI$8","v":""},{"$f":"Allgemein!AJ$8","v":""},{"$f":"Allgemein!AK$8","v":""},{"$f":"Allgemein!AL$8","v":""},{"$f":"Allgemein!AM$8","v":":"}]
{"$rows_left_out":15}
{"sheet":"Jan.","index":5,"n_rows":53,"n_cols":23,"rows_kept":53}
[]
[]
[]
[]
[]
["Urlaubsvortrag",{"$f":"Personalstamm!$I$12-Personalstamm!$I$13","v":{"v":30,"d":"30.00"}},"Urlaub genommen",{"$f":"$H$44","v":{"v":0,"d":"0.00"}},"Resturlaub",{"$f":"$B$6-$D$6","v":{"v":30,"d":"30.00"}}]
["Saldovortrag",{"$f":"Personalstamm!$I$21","v":{"v":0,"d":"0.00"}},"Saldoänderung",{"$f":"$P$41","v":{"v":0,"d":"0.00"}},"Kumulierter Saldo",{"$f":"$B$7+$D$7","v":{"v":0,"d":"0.00"}}]
[]
{"$rows_left_out":46}
{"sheet":"Feb.","index":6,"n_rows":50,"n_cols":23,"rows_kept":50}
[]
[]
[]
[]
[]
["Urlaubsvortrag",{"$f":"Jan.!$F$6","v":{"v":30,"d":"30.00"}},"Urlaub genommen",{"$f":"$H$41","v":{"v":0,"d":"0.00"}},"Resturlaub",{"$f":"$B$6-$D$6","v":{"v":30,"d":"30.00"}}]
["Saldovortrag",{"$f":"Jan.!$F$7","v":{"v":0,"d":"0.00"}},"Saldoänderung",{"$f":"$P$38","v":{"v":0,"d":"0.00"}},"Kumulierter Saldo",{"$f":"$B$7+$D$7","v":{"v":0,"d":"0.00"}}]
[]
{"$rows_left_out":43}
{"sheet":"Mrz.","index":7,"n_rows":53,"n_cols":23,"rows_kept":53}
[]
[]
[]
[]
[]
["Urlaubsvortrag",{"$f":"Feb.!$F$6","v":{"v":30,"d":"30.00"}},"Urlaub genommen",{"$f":"$H$44","v":{"v":0,"d":"0.00"}},"Resturlaub",{"$f":"$B$6-$D$6","v":{"v":30,"d":"30.00"}}]
["Saldovortrag",{"$f":"Feb.!F7","v":{"v":0,"d":"0.00"}},"Saldoänderung",{"$f":"$P$41","v":{"v":0,"d":"0.00"}},"Kumulierter Saldo",{"$f":"$B$7+$D$7","v":{"v":0,"d":"0.00"}}]
[]
{"$rows_left_out":46}
{"sheet":"Apr.","index":8,"n_rows":52,"n_cols":23,"rows_kept":52}
[]
[]
[]
[]
[]
["Urlaubsvortrag",{"$f":"Mrz.!$F$6","v":{"v":30,"d":"30.00"}},"Urlaub genommen",{"$f":"$H$43","v":{"v":0,"d":"0.00"}},"Resturlaub",{"$f":"$B$6-$D$6","v":{"v":30,"d":"30.00"}}]
["Saldovortrag",{"$f":"Mrz.!$F$7","v":{"v":0,"d":"0.00"}},"Saldoänderung",{"$f":"$P$40","v":{"v":0,"d":"0.00"}},"Kumulierter Saldo",{"$f":"$B$7+$D$7","v":{"v":0,"d":"0.00"}}]
[]
{"$rows_left_out":45}
{"sheet":"Mai","index":9,"n_rows":53,"n_cols":23,"rows_kept":53}
[]
[]
[]
[]
[]
["Urlaubsvortrag",{"$f":"Apr.!$F$6","v":{"v":30,"d":"30.00"}},"Urlaub genommen",{"$f":"$H$44","v":{"v":0,"d":"0.00"}},"Resturlaub",{"$f":"$B$6-$D$6","v":{"v":30,"d":"30.00"}}]
["Saldovortrag",{"$f":"Apr.!$F$7","v":{"v":0,"d":"0.00"}},"Saldoänderung",{"$f":"$P$41","v":{"v":0,"d":"0.00"}},"Kumulierter Saldo",{"$f":"$B$7+$D$7","v":{"v":0,"d":"0.00"}}]
[]
{"$rows_left_out":46}
{"sheet":"Jun.","index":10,"n_rows":52,"n_cols":23,"rows_kept":52}
[]
[]
[]
[]
[]
["Urlaubsvortrag",{"$f":"Mai!$F$6","v":{"v":30,"d":"30.00"}},"Urlaub genommen",{"$f":"$H$43","v":{"v":0,"d":"0.00"}},"Resturlaub",{"$f":"$B$6-$D$6","v":{"v":30,"d":"30.00"}}]
["Saldovortrag",{"$f":"Mai!$F$7","v":{"v":0,"d":"0.00"}},"Saldoänderung",{"$f":"$P$40","v":{"v":0,"d":"0.00"}},"Kumulierter Saldo",{"$f":"$B$7+$D$7","v":{"v":0,"d":"0.00"}}]
[]
{"$rows_left_out":45}
{"sheet":"Jul.","index":11,"n_rows":53,"n_cols":23,"rows_kept":53}
[]
[]
[]
[]
[]
["Urlaubsvortrag",{"$f":"Jun.!$F$6","v":{"v":30,"d":"30.00"}},"Urlaub genommen",{"$f":"$H$44","v":{"v":0,"d":"0.00"}},"Resturlaub",{"$f":"$B$6-$D$6","v":{"v":30,"d":"30.00"}}]
["Saldovortrag",{"$f":"Jun.!$F$7","v":{"v":0,"d":"0.00"}},"Saldoänderung",{"$f":"$P$41","v":{"v":0,"d":"0.00"}},"Kumulierter Saldo",{"$f":"$B$7+$D$7","v":{"v":0,"d":"0.00"}}]
[]
{"$rows_left_out":46}
{"sheet":"Aug.","index":12,"n_rows":53,"n_cols":23,"rows_kept":53}
[]
[]
[]
[]
[]
["Urlaubsvortrag",{"$f":"Jul.!$F$6","v":{"v":30,"d":"30.00"}},"Urlaub genommen",{"$f":"$H$44","v":{"v":0,"d":"0.00"}},"Resturlaub",{"$f":"$B$6-$D$6","v":{"v":30,"d":"30.00"}}]
["Saldovortrag",{"$f":"Jul.!$F$7","v":{"v":0,"d":"0.00"}},"Saldoänderung",{"$f":"$P$41","v":{"v":0,"d":"0.00"}},"Kumulierter Saldo",{"$f":"$B$7+$D$7","v":{"v":0,"d":"0.00"}}]
[]
{"$rows_left_out":46}
{"sheet":"Sep.","index":13,"n_rows":52,"n_cols":23,"rows_kept":52}
[]
[]
[]
[]
[]
["Urlaubsvortrag",{"$f":"Aug.!$F$6","v":{"v":30,"d":"30.00"}},"Urlaub genommen",{"$f":"$H$43","v":{"v":0,"d":"0.00"}},"Resturlaub",{"$f":"$B$6-$D$6","v":{"v":30,"d":"30.00"}}]
["Saldovortrag",{"$f":"Aug.!$F$7","v":{"v":0,"d":"0.00"}},"Saldoänderung",{"$f":"$P$40","v":{"v":0,"d":"0.00"}},"Kumulierter Saldo",{"$f":"$B$7+$D$7","v":{"v":0,"d":"0.00"}}]
[]
{"$rows_left_out":45}
{"sheet":"Okt.","index":14,"n_rows":53,"n_cols":23,"rows_kept":53}
[]
[]
[]
[]
[]
["Urlaubsvortrag",{"$f":"Sep.!$F$6","v":{"v":30,"d":"30.00"}},"Urlaub genommen",{"$f":"$H$44","v":{"v":0,"d":"0.00"}},"Resturlaub",{"$f":"$B$6-$D$6","v":{"v":30,"d":"30.00"}}]
["Saldovortrag",{"$f":"Sep.!$F$7","v":{"v":0,"d":"0.00"}},"Saldoänderung",{"$f":"$P$41","v":{"v":0,"d":"0.00"}},"Kumulierter Saldo",{"$f":"$B$7+$D$7","v":{"v":0,"d":"0.00"}}]
[]
{"$rows_left_out":46}
{"sheet":"Nov.","index":15,"n_rows":52,"n_cols":23,"rows_kept":52}
[]
[]
[]
[]
[]
["Urlaubsvortrag",{"$f":"Okt.!$F$6","v":{"v":30,"d":"30.00"}},"Urlaub genommen",{"$f":"$H$43","v":{"v":0,"d":"0.00"}},"Resturlaub",{"$f":"$B$6-$D$6","v":{"v":30,"d":"30.00"}}]
["Saldovortrag",{"$f":"Okt.!$F$7","v":{"v":0,"d":"0.00"}},"Saldoänderung",{"$f":"$P$40","v":{"v":0,"d":"0.00"}},"Kumulierter Saldo",{"$f":"$B$7+$D$7","v":{"v":0,"d":"0.00"}}]
[]
{"$rows_left_out":45}
{"sheet":"Dez.","index":16,"n_rows":53,"n_cols":23,"rows_kept":53}
[]
[]
[]
[]
[]
["Urlaubsvortrag",{"$f":"Nov.!$F$6","v":{"v":30,"d":"30.00"}},"Urlaub genommen",{"$f":"$H$44","v":{"v":0,"d":"0.00"}},"Resturlaub",{"$f":"$B$6-$D$6","v":{"v":30,"d":"30.00"}}]
["Saldovortrag",{"$f":"Nov.!$F$7","v":{"v":0,"d":"0.00"}},"Saldoänderung",{"$f":"$P$41","v":{"v":0,"d":"0.00"}},"Kumulierter Saldo",{"$f":"$B$7+$D$7","v":{"v":0,"d":"0.00"}}]
[]
{"$rows_left_out":45}