{"text_format":"3","workbook":"xlsx","n_sheets":17,"sheets":["Allgemein","Personalstamm","Zeitkonten","Fehlzeiten","Kalendarium","Jan.","Feb.","Mrz.","Apr.","Mai","Jun.","Jul.","Aug.","Sep.","Okt.","Nov.","Dez."],"not_rendered":{"images":5},"read":"whole","date_system":"1900"}

{"sheet":"Allgemein","index":0,"n_rows":64,"n_cols":42,"rows_kept":64,"merged":[[5,0,5,4],[5,6,5,8],[18,0,18,2],[46,6,46,9],[59,6,59,7]]}
[]
[]
[]
[]
[]
["Allgemein",{"$nulls":5},"Feiertage",{"$nulls":4},{"v":1,"d":"01"},{"v":2,"d":"02"},{"v":3,"d":"03"},{"v":4,"d":"04"},{"v":5,"d":"05"},{"v":6,"d":"06"},{"v":7,"d":"07"},{"v":8,"d":"08"},{"v":9,"d":"09"},10,11,12,13,14,15,16,17,18,19,20,21,22,23,24,25,26,27,28,29,30,31]
["Beschäftigungsart","Funktion","Firma","Werk","Abteilung",null,"Bezeichnung","Datum","Anteil Tag",null,"2023-01-01",{"$f":"IF(Jan.!$C10=\"Anwesenheit\",Allgemein!$H$62,IF(Jan.!$C10=\"Fehlzeit\",VLOOKUP(Jan.!$M10,Allgemein!$I$50:$J$58,2,FALSE),IF(Jan.!$C10=\"Wochenende\",VLOOKUP(Jan.!$B10,Allgemein!$G$63:$H$64,2,FALSE),\"\")))","v":"F"},{"$f":"IF(Jan.!$C11=\"Anwesenheit\",Allgemein!$H$62,IF(Jan.!$C11=\"Fehlzeit\",VLOOKUP(Jan.!$M11,Allgemein!$I$50:$J$58,2,FALSE),IF(Jan.!$C11=\"Wochenende\",VLOOKUP(Jan.!$B11,Allgemein!$G$63:$H$64,2,FALSE),\"\")))","v":""},{"$f":"IF(Jan.!$C12=\"Anwesenheit\",Allgemein!$H$62,IF(Jan.!$C12=\"Fehlzeit\",VLOOKUP(Jan.!$M12,Allgemein!$I$50:$J$58,2,FALSE),IF(Jan.!$C12=\"Wochenende\",VLOOKUP(Jan.!$B12,Allgemein!$G$63:$H$64,2,FALSE),\"\")))","v":":"},{"$f":"IF(Jan.!$C13=\"Anwesenheit\",Allgemein!$H$62,IF(Jan.!$C13=\"Fehlzeit\",VLOOKUP(Jan.!$M13,Allgemein!$I$50:$J$58,2,FALSE),IF(Jan.!$C13=\"Wochenende\",VLOOKUP(Jan.!$B13,Allgemein!$G$63:$H$64,2,FALSE),\"\")))","v":"#"},{"$f":"IF(Jan.!$C14=\"Anwesenheit\",Allgemein!$H$62,IF(Jan.!$C14=\"Fehlzeit\",VLOOKUP(Jan.!$M14,Allgemein!$I$50:$J$58,2,FALSE),IF(Jan.!$C14=\"Wochenende\",VLOOKUP(Jan.!$B14,Allgemein!$G$63:$H$64,2,FALSE),\"\")))","v":""},{"$f":"IF(Jan.!$C15=\"Anwesenheit\",Allgemein!$H$62,IF(Jan.!$C15=\"Fehlzeit\",VLOOKUP(Jan.!$M15,Allgemein!$I$50:$J$58,2,FALSE),IF(Jan.!$C15=\"Wochenende\",VLOOKUP(Jan.!$B15,Allgemein!$G$63:$H$64,2,FALSE),\"\")))","v":"F"},{"$f":"IF(Jan.!$C16=\"Anwesenheit\",Allgemein!$H$62,IF(Jan.!$C16=\"Fehlzeit\",VLOOKUP(Jan.!$M16,Allgemein!$I$50:$J$58,2,FALSE),IF(Jan.!$C16=\"Wochenende\",VLOOKUP(Jan.!$B16,Allgemein!$G$63:$H$64,2,FALSE),\"\")))","v":""},{"$f":"IF(Jan.!$C17=\"Anwesenheit\",Allgemein!$H$62,IF(Jan.!$C17=\"Fehlzeit\",VLOOKUP(Jan.!$M17,Allgemein!$I$50:$J$58,2,FALSE),IF(Jan.!$C17=\"Wochenende\",VLOOKUP(Jan.!$B17,Allgemein!$G$63:$H$64,2,FALSE),\"\")))","v":""},{"$f":"IF(Jan.!$C18=\"Anwesenheit\",Allgemein!$H$62,IF(Jan.!$C18=\"Fehlzeit\",VLOOKUP(Jan.!$M18,Allgemein!$I$50:$J$58,2,FALSE),IF(Jan.!$C18=\"Wochenende\",VLOOKUP(Jan.!$B18,Allgemein!$G$63:$H$64,2,FALSE),\"\")))","v":""},{"$f":"IF(Jan.!$C19=\"Anwesenheit\",Allgemein!$H$62,IF(Jan.!$C19=\"Fehlzeit\",VLOOKUP(Jan.!$M19,Allgemein!$I$50:$J$58,2,FALSE),IF(Jan.!$C19=\"Wochenende\",VLOOKUP(Jan.!$B19,Allgemein!$G$63:$H$64,2,FALSE),\"\")))","v":":"},{"$f":"IF(Jan.!$C20=\"Anwesenheit\",Allgemein!$H$62,IF(Jan.!$C20=\"Fehlzeit\",VLOOKUP(Jan.!$M20,Allgemein!$I$50:$J$58,2,FALSE),IF(Jan.!$C20=\"Wochenende\",VLOOKUP(Jan.!$B20,Allgemein!$G$63:$H$64,2,FALSE),\"\")))","v":"#"},{"$f":"IF(Jan.!$C21=\"Anwesenheit\",Allgemein!$H$62,IF(Jan.!$C21=\"Fehlzeit\",VLOOKUP(Jan.!$M21,Allgemein!$I$50:$J$58,2,FALSE),IF(Jan.!$C21=\"Wochenende\",VLOOKUP(Jan.!$B21,Allgemein!$G$63:$H$64,2,FALSE),\"\")))","v":""},{"$f":"IF(Jan.!$C22=\"Anwesenheit\",Allgemein!$H$62,IF(Jan.!$C22=\"Fehlzeit\",VLOOKUP(Jan.!$M22,Allgemein!$I$50:$J$58,2,FALSE),IF(Jan.!$C22=\"Wochenende\",VLOOKUP(Jan.!$B22,Allgemein!$G$63:$H$64,2,FALSE),\"\")))","v":""},{"$f":"IF(Jan.!$C23=\"Anwesenheit\",Allgemein!$H$62,IF(Jan.!$C23=\"Fehlzeit\",VLOOKUP(Jan.!$M23,Allgemein!$I$50:$J$58,2,FALSE),IF(Jan.!$C23=\"Wochenende\",VLOOKUP(Jan.!$B23,Allgemein!$G$63:$H$64,2,FALSE),\"\")))","v":""},{"$f":"IF(Jan.!$C24=\"Anwesenheit\",Allgemein!$H$62,IF(Jan.!$C24=\"Fehlzeit\",VLOOKUP(Jan.!$M24,Allgemein!$I$50:$J$58,2,FALSE),IF(Jan.!$C24=\"Wochenende\",VLOOKUP(Jan.!$B24,Allgemein!$G$63:$H$64,2,FALSE),\"\")))","v":""},{"$f":"IF(Jan.!$C25=\"Anwesenheit\",Allgemein!$H$62,IF(Jan.!$C25=\"Fehlzeit\",VLOOKUP(Jan.!$M25,Allgemein!$I$50:$J$58,2,FALSE),IF(Jan.!$C25=\"Wochenende\",VLOOKUP(Jan.!$B25,Allgemein!$G$63:$H$64,2,FALSE),\"\")))","v":""},{"$f":"IF(Jan.!$C26=\"Anwesenheit\",Allgemein!$H$62,IF(Jan.!$C26=\"Fehlzeit\",VLOOKUP(Jan.!$M26,Allgemein!$I$50:$J$58,2,FALSE),IF(Jan.!$C26=\"Wochenende\",VLOOKUP(Jan.!$B26,Allgemein!$G$63:$H$64,2,FALSE),\"\")))","v":":"},{"$f":"IF(Jan.!$C27=\"Anwesenheit\",Allgemein!$H$62,IF(Jan.!$C27=\"Fehlzeit\",VLOOKUP(Jan.!$M27,Allgemein!$I$50:$J$58,2,FALSE),IF(Jan.!$C27=\"Wochenende\",VLOOKUP(Jan.!$B27,Allgemein!$G$63:$H$64,2,FALSE),\"\")))","v":"#"},{"$f":"IF(Jan.!$C28=\"Anwesenheit\",Allgemein!$H$62,IF(Jan.!$C28=\"Fehlzeit\",VLOOKUP(Jan.!$M28,Allgemein!$I$50:$J$58,2,FALSE),IF(Jan.!$C28=\"Wochenende\",VLOOKUP(Jan.!$B28,Allgemein!$G$63:$H$64,2,FALSE),\"\")))","v":""},{"$f":"IF(Jan.!$C29=\"Anwesenheit\",Allgemein!$H$62,IF(Jan.!$C29=\"Fehlzeit\",VLOOKUP(Jan.!$M29,Allgemein!$I$50:$J$58,2,FALSE),IF(Jan.!$C29=\"Wochenende\",VLOOKUP(Jan.!$B29,Allgemein!$G$63:$H$64,2,FALSE),\"\")))","v":""},{"$f":"IF(Jan.!$C30=\"Anwesenheit\",Allgemein!$H$62,IF(Jan.!$C30=\"Fehlzeit\",VLOOKUP(Jan.!$M30,Allgemein!$I$50:$J$58,2,FALSE),IF(Jan.!$C30=\"Wochenende\",VLOOKUP(Jan.!$B30,Allgemein!$G$63:$H$64,2,FALSE),\"\")))","v":""},{"$f":"IF(Jan.!$C31=\"Anwesenheit\",Allgemein!$H$62,IF(Jan.!$C31=\"Fehlzeit\",VLOOKUP(Jan.!$M31,Allgemein!$I$50:$J$58,2,FALSE),IF(Jan.!$C31=\"Wochenende\",VLOOKUP(Jan.!$B31,Allgemein!$G$63:$H$64,2,FALSE),\"\")))","v":""},{"$f":"IF(Jan.!$C32=\"Anwesenheit\",Allgemein!$H$62,IF(Jan.!$C32=\"Fehlzeit\",VLOOKUP(Jan.!$M32,Allgemein!$I$50:$J$58,2,FALSE),IF(Jan.!$C32=\"Wochenende\",VLOOKUP(Jan.!$B32,Allgemein!$G$63:$H$64,2,FALSE),\"\")))","v":""},{"$f":"IF(Jan.!$C33=\"Anwesenheit\",Allgemein!$H$62,IF(Jan.!$C33=\"Fehlzeit\",VLOOKUP(Jan.!$M33,Allgemein!$I$50:$J$58,2,FALSE),IF(Jan.!$C33=\"Wochenende\",VLOOKUP(Jan.!$B33,Allgemein!$G$63:$H$64,2,FALSE),\"\")))","v":":"},{"$f":"IF(Jan.!$C34=\"Anwesenheit\",Allgemein!$H$62,IF(Jan.!$C34=\"Fehlzeit\",VLOOKUP(Jan.!$M34,Allgemein!$I$50:$J$58,2,FALSE),IF(Jan.!$C34=\"Wochenende\",VLOOKUP(Jan.!$B34,Allgemein!$G$63:$H$64,2,FALSE),\"\")))","v":"#"},{"$f":"IF(Jan.!$C35=\"Anwesenheit\",Allgemein!$H$62,IF(Jan.!$C35=\"Fehlzeit\",VLOOKUP(Jan.!$M35,Allgemein!$I$50:$J$58,2,FALSE),IF(Jan.!$C35=\"Wochenende\",VLOOKUP(Jan.!$B35,Allgemein!$G$63:$H$64,2,FALSE),\"\")))","v":""},{"$f":"IF(Jan.!$C36=\"Anwesenheit\",Allgemein!$H$62,IF(Jan.!$C36=\"Fehlzeit\",VLOOKUP(Jan.!$M36,Allgemein!$I$50:$J$58,2,FALSE),IF(Jan.!$C36=\"Wochenende\",VLOOKUP(Jan.!$B36,Allgemein!$G$63:$H$64,2,FALSE),\"\")))","v":""},{"$f":"IF(Jan.!$C37=\"Anwesenheit\",Allgemein!$H$62,IF(Jan.!$C37=\"Fehlzeit\",VLOOKUP(Jan.!$M37,Allgemein!$I$50:$J$58,2,FALSE),IF(Jan.!$C37=\"Wochenende\",VLOOKUP(Jan.!$B37,Allgemein!$G$63:$H$64,2,FALSE),\"\")))","v":""},{"$f":"IF(Jan.!$C38=\"Anwesenheit\",Allgemein!$H$62,IF(Jan.!$C38=\"Fehlzeit\",VLOOKUP(Jan.!$M38,Allgemein!$I$50:$J$58,2,FALSE),IF(Jan.!$C38=\"Wochenende\",VLOOKUP(Jan.!$B38,Allgemein!$G$63:$H$64,2,FALSE),\"\")))","v":""},{"$f":"IF(Jan.!$C39=\"Anwesenheit\",Allgemein!$H$62,IF(Jan.!$C39=\"Fehlzeit\",VLOOKUP(Jan.!$M39,Allgemein!$I$50:$J$58,2,FALSE),IF(Jan.!$C39=\"Wochenende\",VLOOKUP(Jan.!$B39,Allgemein!$G$63:$H$64,2,FALSE),\"\")))","v":""},{"$f":"IF(Jan.!$C40=\"Anwesenheit\",Allgemein!$H$62,IF(Jan.!$C40=\"Fehlzeit\",VLOOKUP(Jan.!$M40,Allgemein!$I$50:$J$58,2,FALSE),IF(Jan.!$C40=\"Wochenende\",VLOOKUP(Jan.!$B40,Allgemein!$G$63:$H$64,2,FALSE),\"\")))","v":":"}]
["Bitte auswählen","Bitte auswählen","Bitte auswählen","Bitte auswählen","Bitte auswählen",null,"Neujahr","2026-01-01",{"v":1,"d":"1.00"},null,"2023-02-01",{"$f":"IF(Feb.!$C10=\"Anwesenheit\",Allgemein!$H$62,IF(Feb.!$C10=\"Fehlzeit\",VLOOKUP(Feb.!$M10,Allgemein!$I$50:$J$58,2,FALSE),IF(Feb.!$C10=\"Wochenende\",VLOOKUP(Feb.!$B10,Allgemein!$G$63:$H$64,2,FALSE),\"\")))","v":"#"},{"$f":"IF(Feb.!$C11=\"Anwesenheit\",Allgemein!$H$62,IF(Feb.!$C11=\"Fehlzeit\",VLOOKUP(Feb.!$M11,Allgemein!$I$50:$J$58,2,FALSE),IF(Feb.!$C11=\"Wochenende\",VLOOKUP(Feb.!$B11,Allgemein!$G$63:$H$64,2,FALSE),\"\")))","v":""},{"$f":"IF(Feb.!$C12=\"Anwesenheit\",Allgemein!$H$62,IF(Feb.!$C12=\"Fehlzeit\",VLOOKUP(Feb.!$M12,Allgemein!$I$50:$J$58,2,FALSE),IF(Feb.!$C12=\"Wochenende\",VLOOKUP(Feb.!$B12,Allgemein!$G$63:$H$64,2,FALSE),\"\")))","v":""},{"$f":"IF(Feb.!$C13=\"Anwesenheit\",Allgemein!$H$62,IF(Feb.!$C13=\"Fehlzeit\",VLOOKUP(Feb.!$M13,Allgemein!$I$50:$J$58,2,FALSE),IF(Feb.!$C13=\"Wochenende\",VLOOKUP(Feb.!$B13,Allgemein!$G$63:$H$64,2,FALSE),\"\")))","v":""},{"$f":"IF(Feb.!$C14=\"Anwesenheit\",Allgemein!$H$62,IF(Feb.!$C14=\"Fehlzeit\",VLOOKUP(Feb.!$M14,Allgemein!$I$50:$J$58,2,FALSE),IF(Feb.!$C14=\"Wochenende\",VLOOKUP(Feb.!$B14,Allgemein!$G$63:$H$64,2,FALSE),\"\")))","v":""},{"$f":"IF(Feb.!$C15=\"Anwesenheit\",Allgemein!$H$62,IF(Feb.!$C15=\"Fehlzeit\",VLOOKUP(Feb.!$M15,Allgemein!$I$50:$J$58,2,FALSE),IF(Feb.!$C15=\"Wochenende\",VLOOKUP(Feb.!$B15,Allgemein!$G$63:$H$64,2,FALSE),\"\")))","v":""},{"$f":"IF(Feb.!$C16=\"Anwesenheit\",Allgemein!$H$62,IF(Feb.!$C16=\"Fehlzeit\",VLOOKUP(Feb.!$M16,Allgemein!$I$50:$J$58,2,FALSE),IF(Feb.!$C16=\"Wochenende\",VLOOKUP(Feb.!$B16,Allgemein!$G$63:$H$64,2,FALSE),\"\")))","v":":"},{"$f":"IF(Feb.!$C17=\"Anwesenheit\",Allgemein!$H$62,IF(Feb.!$C17=\"Fehlzeit\",VLOOKUP(Feb.!$M17,Allgemein!$I$50:$J$58,2,FALSE),IF(Feb.!$C17=\"Wochenende\",VLOOKUP(Feb.!$B17,Allgemein!$G$63:$H$64,2,FALSE),\"\")))","v":"#"},{"$f":"IF(Feb.!$C18=\"Anwesenheit\",Allgemein!$H$62,IF(Feb.!$C18=\"Fehlzeit\",VLOOKUP(Feb.!$M18,Allgemein!$I$50:$J$58,2,FALSE),IF(Feb.!$C18=\"Wochenende\",VLOOKUP(Feb.!$B18,Allgemein!$G$63:$H$64,2,FALSE),\"\")))","v":""},{"$f":"IF(Feb.!$C19=\"Anwesenheit\",Allgemein!$H$62,IF(Feb.!$C19=\"Fehlzeit\",VLOOKUP(Feb.!$M19,Allgemein!$I$50:$J$58,2,FALSE),IF(Feb.!$C19=\"Wochenende\",VLOOKUP(Feb.!$B19,Allgemein!$G$63:$H$64,2,FALSE),\"\")))","v":""},{"$f":"IF(Feb.!$C20=\"Anwesenheit\",Allgemein!$H$62,IF(Feb.!$C20=\"Fehlzeit\",VLOOKUP(Feb.!$M20,Allgemein!$I$50:$J$58,2,FALSE),IF(Feb.!$C20=\"Wochenende\",VLOOKUP(Feb.!$B20,Allgemein!$G$63:$H$64,2,FALSE),\"\")))","v":""},{"$f":"IF(Feb.!$C21=\"Anwesenheit\",Allgemein!$H$62,IF(Feb.!$C21=\"Fehlzeit\",VLOOKUP(Feb.!$M21,Allgemein!$I$50:$J$58,2,FALSE),IF(Feb.!$C21=\"Wochenende\",VLOOKUP(Feb.!$B21,Allgemein!$G$63:$H$64,2,FALSE),\"\")))","v":""},{"$f":"IF(Feb.!$C22=\"Anwesenheit\",Allgemein!$H$62,IF(Feb.!$C22=\"Fehlzeit\",VLOOKUP(Feb.!$M22,Allgemein!$I$50:$J$58,2,FALSE),IF(Feb.!$C22=\"Wochenende\",VLOOKUP(Feb.!$B22,Allgemein!$G$63:$H$64,2,FALSE),\"\")))","v":""},{"$f":"IF(Feb.!$C23=\"Anwesenheit\",Allgemein!$H$62,IF(Feb.!$C23=\"Fehlzeit\",VLOOKUP(Feb.!$M23,Allgemein!$I$50:$J$58,2,FALSE),IF(Feb.!$C23=\"Wochenende\",VLOOKUP(Feb.!$B23,Allgemein!$G$63:$H$64,2,FALSE),\"\")))","v":":"},{"$f":"IF(Feb.!$C24=\"Anwesenheit\",Allgemein!$H$62,IF(Feb.!$C24=\"Fehlzeit\",VLOOKUP(Feb.!$M24,Allgemein!$I$50:$J$58,2,FALSE),IF(Feb.!$C24=\"Wochenende\",VLOOKUP(Feb.!$B24,Allgemein!$G$63:$H$64,2,FALSE),\"\")))","v":"#"},{"$f":"IF(Feb.!$C25=\"Anwesenheit\",Allgemein!$H$62,IF(Feb.!$C25=\"Fehlzeit\",VLOOKUP(Feb.!$M25,Allgemein!$I$50:$J$58,2,FALSE),IF(Feb.!$C25=\"Wochenende\",VLOOKUP(Feb.!$B25,Allgemein!$G$63:$H$64,2,FALSE),\"\")))","v":""},{"$f":"IF(Feb.!$C26=\"Anwesenheit\",Allgemein!$H$62,IF(Feb.!$C26=\"Fehlzeit\",VLOOKUP(Feb.!$M26,Allgemein!$I$50:$J$58,2,FALSE),IF(Feb.!$C26=\"Wochenende\",VLOOKUP(Feb.!$B26,Allgemein!$G$63:$H$64,2,FALSE),\"\")))","v":""},{"$f":"IF(Feb.!$C27=\"Anwesenheit\",Allgemein!$H$62,IF(Feb.!$C27=\"Fehlzeit\",VLOOKUP(Feb.!$M27,Allgemein!$I$50:$J$58,2,FALSE),IF(Feb.!$C27=\"Wochenende\",VLOOKUP(Feb.!$B27,Allgemein!$G$63:$H$64,2,FALSE),\"\")))","v":""},{"$f":"IF(Feb.!$C28=\"Anwesenheit\",Allgemein!$H$62,IF(Feb.!$C28=\"Fehlzeit\",VLOOKUP(Feb.!$M28,Allgemein!$I$50:$J$58,2,FALSE),IF(Feb.!$C28=\"Wochenende\",VLOOKUP(Feb.!$B28,Allgemein!$G$63:$H$64,2,FALSE),\"\")))","v":""},{"$f":"IF(Feb.!$C29=\"Anwesenheit\",Allgemein!$H$62,IF(Feb.!$C29=\"Fehlzeit\",VLOOKUP(Feb.!$M29,Allgemein!$I$50:$J$58,2,FALSE),IF(Feb.!$C29=\"Wochenende\",VLOOKUP(Feb.!$B29,Allgemein!$G$63:$H$64,2,FALSE),\"\")))","v":""},{"$f":"IF(Feb.!$C30=\"Anwesenheit\",Allgemein!$H$62,IF(Feb.!$C30=\"Fehlzeit\",VLOOKUP(Feb.!$M30,Allgemein!$I$50:$J$58,2,FALSE),IF(Feb.!$C30=\"Wochenende\",VLOOKUP(Feb.!$B30,Allgemein!$G$63:$H$64,2,FALSE),\"\")))","v":":"},{"$f":"IF(Feb.!$C31=\"Anwesenheit\",Allgemein!$H$62,IF(Feb.!$C31=\"Fehlzeit\",VLOOKUP(Feb.!$M31,Allgemein!$I$50:$J$58,2,FALSE),IF(Feb.!$C31=\"Wochenende\",VLOOKUP(Feb.!$B31,Allgemein!$G$63:$H$64,2,FALSE),\"\")))","v":"#"},{"$f":"IF(Feb.!$C32=\"Anwesenheit\",Allgemein!$H$62,IF(Feb.!$C32=\"Fehlzeit\",VLOOKUP(Feb.!$M32,Allgemein!$I$50:$J$58,2,FALSE),IF(Feb.!$C32=\"Wochenende\",VLOOKUP(Feb.!$B32,Allgemein!$G$63:$H$64,2,FALSE),\"\")))","v":""},{"$f":"IF(Feb.!$C33=\"Anwesenheit\",Allgemein!$H$62,IF(Feb.!$C33=\"Fehlzeit\",VLOOKUP(Feb.!$M33,Allgemein!$I$50:$J$58,2,FALSE),IF(Feb.!$C33=\"Wochenende\",VLOOKUP(Feb.!$B33,Allgemein!$G$63:$H$64,2,FALSE),\"\")))","v":""},{"$f":"IF(Feb.!$C34=\"Anwesenheit\",Allgemein!$H$62,IF(Feb.!$C34=\"Fehlzeit\",VLOOKUP(Feb.!$M34,Allgemein!$I$50:$J$58,2,FALSE),IF(Feb.!$C34=\"Wochenende\",VLOOKUP(Feb.!$B34,Allgemein!$G$63:$H$64,2,FALSE),\"\")))","v":""},{"$f":"IF(Feb.!$C35=\"Anwesenheit\",Allgemein!$H$62,IF(Feb.!$C35=\"Fehlzeit\",VLOOKUP(Feb.!$M35,Allgemein!$I$50:$J$58,2,FALSE),IF(Feb.!$C35=\"Wochenende\",VLOOKUP(Feb.!$B35,Allgemein!$G$63:$H$64,2,FALSE),\"\")))","v":""},{"$f":"IF(Feb.!$C36=\"Anwesenheit\",Allgemein!$H$62,IF(Feb.!$C36=\"Fehlzeit\",VLOOKUP(Feb.!$M36,Allgemein!$I$50:$J$58,2,FALSE),IF(Feb.!$C36=\"Wochenende\",VLOOKUP(Feb.!$B36,Allgemein!$G$63:$H$64,2,FALSE),\"\")))","v":""},{"$f":"IF(Feb.!$C37=\"Anwesenheit\",Allgemein!$H$62,IF(Feb.!$C37=\"Fehlzeit\",VLOOKUP(Feb.!$M37,Allgemein!$I$50:$J$58,2,FALSE),IF(Feb.!$C37=\"Wochenende\",VLOOKUP(Feb.!$B37,Allgemein!$G$63:$H$64,2,FALSE),\"\")))","v":":"}]
["Gew./Vollzeit","Mitarbeiter","digital ZEIT GmbH","Neu-Ulm","Entwicklung",null,"Heilige drei Könige","2026-01-06",{"v":1,"d":"1.00"},null,"2023-03-01",{"$f":"IF(Mrz.!$C10=\"Anwesenheit\",Allgemein!$H$62,IF(Mrz.!$C10=\"Fehlzeit\",VLOOKUP(Mrz.!$M10,Allgemein!$I$50:$J$58,2,FALSE),IF(Mrz.!$C10=\"Wochenende\",VLOOKUP(Mrz.!$B10,Allgemein!$G$63:$H$64,2,FALSE),\"\")))","v":"#"},{"$f":"IF(Mrz.!$C11=\"Anwesenheit\",Allgemein!$H$62,IF(Mrz.!$C11=\"Fehlzeit\",VLOOKUP(Mrz.!$M11,Allgemein!$I$50:$J$58,2,FALSE),IF(Mrz.!$C11=\"Wochenende\",VLOOKUP(Mrz.!$B11,Allgemein!$G$63:$H$64,2,FALSE),\"\")))","v":""},{"$f":"IF(Mrz.!$C12=\"Anwesenheit\",Allgemein!$H$62,IF(Mrz.!$C12=\"Fehlzeit\",VLOOKUP(Mrz.!$M12,Allgemein!$I$50:$J$58,2,FALSE),IF(Mrz.!$C12=\"Wochenende\",VLOOKUP(Mrz.!$B12,Allgemein!$G$63:$H$64,2,FALSE),\"\")))","v":""},{"$f":"IF(Mrz.!$C13=\"Anwesenheit\",Allgemein!$H$62,IF(Mrz.!$C13=\"Fehlzeit\",VLOOKUP(Mrz.!$M13,Allgemein!$I$50:$J$58,2,FALSE),IF(Mrz.!$C13=\"Wochenende\",VLOOKUP(Mrz.!$B13,Allgemein!$G$63:$H$64,2,FALSE),\"\")))","v":""},{"$f":"IF(Mrz.!$C14=\"Anwesenheit\",Allgemein!$H$62,IF(Mrz.!$C14=\"Fehlzeit\",VLOOKUP(Mrz.!$M14,Allgemein!$I$50:$J$58,2,FALSE),IF(Mrz.!$C14=\"Wochenende\",VLOOKUP(Mrz.!$B14,Allgemein!$G$63:$H$64,2,FALSE),\"\")))","v":""},{"$f":"IF(Mrz.!$C15=\"Anwesenheit\",Allgemein!$H$62,IF(Mrz.!$C15=\"Fehlzeit\",VLOOKUP(Mrz.!$M15,Allgemein!$I$50:$J$58,2,FALSE),IF(Mrz.!$C15=\"Wochenende\",VLOOKUP(Mrz.!$B15,Allgemein!$G$63:$H$64,2,FALSE),\"\")))","v":""},{"$f":"IF(Mrz.!$C16=\"Anwesenheit\",Allgemein!$H$62,IF(Mrz.!$C16=\"Fehlzeit\",VLOOKUP(Mrz.!$M16,Allgemein!$I$50:$J$58,2,FALSE),IF(Mrz.!$C16=\"Wochenende\",VLOOKUP(Mrz.!$B16,Allgemein!$G$63:$H$64,2,FALSE),\"\")))","v":":"},{"$f":"IF(Mrz.!$C17=\"Anwesenheit\",Allgemein!$H$62,IF(Mrz.!$C17=\"Fehlzeit\",VLOOKUP(Mrz.!$M17,Allgemein!$I$50:$J$58,2,FALSE),IF(Mrz.!$C17=\"Wochenende\",VLOOKUP(Mrz.!$B17,Allgemein!$G$63:$H$64,2,FALSE),\"\")))","v":"#"},{"$f":"IF(Mrz.!$C18=\"Anwesenheit\",Allgemein!$H$62,IF(Mrz.!$C18=\"Fehlzeit\",VLOOKUP(Mrz.!$M18,Allgemein!$I$50:$J$58,2,FALSE),IF(Mrz.!$C18=\"Wochenende\",VLOOKUP(Mrz.!$B18,Allgemein!$G$63:$H$64,2,FALSE),\"\")))","v":""},{"$f":"IF(Mrz.!$C19=\"Anwesenheit\",Allgemein!$H$62,IF(Mrz.!$C19=\"Fehlzeit\",VLOOKUP(Mrz.!$M19,Allgemein!$I$50:$J$58,2,FALSE),IF(Mrz.!$C19=\"Wochenende\",VLOOKUP(Mrz.!$B19,Allgemein!$G$63:$H$64,2,FALSE),\"\")))","v":""},{"$f":"IF(Mrz.!$C20=\"Anwesenheit\",Allgemein!$H$62,IF(Mrz.!$C20=\"Fehlzeit\",VLOOKUP(Mrz.!$M20,Allgemein!$I$50:$J$58,2,FALSE),IF(Mrz.!$C20=\"Wochenende\",VLOOKUP(Mrz.!$B20,Allgemein!$G$63:$H$64,2,FALSE),\"\")))","v":""},{"$f":"IF(Mrz.!$C21=\"Anwesenheit\",Allgemein!$H$62,IF(Mrz.!$C21=\"Fehlzeit\",VLOOKUP(Mrz.!$M21,Allgemein!$I$50:$J$58,2,FALSE),IF(Mrz.!$C21=\"Wochenende\",VLOOKUP(Mrz.!$B21,Allgemein!$G$63:$H$64,2,FALSE),\"\")))","v":""},{"$f":"IF(Mrz.!$C22=\"Anwesenheit\",Allgemein!$H$62,IF(Mrz.!$C22=\"Fehlzeit\",VLOOKUP(Mrz.!$M22,Allgemein!$I$50:$J$58,2,FALSE),IF(Mrz.!$C22=\"Wochenende\",VLOOKUP(Mrz.!$B22,Allgemein!$G$63:$H$64,2,FALSE),\"\")))","v":""},{"$f":"IF(Mrz.!$C23=\"Anwesenheit\",Allgemein!$H$62,IF(Mrz.!$C23=\"Fehlzeit\",VLOOKUP(Mrz.!$M23,Allgemein!$I$50:$J$58,2,FALSE),IF(Mrz.!$C23=\"Wochenende\",VLOOKUP(Mrz.!$B23,Allgemein!$G$63:$H$64,2,FALSE),\"\")))","v":":"},{"$f":"IF(Mrz.!$C24=\"Anwesenheit\",Allgemein!$H$62,IF(Mrz.!$C24=\"Fehlzeit\",VLOOKUP(Mrz.!$M24,Allgemein!$I$50:$J$58,2,FALSE),IF(Mrz.!$C24=\"Wochenende\",VLOOKUP(Mrz.!$B24,Allgemein!$G$63:$H$64,2,FALSE),\"\")))","v":"#"},{"$f":"IF(Mrz.!$C25=\"Anwesenheit\",Allgemein!$H$62,IF(Mrz.!$C25=\"Fehlzeit\",VLOOKUP(Mrz.!$M25,Allgemein!$I$50:$J$58,2,FALSE),IF(Mrz.!$C25=\"Wochenende\",VLOOKUP(Mrz.!$B25,Allgemein!$G$63:$H$64,2,FALSE),\"\")))","v":""},{"$f":"IF(Mrz.!$C26=\"Anwesenheit\",Allgemein!$H$62,IF(Mrz.!$C26=\"Fehlzeit\",VLOOKUP(Mrz.!$M26,Allgemein!$I$50:$J$58,2,FALSE),IF(Mrz.!$C26=\"Wochenende\",VLOOKUP(Mrz.!$B26,Allgemein!$G$63:$H$64,2,FALSE),\"\")))","v":""},{"$f":"IF(Mrz.!$C27=\"Anwesenheit\",Allgemein!$H$62,IF(Mrz.!$C27=\"Fehlzeit\",VLOOKUP(Mrz.!$M27,Allgemein!$I$50:$J$58,2,FALSE),IF(Mrz.!$C27=\"Wochenende\",VLOOKUP(Mrz.!$B27,Allgemein!$G$63:$H$64,2,FALSE),\"\")))","v":""},{"$f":"IF(Mrz.!$C28=\"Anwesenheit\",Allgemein!$H$62,IF(Mrz.!$C28=\"Fehlzeit\",VLOOKUP(Mrz.!$M28,Allgemein!$I$50:$J$58,2,FALSE),IF(Mrz.!$C28=\"Wochenende\",VLOOKUP(Mrz.!$B28,Allgemein!$G$63:$H$64,2,FALSE),\"\")))","v":""},{"$f":"IF(Mrz.!$C29=\"Anwesenheit\",Allgemein!$H$62,IF(Mrz.!$C29=\"Fehlzeit\",VLOOKUP(Mrz.!$M29,Allgemein!$I$50:$J$58,2,FALSE),IF(Mrz.!$C29=\"Wochenende\",VLOOKUP(Mrz.!$B29,Allgemein!$G$63:$H$64,2,FALSE),\"\")))","v":""},{"$f":"IF(Mrz.!$C30=\"Anwesenheit\",Allgemein!$H$62,IF(Mrz.!$C30=\"Fehlzeit\",VLOOKUP(Mrz.!$M30,Allgemein!$I$50:$J$58,2,FALSE),IF(Mrz.!$C30=\"Wochenende\",VLOOKUP(Mrz.!$B30,Allgemein!$G$63:$H$64,2,FALSE),\"\")))","v":":"},{"$f":"IF(Mrz.!$C31=\"Anwesenheit\",Allgemein!$H$62,IF(Mrz.!$C31=\"Fehlzeit\",VLOOKUP(Mrz.!$M31,Allgemein!$I$50:$J$58,2,FALSE),IF(Mrz.!$C31=\"Wochenende\",VLOOKUP(Mrz.!$B31,Allgemein!$G$63:$H$64,2,FALSE),\"\")))","v":"#"},{"$f":"IF(Mrz.!$C32=\"Anwesenheit\",Allgemein!$H$62,IF(Mrz.!$C32=\"Fehlzeit\",VLOOKUP(Mrz.!$M32,Allgemein!$I$50:$J$58,2,FALSE),IF(Mrz.!$C32=\"Wochenende\",VLOOKUP(Mrz.!$B32,Allgemein!$G$63:$H$64,2,FALSE),\"\")))","v":""},{"$f":"IF(Mrz.!$C33=\"Anwesenheit\",Allgemein!$H$62,IF(Mrz.!$C33=\"Fehlzeit\",VLOOKUP(Mrz.!$M33,Allgemein!$I$50:$J$58,2,FALSE),IF(Mrz.!$C33=\"Wochenende\",VLOOKUP(Mrz.!$B33,Allgemein!$G$63:$H$64,2,FALSE),\"\")))","v":""},{"$f":"IF(Mrz.!$C34=\"Anwesenheit\",Allgemein!$H$62,IF(Mrz.!$C34=\"Fehlzeit\",VLOOKUP(Mrz.!$M34,Allgemein!$I$50:$J$58,2,FALSE),IF(Mrz.!$C34=\"Wochenende\",VLOOKUP(Mrz.!$B34,Allgemein!$G$63:$H$64,2,FALSE),\"\")))","v":""},{"$f":"IF(Mrz.!$C35=\"Anwesenheit\",Allgemein!$H$62,IF(Mrz.!$C35=\"Fehlzeit\",VLOOKUP(Mrz.!$M35,Allgemein!$I$50:$J$58,2,FALSE),IF(Mrz.!$C35=\"Wochenende\",VLOOKUP(Mrz.!$B35,Allgemein!$G$63:$H$64,2,FALSE),\"\")))","v":""},{"$f":"IF(Mrz.!$C36=\"Anwesenheit\",Allgemein!$H$62,IF(Mrz.!$C36=\"Fehlzeit\",VLOOKUP(Mrz.!$M36,Allgemein!$I$50:$J$58,2,FALSE),IF(Mrz.!$C36=\"Wochenende\",VLOOKUP(Mrz.!$B36,Allgemein!$G$63:$H$64,2,FALSE),\"\")))","v":""},{"$f":"IF(Mrz.!$C37=\"Anwesenheit\",Allgemein!$H$62,IF(Mrz.!$C37=\"Fehlzeit\",VLOOKUP(Mrz.!$M37,Allgemein!$I$50:$J$58,2,FALSE),IF(Mrz.!$C37=\"Wochenende\",VLOOKUP(Mrz.!$B37,Allgemein!$G$63:$H$64,2,FALSE),\"\")))","v":":"},{"$f":"IF(Mrz.!$C38=\"Anwesenheit\",Allgemein!$H$62,IF(Mrz.!$C38=\"Fehlzeit\",VLOOKUP(Mrz.!$M38,Allgemein!$I$50:$J$58,2,FALSE),IF(Mrz.!$C38=\"Wochenende\",VLOOKUP(Mrz.!$B38,Allgemein!$G$63:$H$64,2,FALSE),\"\")))","v":"#"},{"$f":"IF(Mrz.!$C39=\"Anwesenheit\",Allgemein!$H$62,IF(Mrz.!$C39=\"Fehlzeit\",VLOOKUP(Mrz.!$M39,Allgemein!$I$50:$J$58,2,FALSE),IF(Mrz.!$C39=\"Wochenende\",VLOOKUP(Mrz.!$B39,Allgemein!$G$63:$H$64,2,FALSE),\"\")))","v":""},{"$f":"IF(Mrz.!$C40=\"Anwesenheit\",Allgemein!$H$62,IF(Mrz.!$C40=\"Fehlzeit\",VLOOKUP(Mrz.!$M40,Allgemein!$I$50:$J$58,2,FALSE),IF(Mrz.!$C40=\"Wochenende\",VLOOKUP(Mrz.!$B40,Allgemein!$G$63:$H$64,2,FALSE),\"\")))","v":""}]
["Gew./Teilzeit","Gruppenleiter","Musterfirma GmbH","Ulm","Service / Support",null,"Weiberfastnacht","2026-02-12",{"v":0,"d":"0.00"},null,"2023-04-01",{"$f":"IF(Apr.!$C10=\"Anwesenheit\",Allgemein!$H$62,IF(Apr.!$C10=\"Fehlzeit\",VLOOKUP(Apr.!$M10,Allgemein!$I$50:$J$58,2,FALSE),IF(Apr.!$C10=\"Wochenende\",VLOOKUP(Apr.!$B10,Allgemein!$G$63:$H$64,2,FALSE),\"\")))","v":""},{"$f":"IF(Apr.!$C11=\"Anwesenheit\",Allgemein!$H$62,IF(Apr.!$C11=\"Fehlzeit\",VLOOKUP(Apr.!$M11,Allgemein!$I$50:$J$58,2,FALSE),IF(Apr.!$C11=\"Wochenende\",VLOOKUP(Apr.!$B11,Allgemein!$G$63:$H$64,2,FALSE),\"\")))","v":""},{"$f":"IF(Apr.!$C12=\"Anwesenheit\",Allgemein!$H$62,IF(Apr.!$C12=\"Fehlzeit\",VLOOKUP(Apr.!$M12,Allgemein!$I$50:$J$58,2,FALSE),IF(Apr.!$C12=\"Wochenende\",VLOOKUP(Apr.!$B12,Allgemein!$G$63:$H$64,2,FALSE),\"\")))","v":"F"},{"$f":"IF(Apr.!$C13=\"Anwesenheit\",Allgemein!$H$62,IF(Apr.!$C13=\"Fehlzeit\",VLOOKUP(Apr.!$M13,Allgemein!$I$50:$J$58,2,FALSE),IF(Apr.!$C13=\"Wochenende\",VLOOKUP(Apr.!$B13,Allgemein!$G$63:$H$64,2,FALSE),\"\")))","v":":"},{"$f":"IF(Apr.!$C14=\"Anwesenheit\",Allgemein!$H$62,IF(Apr.!$C14=\"Fehlzeit\",VLOOKUP(Apr.!$M14,Allgemein!$I$50:$J$58,2,FALSE),IF(Apr.!$C14=\"Wochenende\",VLOOKUP(Apr.!$B14,Allgemein!$G$63:$H$64,2,FALSE),\"\")))","v":"F"},{"$f":"IF(Apr.!$C15=\"Anwesenheit\",Allgemein!$H$62,IF(Apr.!$C15=\"Fehlzeit\",VLOOKUP(Apr.!$M15,Allgemein!$I$50:$J$58,2,FALSE),IF(Apr.!$C15=\"Wochenende\",VLOOKUP(Apr.!$B15,Allgemein!$G$63:$H$64,2,FALSE),\"\")))","v":""},{"$f":"IF(Apr.!$C16=\"Anwesenheit\",Allgemein!$H$62,IF(Apr.!$C16=\"Fehlzeit\",VLOOKUP(Apr.!$M16,Allgemein!$I$50:$J$58,2,FALSE),IF(Apr.!$C16=\"Wochenende\",VLOOKUP(Apr.!$B16,Allgemein!$G$63:$H$64,2,FALSE),\"\")))","v":""},{"$f":"IF(Apr.!$C17=\"Anwesenheit\",Allgemein!$H$62,IF(Apr.!$C17=\"Fehlzeit\",VLOOKUP(Apr.!$M17,Allgemein!$I$50:$J$58,2,FALSE),IF(Apr.!$C17=\"Wochenende\",VLOOKUP(Apr.!$B17,Allgemein!$G$63:$H$64,2,FALSE),\"\")))","v":""},{"$f":"IF(Apr.!$C18=\"Anwesenheit\",Allgemein!$H$62,IF(Apr.!$C18=\"Fehlzeit\",VLOOKUP(Apr.!$M18,Allgemein!$I$50:$J$58,2,FALSE),IF(Apr.!$C18=\"Wochenende\",VLOOKUP(Apr.!$B18,Allgemein!$G$63:$H$64,2,FALSE),\"\")))","v":""},{"$f":"IF(Apr.!$C19=\"Anwesenheit\",Allgemein!$H$62,IF(Apr.!$C19=\"Fehlzeit\",VLOOKUP(Apr.!$M19,Allgemein!$I$50:$J$58,2,FALSE),IF(Apr.!$C19=\"Wochenende\",VLOOKUP(Apr.!$B19,Allgemein!$G$63:$H$64,2,FALSE),\"\")))","v":""},{"$f":"IF(Apr.!$C20=\"Anwesenheit\",Allgemein!$H$62,IF(Apr.!$C20=\"Fehlzeit\",VLOOKUP(Apr.!$M20,Allgemein!$I$50:$J$58,2,FALSE),IF(Apr.!$C20=\"Wochenende\",VLOOKUP(Apr.!$B20,Allgemein!$G$63:$H$64,2,FALSE),\"\")))","v":":"},{"$f":"IF(Apr.!$C21=\"Anwesenheit\",Allgemein!$H$62,IF(Apr.!$C21=\"Fehlzeit\",VLOOKUP(Apr.!$M21,Allgemein!$I$50:$J$58,2,FALSE),IF(Apr.!$C21=\"Wochenende\",VLOOKUP(Apr.!$B21,Allgemein!$G$63:$H$64,2,FALSE),\"\")))","v":"#"},{"$f":"IF(Apr.!$C22=\"Anwesenheit\",Allgemein!$H$62,IF(Apr.!$C22=\"Fehlzeit\",VLOOKUP(Apr.!$M22,Allgemein!$I$50:$J$58,2,FALSE),IF(Apr.!$C22=\"Wochenende\",VLOOKUP(Apr.!$B22,Allgemein!$G$63:$H$64,2,FALSE),\"\")))","v":""},{"$f":"IF(Apr.!$C23=\"Anwesenheit\",Allgemein!$H$62,IF(Apr.!$C23=\"Fehlzeit\",VLOOKUP(Apr.!$M23,Allgemein!$I$50:$J$58,2,FALSE),IF(Apr.!$C23=\"Wochenende\",VLOOKUP(Apr.!$B23,Allgemein!$G$63:$H$64,2,FALSE),\"\")))","v":""},{"$f":"IF(Apr.!$C24=\"Anwesenheit\",Allgemein!$H$62,IF(Apr.!$C24=\"Fehlzeit\",VLOOKUP(Apr.!$M24,Allgemein!$I$50:$J$58,2,FALSE),IF(Apr.!$C24=\"Wochenende\",VLOOKUP(Apr.!$B24,Allgemein!$G$63:$H$64,2,FALSE),\"\")))","v":""},{"$f":"IF(Apr.!$C25=\"Anwesenheit\",Allgemein!$H$62,IF(Apr.!$C25=\"Fehlzeit\",VLOOKUP(Apr.!$M25,Allgemein!$I$50:$J$58,2,FALSE),IF(Apr.!$C25=\"Wochenende\",VLOOKUP(Apr.!$B25,Allgemein!$G$63:$H$64,2,FALSE),\"\")))","v":""},{"$f":"IF(Apr.!$C26=\"Anwesenheit\",Allgemein!$H$62,IF(Apr.!$C26=\"Fehlzeit\",VLOOKUP(Apr.!$M26,Allgemein!$I$50:$J$58,2,FALSE),IF(Apr.!$C26=\"Wochenende\",VLOOKUP(Apr.!$B26,Allgemein!$G$63:$H$64,2,FALSE),\"\")))","v":""},{"$f":"IF(Apr.!$C27=\"Anwesenheit\",Allgemein!$H$62,IF(Apr.!$C27=\"Fehlzeit\",VLOOKUP(Apr.!$M27,Allgemein!$I$50:$J$58,2,FALSE),IF(Apr.!$C27=\"Wochenende\",VLOOKUP(Apr.!$B27,Allgemein!$G$63:$H$64,2,FALSE),\"\")))","v":":"},{"$f":"IF(Apr.!$C28=\"Anwesenheit\",Allgemein!$H$62,IF(Apr.!$C28=\"Fehlzeit\",VLOOKUP(Apr.!$M28,Allgemein!$I$50:$J$58,2,FALSE),IF(Apr.!$C28=\"Wochenende\",VLOOKUP(Apr.!$B28,Allgemein!$G$63:$H$64,2,FALSE),\"\")))","v":"#"},{"$f":"IF(Apr.!$C29=\"Anwesenheit\",Allgemein!$H$62,IF(Apr.!$C29=\"Fehlzeit\",VLOOKUP(Apr.!$M29,Allgemein!$I$50:$J$58,2,FALSE),IF(Apr.!$C29=\"Wochenende\",VLOOKUP(Apr.!$B29,Allgemein!$G$63:$H$64,2,FALSE),\"\")))","v":""},{"$f":"IF(Apr.!$C30=\"Anwesenheit\",Allgemein!$H$62,IF(Apr.!$C30=\"Fehlzeit\",VLOOKUP(Apr.!$M30,Allgemein!$I$50:$J$58,2,FALSE),IF(Apr.!$C30=\"Wochenende\",VLOOKUP(Apr.!$B30,Allgemein!$G$63:$H$64,2,FALSE),\"\")))","v":""},{"$f":"IF(Apr.!$C31=\"Anwesenheit\",Allgemein!$H$62,IF(Apr.!$C31=\"Fehlzeit\",VLOOKUP(Apr.!$M31,Allgemein!$I$50:$J$58,2,FALSE),IF(Apr.!$C31=\"Wochenende\",VLOOKUP(Apr.!$B31,Allgemein!$G$63:$H$64,2,FALSE),\"\")))","v":""},{"$f":"IF(Apr.!$C32=\"Anwesenheit\",Allgemein!$H$62,IF(Apr.!$C32=\"Fehlzeit\",VLOOKUP(Apr.!$M32,Allgemein!$I$50:$J$58,2,FALSE),IF(Apr.!$C32=\"Wochenende\",VLOOKUP(Apr.!$B32,Allgemein!$G$63:$H$64,2,FALSE),\"\")))","v":""},{"$f":"IF(Apr.!$C33=\"Anwesenheit\",Allgemein!$H$62,IF(Apr.!$C33=\"Fehlzeit\",VLOOKUP(Apr.!$M33,Allgemein!$I$50:$J$58,2,FALSE),IF(Apr.!$C33=\"Wochenende\",VLOOKUP(Apr.!$B33,Allgemein!$G$63:$H$64,2,FALSE),\"\")))","v":""},{"$f":"IF(Apr.!$C34=\"Anwesenheit\",Allgemein!$H$62,IF(Apr.!$C34=\"Fehlzeit\",VLOOKUP(Apr.!$M34,Allgemein!$I$50:$J$58,2,FALSE),IF(Apr.!$C34=\"Wochenende\",VLOOKUP(Apr.!$B34,Allgemein!$G$63:$H$64,2,FALSE),\"\")))","v":":"},{"$f":"IF(Apr.!$C35=\"Anwesenheit\",Allgemein!$H$62,IF(Apr.!$C35=\"Fehlzeit\",VLOOKUP(Apr.!$M35,Allgemein!$I$50:$J$58,2,FALSE),IF(Apr.!$C35=\"Wochenende\",VLOOKUP(Apr.!$B35,Allgemein!$G$63:$H$64,2,FALSE),\"\")))","v":"#"},{"$f":"IF(Apr.!$C36=\"Anwesenheit\",Allgemein!$H$62,IF(Apr.!$C36=\"Fehlzeit\",VLOOKUP(Apr.!$M36,Allgemein!$I$50:$J$58,2,FALSE),IF(Apr.!$C36=\"Wochenende\",VLOOKUP(Apr.!$B36,Allgemein!$G$63:$H$64,2,FALSE),\"\")))","v":""},{"$f":"IF(Apr.!$C37=\"Anwesenheit\",Allgemein!$H$62,IF(Apr.!$C37=\"Fehlzeit\",VLOOKUP(Apr.!$M37,Allgemein!$I$50:$J$58,2,FALSE),IF(Apr.!$C37=\"Wochenende\",VLOOKUP(Apr.!$B37,Allgemein!$G$63:$H$64,2,FALSE),\"\")))","v":""},{"$f":"IF(Apr.!$C38=\"Anwesenheit\",Allgemein!$H$62,IF(Apr.!$C38=\"Fehlzeit\",VLOOKUP(Apr.!$M38,Allgemein!$I$50:$J$58,2,FALSE),IF(Apr.!$C38=\"Wochenende\",VLOOKUP(Apr.!$B38,Allgemein!$G$63:$H$64,2,FALSE),\"\")))","v":""},{"$f":"IF(Apr.!$C39=\"Anwesenheit\",Allgemein!$H$62,IF(Apr.!$C39=\"Fehlzeit\",VLOOKUP(Apr.!$M39,Allgemein!$I$50:$J$58,2,FALSE),IF(Apr.!$C39=\"Wochenende\",VLOOKUP(Apr.!$B39,Allgemein!$G$63:$H$64,2,FALSE),\"\")))","v":""}]
["Gew./Aushilfe","Abteilungsleiter"," "," ","Vertrieb",null,"Valentinstag","2026-02-14",{"v":0,"d":"0.00"},null,"2023-05-01",{"$f":"IF(Mai!$C10=\"Anwesenheit\",Allgemein!$H$62,IF(Mai!$C10=\"Fehlzeit\",VLOOKUP(Mai!$M10,Allgemein!$I$50:$J$58,2,FALSE),IF(Mai!$C10=\"Wochenende\",VLOOKUP(Mai!$B10,Allgemein!$G$63:$H$64,2,FALSE),\"\")))","v":"F"},{"$f":"IF(Mai!$C11=\"Anwesenheit\",Allgemein!$H$62,IF(Mai!$C11=\"Fehlzeit\",VLOOKUP(Mai!$M11,Allgemein!$I$50:$J$58,2,FALSE),IF(Mai!$C11=\"Wochenende\",VLOOKUP(Mai!$B11,Allgemein!$G$63:$H$64,2,FALSE),\"\")))","v":":"},{"$f":"IF(Mai!$C12=\"Anwesenheit\",Allgemein!$H$62,IF(Mai!$C12=\"Fehlzeit\",VLOOKUP(Mai!$M12,Allgemein!$I$50:$J$58,2,FALSE),IF(Mai!$C12=\"Wochenende\",VLOOKUP(Mai!$B12,Allgemein!$G$63:$H$64,2,FALSE),\"\")))","v":"#"},{"$f":"IF(Mai!$C13=\"Anwesenheit\",Allgemein!$H$62,IF(Mai!$C13=\"Fehlzeit\",VLOOKUP(Mai!$M13,Allgemein!$I$50:$J$58,2,FALSE),IF(Mai!$C13=\"Wochenende\",VLOOKUP(Mai!$B13,Allgemein!$G$63:$H$64,2,FALSE),\"\")))","v":""},{"$f":"IF(Mai!$C14=\"Anwesenheit\",Allgemein!$H$62,IF(Mai!$C14=\"Fehlzeit\",VLOOKUP(Mai!$M14,Allgemein!$I$50:$J$58,2,FALSE),IF(Mai!$C14=\"Wochenende\",VLOOKUP(Mai!$B14,Allgemein!$G$63:$H$64,2,FALSE),\"\")))","v":""},{"$f":"IF(Mai!$C15=\"Anwesenheit\",Allgemein!$H$62,IF(Mai!$C15=\"Fehlzeit\",VLOOKUP(Mai!$M15,Allgemein!$I$50:$J$58,2,FALSE),IF(Mai!$C15=\"Wochenende\",VLOOKUP(Mai!$B15,Allgemein!$G$63:$H$64,2,FALSE),\"\")))","v":"F"},{"$f":"IF(Mai!$C16=\"Anwesenheit\",Allgemein!$H$62,IF(Mai!$C16=\"Fehlzeit\",VLOOKUP(Mai!$M16,Allgemein!$I$50:$J$58,2,FALSE),IF(Mai!$C16=\"Wochenende\",VLOOKUP(Mai!$B16,Allgemein!$G$63:$H$64,2,FALSE),\"\")))","v":""},{"$f":"IF(Mai!$C17=\"Anwesenheit\",Allgemein!$H$62,IF(Mai!$C17=\"Fehlzeit\",VLOOKUP(Mai!$M17,Allgemein!$I$50:$J$58,2,FALSE),IF(Mai!$C17=\"Wochenende\",VLOOKUP(Mai!$B17,Allgemein!$G$63:$H$64,2,FALSE),\"\")))","v":""},{"$f":"IF(Mai!$C18=\"Anwesenheit\",Allgemein!$H$62,IF(Mai!$C18=\"Fehlzeit\",VLOOKUP(Mai!$M18,Allgemein!$I$50:$J$58,2,FALSE),IF(Mai!$C18=\"Wochenende\",VLOOKUP(Mai!$B18,Allgemein!$G$63:$H$64,2,FALSE),\"\")))","v":":"},{"$f":"IF(Mai!$C19=\"Anwesenheit\",Allgemein!$H$62,IF(Mai!$C19=\"Fehlzeit\",VLOOKUP(Mai!$M19,Allgemein!$I$50:$J$58,2,FALSE),IF(Mai!$C19=\"Wochenende\",VLOOKUP(Mai!$B19,Allgemein!$G$63:$H$64,2,FALSE),\"\")))","v":"#"},{"$f":"IF(Mai!$C20=\"Anwesenheit\",Allgemein!$H$62,IF(Mai!$C20=\"Fehlzeit\",VLOOKUP(Mai!$M20,Allgemein!$I$50:$J$58,2,FALSE),IF(Mai!$C20=\"Wochenende\",VLOOKUP(Mai!$B20,Allgemein!$G$63:$H$64,2,FALSE),\"\")))","v":""},{"$f":"IF(Mai!$C21=\"Anwesenheit\",Allgemein!$H$62,IF(Mai!$C21=\"Fehlzeit\",VLOOKUP(Mai!$M21,Allgemein!$I$50:$J$58,2,FALSE),IF(Mai!$C21=\"Wochenende\",VLOOKUP(Mai!$B21,Allgemein!$G$63:$H$64,2,FALSE),\"\")))","v":""},{"$f":"IF(Mai!$C22=\"Anwesenheit\",Allgemein!$H$62,IF(Mai!$C22=\"Fehlzeit\",VLOOKUP(Mai!$M22,Allgemein!$I$50:$J$58,2,FALSE),IF(Mai!$C22=\"Wochenende\",VLOOKUP(Mai!$B22,Allgemein!$G$63:$H$64,2,FALSE),\"\")))","v":""},{"$f":"IF(Mai!$C23=\"Anwesenheit\",Allgemein!$H$62,IF(Mai!$C23=\"Fehlzeit\",VLOOKUP(Mai!$M23,Allgemein!$I$50:$J$58,2,FALSE),IF(Mai!$C23=\"Wochenende\",VLOOKUP(Mai!$B23,Allgemein!$G$63:$H$64,2,FALSE),\"\")))","v":"F"},{"$f":"IF(Mai!$C24=\"Anwesenheit\",Allgemein!$H$62,IF(Mai!$C24=\"Fehlzeit\",VLOOKUP(Mai!$M24,Allgemein!$I$50:$J$58,2,FALSE),IF(Mai!$C24=\"Wochenende\",VLOOKUP(Mai!$B24,Allgemein!$G$63:$H$64,2,FALSE),\"\")))","v":""},{"$f":"IF(Mai!$C25=\"Anwesenheit\",Allgemein!$H$62,IF(Mai!$C25=\"Fehlzeit\",VLOOKUP(Mai!$M25,Allgemein!$I$50:$J$58,2,FALSE),IF(Mai!$C25=\"Wochenende\",VLOOKUP(Mai!$B25,Allgemein!$G$63:$H$64,2,FALSE),\"\")))","v":":"},{"$f":"IF(Mai!$C26=\"Anwesenheit\",Allgemein!$H$62,IF(Mai!$C26=\"Fehlzeit\",VLOOKUP(Mai!$M26,Allgemein!$I$50:$J$58,2,FALSE),IF(Mai!$C26=\"Wochenende\",VLOOKUP(Mai!$B26,Allgemein!$G$63:$H$64,2,FALSE),\"\")))","v":"#"},{"$f":"IF(Mai!$C27=\"Anwesenheit\",Allgemein!$H$62,IF(Mai!$C27=\"Fehlzeit\",VLOOKUP(Mai!$M27,Allgemein!$I$50:$J$58,2,FALSE),IF(Mai!$C27=\"Wochenende\",VLOOKUP(Mai!$B27,Allgemein!$G$63:$H$64,2,FALSE),\"\")))","v":""},{"$f":"IF(Mai!$C28=\"Anwesenheit\",Allgemein!$H$62,IF(Mai!$C28=\"Fehlzeit\",VLOOKUP(Mai!$M28,Allgemein!$I$50:$J$58,2,FALSE),IF(Mai!$C28=\"Wochenende\",VLOOKUP(Mai!$B28,Allgemein!$G$63:$H$64,2,FALSE),\"\")))","v":""},{"$f":"IF(Mai!$C29=\"Anwesenheit\",Allgemein!$H$62,IF(Mai!$C29=\"Fehlzeit\",VLOOKUP(Mai!$M29,Allgemein!$I$50:$J$58,2,FALSE),IF(Mai!$C29=\"Wochenende\",VLOOKUP(Mai!$B29,Allgemein!$G$63:$H$64,2,FALSE),\"\")))","v":""},{"$f":"IF(Mai!$C30=\"Anwesenheit\",Allgemein!$H$62,IF(Mai!$C30=\"Fehlzeit\",VLOOKUP(Mai!$M30,Allgemein!$I$50:$J$58,2,FALSE),IF(Mai!$C30=\"Wochenende\",VLOOKUP(Mai!$B30,Allgemein!$G$63:$H$64,2,FALSE),\"\")))","v":""},{"$f":"IF(Mai!$C31=\"Anwesenheit\",Allgemein!$H$62,IF(Mai!$C31=\"Fehlzeit\",VLOOKUP(Mai!$M31,Allgemein!$I$50:$J$58,2,FALSE),IF(Mai!$C31=\"Wochenende\",VLOOKUP(Mai!$B31,Allgemein!$G$63:$H$64,2,FALSE),\"\")))","v":""},{"$f":"IF(Mai!$C32=\"Anwesenheit\",Allgemein!$H$62,IF(Mai!$C32=\"Fehlzeit\",VLOOKUP(Mai!$M32,Allgemein!$I$50:$J$58,2,FALSE),IF(Mai!$C32=\"Wochenende\",VLOOKUP(Mai!$B32,Allgemein!$G$63:$H$64,2,FALSE),\"\")))","v":":"},{"$f":"IF(Mai!$C33=\"Anwesenheit\",Allgemein!$H$62,IF(Mai!$C33=\"Fehlzeit\",VLOOKUP(Mai!$M33,Allgemein!$I$50:$J$58,2,FALSE),IF(Mai!$C33=\"Wochenende\",VLOOKUP(Mai!$B33,Allgemein!$G$63:$H$64,2,FALSE),\"\")))","v":"F"},{"$f":"IF(Mai!$C34=\"Anwesenheit\",Allgemein!$H$62,IF(Mai!$C34=\"Fehlzeit\",VLOOKUP(Mai!$M34,Allgemein!$I$50:$J$58,2,FALSE),IF(Mai!$C34=\"Wochenende\",VLOOKUP(Mai!$B34,Allgemein!$G$63:$H$64,2,FALSE),\"\")))","v":"F"},{"$f":"IF(Mai!$C35=\"Anwesenheit\",Allgemein!$H$62,IF(Mai!$C35=\"Fehlzeit\",VLOOKUP(Mai!$M35,Allgemein!$I$50:$J$58,2,FALSE),IF(Mai!$C35=\"Wochenende\",VLOOKUP(Mai!$B35,Allgemein!$G$63:$H$64,2,FALSE),\"\")))","v":""},{"$f":"IF(Mai!$C36=\"Anwesenheit\",Allgemein!$H$62,IF(Mai!$C36=\"Fehlzeit\",VLOOKUP(Mai!$M36,Allgemein!$I$50:$J$58,2,FALSE),IF(Mai!$C36=\"Wochenende\",VLOOKUP(Mai!$B36,Allgemein!$G$63:$H$64,2,FALSE),\"\")))","v":""},{"$f":"IF(Mai!$C37=\"Anwesenheit\",Allgemein!$H$62,IF(Mai!$C37=\"Fehlzeit\",VLOOKUP(Mai!$M37,Allgemein!$I$50:$J$58,2,FALSE),IF(Mai!$C37=\"Wochenende\",VLOOKUP(Mai!$B37,Allgemein!$G$63:$H$64,2,FALSE),\"\")))","v":""},{"$f":"IF(Mai!$C38=\"Anwesenheit\",Allgemein!$H$62,IF(Mai!$C38=\"Fehlzeit\",VLOOKUP(Mai!$M38,Allgemein!$I$50:$J$58,2,FALSE),IF(Mai!$C38=\"Wochenende\",VLOOKUP(Mai!$B38,Allgemein!$G$63:$H$64,2,FALSE),\"\")))","v":""},{"$f":"IF(Mai!$C39=\"Anwesenheit\",Allgemein!$H$62,IF(Mai!$C39=\"Fehlzeit\",VLOOKUP(Mai!$M39,Allgemein!$I$50:$J$58,2,FALSE),IF(Mai!$C39=\"Wochenende\",VLOOKUP(Mai!$B39,Allgemein!$G$63:$H$64,2,FALSE),\"\")))","v":":"},{"$f":"IF(Mai!$C40=\"Anwesenheit\",Allgemein!$H$62,IF(Mai!$C40=\"Fehlzeit\",VLOOKUP(Mai!$M40,Allgemein!$I$50:$J$58,2,FALSE),IF(Mai!$C40=\"Wochenende\",VLOOKUP(Mai!$B40,Allgemein!$G$63:$H$64,2,FALSE),\"\")))","v":"#"}]
["Gew./Azubi","Bereichsleiter",null,null,"Verwaltung",null,"Fastnachtssamstag","2026-02-14",{"v":0,"d":"0.00"},null,"2023-06-01",{"$f":"IF(Jun.!$C10=\"Anwesenheit\",Allgemein!$H$62,IF(Jun.!$C10=\"Fehlzeit\",VLOOKUP(Jun.!$M10,Allgemein!$I$50:$J$58,2,FALSE),IF(Jun.!$C10=\"Wochenende\",VLOOKUP(Jun.!$B10,Allgemein!$G$63:$H$64,2,FALSE),\"\")))","v":""},{"$f":"IF(Jun.!$C11=\"Anwesenheit\",Allgemein!$H$62,IF(Jun.!$C11=\"Fehlzeit\",VLOOKUP(Jun.!$M11,Allgemein!$I$50:$J$58,2,FALSE),IF(Jun.!$C11=\"Wochenende\",VLOOKUP(Jun.!$B11,Allgemein!$G$63:$H$64,2,FALSE),\"\")))","v":""},{"$f":"IF(Jun.!$C12=\"Anwesenheit\",Allgemein!$H$62,IF(Jun.!$C12=\"Fehlzeit\",VLOOKUP(Jun.!$M12,Allgemein!$I$50:$J$58,2,FALSE),IF(Jun.!$C12=\"Wochenende\",VLOOKUP(Jun.!$B12,Allgemein!$G$63:$H$64,2,FALSE),\"\")))","v":""},{"$f":"IF(Jun.!$C13=\"Anwesenheit\",Allgemein!$H$62,IF(Jun.!$C13=\"Fehlzeit\",VLOOKUP(Jun.!$M13,Allgemein!$I$50:$J$58,2,FALSE),IF(Jun.!$C13=\"Wochenende\",VLOOKUP(Jun.!$B13,Allgemein!$G$63:$H$64,2,FALSE),\"\")))","v":"F"},{"$f":"IF(Jun.!$C14=\"Anwesenheit\",Allgemein!$H$62,IF(Jun.!$C14=\"Fehlzeit\",VLOOKUP(Jun.!$M14,Allgemein!$I$50:$J$58,2,FALSE),IF(Jun.!$C14=\"Wochenende\",VLOOKUP(Jun.!$B14,Allgemein!$G$63:$H$64,2,FALSE),\"\")))","v":""},{"$f":"IF(Jun.!$C15=\"Anwesenheit\",Allgemein!$H$62,IF(Jun.!$C15=\"Fehlzeit\",VLOOKUP(Jun.!$M15,Allgemein!$I$50:$J$58,2,FALSE),IF(Jun.!$C15=\"Wochenende\",VLOOKUP(Jun.!$B15,Allgemein!$G$63:$H$64,2,FALSE),\"\")))","v":":"},{"$f":"IF(Jun.!$C16=\"Anwesenheit\",Allgemein!$H$62,IF(Jun.!$C16=\"Fehlzeit\",VLOOKUP(Jun.!$M16,Allgemein!$I$50:$J$58,2,FALSE),IF(Jun.!$C16=\"Wochenende\",VLOOKUP(Jun.!$B16,Allgemein!$G$63:$H$64,2,FALSE),\"\")))","v":"#"},{"$f":"IF(Jun.!$C17=\"Anwesenheit\",Allgemein!$H$62,IF(Jun.!$C17=\"Fehlzeit\",VLOOKUP(Jun.!$M17,Allgemein!$I$50:$J$58,2,FALSE),IF(Jun.!$C17=\"Wochenende\",VLOOKUP(Jun.!$B17,Allgemein!$G$63:$H$64,2,FALSE),\"\")))","v":""},{"$f":"IF(Jun.!$C18=\"Anwesenheit\",Allgemein!$H$62,IF(Jun.!$C18=\"Fehlzeit\",VLOOKUP(Jun.!$M18,Allgemein!$I$50:$J$58,2,FALSE),IF(Jun.!$C18=\"Wochenende\",VLOOKUP(Jun.!$B18,Allgemein!$G$63:$H$64,2,FALSE),\"\")))","v":""},{"$f":"IF(Jun.!$C19=\"Anwesenheit\",Allgemein!$H$62,IF(Jun.!$C19=\"Fehlzeit\",VLOOKUP(Jun.!$M19,Allgemein!$I$50:$J$58,2,FALSE),IF(Jun.!$C19=\"Wochenende\",VLOOKUP(Jun.!$B19,Allgemein!$G$63:$H$64,2,FALSE),\"\")))","v":""},{"$f":"IF(Jun.!$C20=\"Anwesenheit\",Allgemein!$H$62,IF(Jun.!$C20=\"Fehlzeit\",VLOOKUP(Jun.!$M20,Allgemein!$I$50:$J$58,2,FALSE),IF(Jun.!$C20=\"Wochenende\",VLOOKUP(Jun.!$B20,Allgemein!$G$63:$H$64,2,FALSE),\"\")))","v":""},{"$f":"IF(Jun.!$C21=\"Anwesenheit\",Allgemein!$H$62,IF(Jun.!$C21=\"Fehlzeit\",VLOOKUP(Jun.!$M21,Allgemein!$I$50:$J$58,2,FALSE),IF(Jun.!$C21=\"Wochenende\",VLOOKUP(Jun.!$B21,Allgemein!$G$63:$H$64,2,FALSE),\"\")))","v":""},{"$f":"IF(Jun.!$C22=\"Anwesenheit\",Allgemein!$H$62,IF(Jun.!$C22=\"Fehlzeit\",VLOOKUP(Jun.!$M22,Allgemein!$I$50:$J$58,2,FALSE),IF(Jun.!$C22=\"Wochenende\",VLOOKUP(Jun.!$B22,Allgemein!$G$63:$H$64,2,FALSE),\"\")))","v":":"},{"$f":"IF(Jun.!$C23=\"Anwesenheit\",Allgemein!$H$62,IF(Jun.!$C23=\"Fehlzeit\",VLOOKUP(Jun.!$M23,Allgemein!$I$50:$J$58,2,FALSE),IF(Jun.!$C23=\"Wochenende\",VLOOKUP(Jun.!$B23,Allgemein!$G$63:$H$64,2,FALSE),\"\")))","v":"#"},{"$f":"IF(Jun.!$C24=\"Anwesenheit\",Allgemein!$H$62,IF(Jun.!$C24=\"Fehlzeit\",VLOOKUP(Jun.!$M24,Allgemein!$I$50:$J$58,2,FALSE),IF(Jun.!$C24=\"Wochenende\",VLOOKUP(Jun.!$B24,Allgemein!$G$63:$H$64,2,FALSE),\"\")))","v":""},{"$f":"IF(Jun.!$C25=\"Anwesenheit\",Allgemein!$H$62,IF(Jun.!$C25=\"Fehlzeit\",VLOOKUP(Jun.!$M25,Allgemein!$I$50:$J$58,2,FALSE),IF(Jun.!$C25=\"Wochenende\",VLOOKUP(Jun.!$B25,Allgemein!$G$63:$H$64,2,FALSE),\"\")))","v":""},{"$f":"IF(Jun.!$C26=\"Anwesenheit\",Allgemein!$H$62,IF(Jun.!$C26=\"Fehlzeit\",VLOOKUP(Jun.!$M26,Allgemein!$I$50:$J$58,2,FALSE),IF(Jun.!$C26=\"Wochenende\",VLOOKUP(Jun.!$B26,Allgemein!$G$63:$H$64,2,FALSE),\"\")))","v":""},{"$f":"IF(Jun.!$C27=\"Anwesenheit\",Allgemein!$H$62,IF(Jun.!$C27=\"Fehlzeit\",VLOOKUP(Jun.!$M27,Allgemein!$I$50:$J$58,2,FALSE),IF(Jun.!$C27=\"Wochenende\",VLOOKUP(Jun.!$B27,Allgemein!$G$63:$H$64,2,FALSE),\"\")))","v":""},{"$f":"IF(Jun.!$C28=\"Anwesenheit\",Allgemein!$H$62,IF(Jun.!$C28=\"Fehlzeit\",VLOOKUP(Jun.!$M28,Allgemein!$I$50:$J$58,2,FALSE),IF(Jun.!$C28=\"Wochenende\",VLOOKUP(Jun.!$B28,Allgemein!$G$63:$H$64,2,FALSE),\"\")))","v":""},{"$f":"IF(Jun.!$C29=\"Anwesenheit\",Allgemein!$H$62,IF(Jun.!$C29=\"Fehlzeit\",VLOOKUP(Jun.!$M29,Allgemein!$I$50:$J$58,2,FALSE),IF(Jun.!$C29=\"Wochenende\",VLOOKUP(Jun.!$B29,Allgemein!$G$63:$H$64,2,FALSE),\"\")))","v":":"},{"$f":"IF(Jun.!$C30=\"Anwesenheit\",Allgemein!$H$62,IF(Jun.!$C30=\"Fehlzeit\",VLOOKUP(Jun.!$M30,Allgemein!$I$50:$J$58,2,FALSE),IF(Jun.!$C30=\"Wochenende\",VLOOKUP(Jun.!$B30,Allgemein!$G$63:$H$64,2,FALSE),\"\")))","v":"#"},{"$f":"IF(Jun.!$C31=\"Anwesenheit\",Allgemein!$H$62,IF(Jun.!$C31=\"Fehlzeit\",VLOOKUP(Jun.!$M31,Allgemein!$I$50:$J$58,2,FALSE),IF(Jun.!$C31=\"Wochenende\",VLOOKUP(Jun.!$B31,Allgemein!$G$63:$H$64,2,FALSE),\"\")))","v":""},{"$f":"IF(Jun.!$C32=\"Anwesenheit\",Allgemein!$H$62,IF(Jun.!$C32=\"Fehlzeit\",VLOOKUP(Jun.!$M32,Allgemein!$I$50:$J$58,2,FALSE),IF(Jun.!$C32=\"Wochenende\",VLOOKUP(Jun.!$B32,Allgemein!$G$63:$H$64,2,FALSE),\"\")))","v":""},{"$f":"IF(Jun.!$C33=\"Anwesenheit\",Allgemein!$H$62,IF(Jun.!$C33=\"Fehlzeit\",VLOOKUP(Jun.!$M33,Allgemein!$I$50:$J$58,2,FALSE),IF(Jun.!$C33=\"Wochenende\",VLOOKUP(Jun.!$B33,Allgemein!$G$63:$H$64,2,FALSE),\"\")))","v":""},{"$f":"IF(Jun.!$C34=\"Anwesenheit\",Allgemein!$H$62,IF(Jun.!$C34=\"Fehlzeit\",VLOOKUP(Jun.!$M34,Allgemein!$I$50:$J$58,2,FALSE),IF(Jun.!$C34=\"Wochenende\",VLOOKUP(Jun.!$B34,Allgemein!$G$63:$H$64,2,FALSE),\"\")))","v":""},{"$f":"IF(Jun.!$C35=\"Anwesenheit\",Allgemein!$H$62,IF(Jun.!$C35=\"Fehlzeit\",VLOOKUP(Jun.!$M35,Allgemein!$I$50:$J$58,2,FALSE),IF(Jun.!$C35=\"Wochenende\",VLOOKUP(Jun.!$B35,Allgemein!$G$63:$H$64,2,FALSE),\"\")))","v":""},{"$f":"IF(Jun.!$C36=\"Anwesenheit\",Allgemein!$H$62,IF(Jun.!$C36=\"Fehlzeit\",VLOOKUP(Jun.!$M36,Allgemein!$I$50:$J$58,2,FALSE),IF(Jun.!$C36=\"Wochenende\",VLOOKUP(Jun.!$B36,Allgemein!$G$63:$H$64,2,FALSE),\"\")))","v":":"},{"$f":"IF(Jun.!$C37=\"Anwesenheit\",Allgemein!$H$62,IF(Jun.!$C37=\"Fehlzeit\",VLOOKUP(Jun.!$M37,Allgemein!$I$50:$J$58,2,FALSE),IF(Jun.!$C37=\"Wochenende\",VLOOKUP(Jun.!$B37,Allgemein!$G$63:$H$64,2,FALSE),\"\")))","v":"#"},{"$f":"IF(Jun.!$C38=\"Anwesenheit\",Allgemein!$H$62,IF(Jun.!$C38=\"Fehlzeit\",VLOOKUP(Jun.!$M38,Allgemein!$I$50:$J$58,2,FALSE),IF(Jun.!$C38=\"Wochenende\",VLOOKUP(Jun.!$B38,Allgemein!$G$63:$H$64,2,FALSE),\"\")))","v":""},{"$f":"IF(Jun.!$C39=\"Anwesenheit\",Allgemein!$H$62,IF(Jun.!$C39=\"Fehlzeit\",VLOOKUP(Jun.!$M39,Allgemein!$I$50:$J$58,2,FALSE),IF(Jun.!$C39=\"Wochenende\",VLOOKUP(Jun.!$B39,Allgemein!$G$63:$H$64,2,FALSE),\"\")))","v":""}]
["Ang./Vollzeit","Geschäftsleiter",null,null,"IT",null,"Fastnachtssonntag","2026-02-15",{"v":0,"d":"0.00"},null,"2023-07-01",{"$f":"IF(Jul.!$C10=\"Anwesenheit\",Allgemein!$H$62,IF(Jul.!$C10=\"Fehlzeit\",VLOOKUP(Jul.!$M10,Allgemein!$I$50:$J$58,2,FALSE),IF(Jul.!$C10=\"Wochenende\",VLOOKUP(Jul.!$B10,Allgemein!$G$63:$H$64,2,FALSE),\"\")))","v":""},{"$f":"IF(Jul.!$C11=\"Anwesenheit\",Allgemein!$H$62,IF(Jul.!$C11=\"Fehlzeit\",VLOOKUP(Jul.!$M11,Allgemein!$I$50:$J$58,2,FALSE),IF(Jul.!$C11=\"Wochenende\",VLOOKUP(Jul.!$B11,Allgemein!$G$63:$H$64,2,FALSE),\"\")))","v":""},{"$f":"IF(Jul.!$C12=\"Anwesenheit\",Allgemein!$H$62,IF(Jul.!$C12=\"Fehlzeit\",VLOOKUP(Jul.!$M12,Allgemein!$I$50:$J$58,2,FALSE),IF(Jul.!$C12=\"Wochenende\",VLOOKUP(Jul.!$B12,Allgemein!$G$63:$H$64,2,FALSE),\"\")))","v":""},{"$f":"IF(Jul.!$C13=\"Anwesenheit\",Allgemein!$H$62,IF(Jul.!$C13=\"Fehlzeit\",VLOOKUP(Jul.!$M13,Allgemein!$I$50:$J$58,2,FALSE),IF(Jul.!$C13=\"Wochenende\",VLOOKUP(Jul.!$B13,Allgemein!$G$63:$H$64,2,FALSE),\"\")))","v":":"},{"$f":"IF(Jul.!$C14=\"Anwesenheit\",Allgemein!$H$62,IF(Jul.!$C14=\"Fehlzeit\",VLOOKUP(Jul.!$M14,Allgemein!$I$50:$J$58,2,FALSE),IF(Jul.!$C14=\"Wochenende\",VLOOKUP(Jul.!$B14,Allgemein!$G$63:$H$64,2,FALSE),\"\")))","v":"#"},{"$f":"IF(Jul.!$C15=\"Anwesenheit\",Allgemein!$H$62,IF(Jul.!$C15=\"Fehlzeit\",VLOOKUP(Jul.!$M15,Allgemein!$I$50:$J$58,2,FALSE),IF(Jul.!$C15=\"Wochenende\",VLOOKUP(Jul.!$B15,Allgemein!$G$63:$H$64,2,FALSE),\"\")))","v":""},{"$f":"IF(Jul.!$C16=\"Anwesenheit\",Allgemein!$H$62,IF(Jul.!$C16=\"Fehlzeit\",VLOOKUP(Jul.!$M16,Allgemein!$I$50:$J$58,2,FALSE),IF(Jul.!$C16=\"Wochenende\",VLOOKUP(Jul.!$B16,Allgemein!$G$63:$H$64,2,FALSE),\"\")))","v":""},{"$f":"IF(Jul.!$C17=\"Anwesenheit\",Allgemein!$H$62,IF(Jul.!$C17=\"Fehlzeit\",VLOOKUP(Jul.!$M17,Allgemein!$I$50:$J$58,2,FALSE),IF(Jul.!$C17=\"Wochenende\",VLOOKUP(Jul.!$B17,Allgemein!$G$63:$H$64,2,FALSE),\"\")))","v":""},{"$f":"IF(Jul.!$C18=\"Anwesenheit\",Allgemein!$H$62,IF(Jul.!$C18=\"Fehlzeit\",VLOOKUP(Jul.!$M18,Allgemein!$I$50:$J$58,2,FALSE),IF(Jul.!$C18=\"Wochenende\",VLOOKUP(Jul.!$B18,Allgemein!$G$63:$H$64,2,FALSE),\"\")))","v":""},{"$f":"IF(Jul.!$C19=\"Anwesenheit\",Allgemein!$H$62,IF(Jul.!$C19=\"Fehlzeit\",VLOOKUP(Jul.!$M19,Allgemein!$I$50:$J$58,2,FALSE),IF(Jul.!$C19=\"Wochenende\",VLOOKUP(Jul.!$B19,Allgemein!$G$63:$H$64,2,FALSE),\"\")))","v":""},{"$f":"IF(Jul.!$C20=\"Anwesenheit\",Allgemein!$H$62,IF(Jul.!$C20=\"Fehlzeit\",VLOOKUP(Jul.!$M20,Allgemein!$I$50:$J$58,2,FALSE),IF(Jul.!$C20=\"Wochenende\",VLOOKUP(Jul.!$B20,Allgemein!$G$63:$H$64,2,FALSE),\"\")))","v":":"},{"$f":"IF(Jul.!$C21=\"Anwesenheit\",Allgemein!$H$62,IF(Jul.!$C21=\"Fehlzeit\",VLOOKUP(Jul.!$M21,Allgemein!$I$50:$J$58,2,FALSE),IF(Jul.!$C21=\"Wochenende\",VLOOKUP(Jul.!$B21,Allgemein!$G$63:$H$64,2,FALSE),\"\")))","v":"#"},{"$f":"IF(Jul.!$C22=\"Anwesenheit\",Allgemein!$H$62,IF(Jul.!$C22=\"Fehlzeit\",VLOOKUP(Jul.!$M22,Allgemein!$I$50:$J$58,2,FALSE),IF(Jul.!$C22=\"Wochenende\",VLOOKUP(Jul.!$B22,Allgemein!$G$63:$H$64,2,FALSE),\"\")))","v":""},{"$f":"IF(Jul.!$C23=\"Anwesenheit\",Allgemein!$H$62,IF(Jul.!$C23=\"Fehlzeit\",VLOOKUP(Jul.!$M23,Allgemein!$I$50:$J$58,2,FALSE),IF(Jul.!$C23=\"Wochenende\",VLOOKUP(Jul.!$B23,Allgemein!$G$63:$H$64,2,FALSE),\"\")))","v":""},{"$f":"IF(Jul.!$C24=\"Anwesenheit\",Allgemein!$H$62,IF(Jul.!$C24=\"Fehlzeit\",VLOOKUP(Jul.!$M24,Allgemein!$I$50:$J$58,2,FALSE),IF(Jul.!$C24=\"Wochenende\",VLOOKUP(Jul.!$B24,Allgemein!$G$63:$H$64,2,FALSE),\"\")))","v":""},{"$f":"IF(Jul.!$C25=\"Anwesenheit\",Allgemein!$H$62,IF(Jul.!$C25=\"Fehlzeit\",VLOOKUP(Jul.!$M25,Allgemein!$I$50:$J$58,2,FALSE),IF(Jul.!$C25=\"Wochenende\",VLOOKUP(Jul.!$B25,Allgemein!$G$63:$H$64,2,FALSE),\"\")))","v":""},{"$f":"IF(Jul.!$C26=\"Anwesenheit\",Allgemein!$H$62,IF(Jul.!$C26=\"Fehlzeit\",VLOOKUP(Jul.!$M26,Allgemein!$I$50:$J$58,2,FALSE),IF(Jul.!$C26=\"Wochenende\",VLOOKUP(Jul.!$B26,Allgemein!$G$63:$H$64,2,FALSE),\"\")))","v":""},{"$f":"IF(Jul.!$C27=\"Anwesenheit\",Allgemein!$H$62,IF(Jul.!$C27=\"Fehlzeit\",VLOOKUP(Jul.!$M27,Allgemein!$I$50:$J$58,2,FALSE),IF(Jul.!$C27=\"Wochenende\",VLOOKUP(Jul.!$B27,Allgemein!$G$63:$H$64,2,FALSE),\"\")))","v":":"},{"$f":"IF(Jul.!$C28=\"Anwesenheit\",Allgemein!$H$62,IF(Jul.!$C28=\"Fehlzeit\",VLOOKUP(Jul.!$M28,Allgemein!$I$50:$J$58,2,FALSE),IF(Jul.!$C28=\"Wochenende\",VLOOKUP(Jul.!$B28,Allgemein!$G$63:$H$64,2,FALSE),\"\")))","v":"#"},{"$f":"IF(Jul.!$C29=\"Anwesenheit\",Allgemein!$H$62,IF(Jul.!$C29=\"Fehlzeit\",VLOOKUP(Jul.!$M29,Allgemein!$I$50:$J$58,2,FALSE),IF(Jul.!$C29=\"Wochenende\",VLOOKUP(Jul.!$B29,Allgemein!$G$63:$H$64,2,FALSE),\"\")))","v":""},{"$f":"IF(Jul.!$C30=\"Anwesenheit\",Allgemein!$H$62,IF(Jul.!$C30=\"Fehlzeit\",VLOOKUP(Jul.!$M30,Allgemein!$I$50:$J$58,2,FALSE),IF(Jul.!$C30=\"Wochenende\",VLOOKUP(Jul.!$B30,Allgemein!$G$63:$H$64,2,FALSE),\"\")))","v":""},{"$f":"IF(Jul.!$C31=\"Anwesenheit\",Allgemein!$H$62,IF(Jul.!$C31=\"Fehlzeit\",VLOOKUP(Jul.!$M31,Allgemein!$I$50:$J$58,2,FALSE),IF(Jul.!$C31=\"Wochenende\",VLOOKUP(Jul.!$B31,Allgemein!$G$63:$H$64,2,FALSE),\"\")))","v":""},{"$f":"IF(Jul.!$C32=\"Anwesenheit\",Allgemein!$H$62,IF(Jul.!$C32=\"Fehlzeit\",VLOOKUP(Jul.!$M32,Allgemein!$I$50:$J$58,2,FALSE),IF(Jul.!$C32=\"Wochenende\",VLOOKUP(Jul.!$B32,Allgemein!$G$63:$H$64,2,FALSE),\"\")))","v":""},{"$f":"IF(Jul.!$C33=\"Anwesenheit\",Allgemein!$H$62,IF(Jul.!$C33=\"Fehlzeit\",VLOOKUP(Jul.!$M33,Allgemein!$I$50:$J$58,2,FALSE),IF(Jul.!$C33=\"Wochenende\",VLOOKUP(Jul.!$B33,Allgemein!$G$63:$H$64,2,FALSE),\"\")))","v":""},{"$f":"IF(Jul.!$C34=\"Anwesenheit\",Allgemein!$H$62,IF(Jul.!$C34=\"Fehlzeit\",VLOOKUP(Jul.!$M34,Allgemein!$I$50:$J$58,2,FALSE),IF(Jul.!$C34=\"Wochenende\",VLOOKUP(Jul.!$B34,Allgemein!$G$63:$H$64,2,FALSE),\"\")))","v":":"},{"$f":"IF(Jul.!$C35=\"Anwesenheit\",Allgemein!$H$62,IF(Jul.!$C35=\"Fehlzeit\",VLOOKUP(Jul.!$M35,Allgemein!$I$50:$J$58,2,FALSE),IF(Jul.!$C35=\"Wochenende\",VLOOKUP(Jul.!$B35,Allgemein!$G$63:$H$64,2,FALSE),\"\")))","v":"#"},{"$f":"IF(Jul.!$C36=\"Anwesenheit\",Allgemein!$H$62,IF(Jul.!$C36=\"Fehlzeit\",VLOOKUP(Jul.!$M36,Allgemein!$I$50:$J$58,2,FALSE),IF(Jul.!$C36=\"Wochenende\",VLOOKUP(Jul.!$B36,Allgemein!$G$63:$H$64,2,FALSE),\"\")))","v":""},{"$f":"IF(Jul.!$C37=\"Anwesenheit\",Allgemein!$H$62,IF(Jul.!$C37=\"Fehlzeit\",VLOOKUP(Jul.!$M37,Allgemein!$I$50:$J$58,2,FALSE),IF(Jul.!$C37=\"Wochenende\",VLOOKUP(Jul.!$B37,Allgemein!$G$63:$H$64,2,FALSE),\"\")))","v":""},{"$f":"IF(Jul.!$C38=\"Anwesenheit\",Allgemein!$H$62,IF(Jul.!$C38=\"Fehlzeit\",VLOOKUP(Jul.!$M38,Allgemein!$I$50:$J$58,2,FALSE),IF(Jul.!$C38=\"Wochenende\",VLOOKUP(Jul.!$B38,Allgemein!$G$63:$H$64,2,FALSE),\"\")))","v":""},{"$f":"IF(Jul.!$C39=\"Anwesenheit\",Allgemein!$H$62,IF(Jul.!$C39=\"Fehlzeit\",VLOOKUP(Jul.!$M39,Allgemein!$I$50:$J$58,2,FALSE),IF(Jul.!$C39=\"Wochenende\",VLOOKUP(Jul.!$B39,Allgemein!$G$63:$H$64,2,FALSE),\"\")))","v":""},{"$f":"IF(Jul.!$C40=\"Anwesenheit\",Allgemein!$H$62,IF(Jul.!$C40=\"Fehlzeit\",VLOOKUP(Jul.!$M40,Allgemein!$I$50:$J$58,2,FALSE),IF(Jul.!$C40=\"Wochenende\",VLOOKUP(Jul.!$B40,Allgemein!$G$63:$H$64,2,FALSE),\"\")))","v":""}]
["Ang./Teilzeit"," ",{"$nulls":4},"Rosenmontag","2026-02-16",{"v":0,"d":"0.00"},null,"2023-08-01",{"$f":"IF(Aug.!$C10=\"Anwesenheit\",Allgemein!$H$62,IF(Aug.!$C10=\"Fehlzeit\",VLOOKUP(Aug.!$M10,Allgemein!$I$50:$J$58,2,FALSE),IF(Aug.!$C10=\"Wochenende\",VLOOKUP(Aug.!$B10,Allgemein!$G$63:$H$64,2,FALSE),\"\")))","v":":"},{"$f":"IF(Aug.!$C11=\"Anwesenheit\",Allgemein!$H$62,IF(Aug.!$C11=\"Fehlzeit\",VLOOKUP(Aug.!$M11,Allgemein!$I$50:$J$58,2,FALSE),IF(Aug.!$C11=\"Wochenende\",VLOOKUP(Aug.!$B11,Allgemein!$G$63:$H$64,2,FALSE),\"\")))","v":"#"},{"$f":"IF(Aug.!$C12=\"Anwesenheit\",Allgemein!$H$62,IF(Aug.!$C12=\"Fehlzeit\",VLOOKUP(Aug.!$M12,Allgemein!$I$50:$J$58,2,FALSE),IF(Aug.!$C12=\"Wochenende\",VLOOKUP(Aug.!$B12,Allgemein!$G$63:$H$64,2,FALSE),\"\")))","v":""},{"$f":"IF(Aug.!$C13=\"Anwesenheit\",Allgemein!$H$62,IF(Aug.!$C13=\"Fehlzeit\",VLOOKUP(Aug.!$M13,Allgemein!$I$50:$J$58,2,FALSE),IF(Aug.!$C13=\"Wochenende\",VLOOKUP(Aug.!$B13,Allgemein!$G$63:$H$64,2,FALSE),\"\")))","v":""},{"$f":"IF(Aug.!$C14=\"Anwesenheit\",Allgemein!$H$62,IF(Aug.!$C14=\"Fehlzeit\",VLOOKUP(Aug.!$M14,Allgemein!$I$50:$J$58,2,FALSE),IF(Aug.!$C14=\"Wochenende\",VLOOKUP(Aug.!$B14,Allgemein!$G$63:$H$64,2,FALSE),\"\")))","v":""},{"$f":"IF(Aug.!$C15=\"Anwesenheit\",Allgemein!$H$62,IF(Aug.!$C15=\"Fehlzeit\",VLOOKUP(Aug.!$M15,Allgemein!$I$50:$J$58,2,FALSE),IF(Aug.!$C15=\"Wochenende\",VLOOKUP(Aug.!$B15,Allgemein!$G$63:$H$64,2,FALSE),\"\")))","v":""},{"$f":"IF(Aug.!$C16=\"Anwesenheit\",Allgemein!$H$62,IF(Aug.!$C16=\"Fehlzeit\",VLOOKUP(Aug.!$M16,Allgemein!$I$50:$J$58,2,FALSE),IF(Aug.!$C16=\"Wochenende\",VLOOKUP(Aug.!$B16,Allgemein!$G$63:$H$64,2,FALSE),\"\")))","v":""},{"$f":"IF(Aug.!$C17=\"Anwesenheit\",Allgemein!$H$62,IF(Aug.!$C17=\"Fehlzeit\",VLOOKUP(Aug.!$M17,Allgemein!$I$50:$J$58,2,FALSE),IF(Aug.!$C17=\"Wochenende\",VLOOKUP(Aug.!$B17,Allgemein!$G$63:$H$64,2,FALSE),\"\")))","v":":"},{"$f":"IF(Aug.!$C18=\"Anwesenheit\",Allgemein!$H$62,IF(Aug.!$C18=\"Fehlzeit\",VLOOKUP(Aug.!$M18,Allgemein!$I$50:$J$58,2,FALSE),IF(Aug.!$C18=\"Wochenende\",VLOOKUP(Aug.!$B18,Allgemein!$G$63:$H$64,2,FALSE),\"\")))","v":"#"},{"$f":"IF(Aug.!$C19=\"Anwesenheit\",Allgemein!$H$62,IF(Aug.!$C19=\"Fehlzeit\",VLOOKUP(Aug.!$M19,Allgemein!$I$50:$J$58,2,FALSE),IF(Aug.!$C19=\"Wochenende\",VLOOKUP(Aug.!$B19,Allgemein!$G$63:$H$64,2,FALSE),\"\")))","v":""},{"$f":"IF(Aug.!$C20=\"Anwesenheit\",Allgemein!$H$62,IF(Aug.!$C20=\"Fehlzeit\",VLOOKUP(Aug.!$M20,Allgemein!$I$50:$J$58,2,FALSE),IF(Aug.!$C20=\"Wochenende\",VLOOKUP(Aug.!$B20,Allgemein!$G$63:$H$64,2,FALSE),\"\")))","v":""},{"$f":"IF(Aug.!$C21=\"Anwesenheit\",Allgemein!$H$62,IF(Aug.!$C21=\"Fehlzeit\",VLOOKUP(Aug.!$M21,Allgemein!$I$50:$J$58,2,FALSE),IF(Aug.!$C21=\"Wochenende\",VLOOKUP(Aug.!$B21,Allgemein!$G$63:$H$64,2,FALSE),\"\")))","v":""},{"$f":"IF(Aug.!$C22=\"Anwesenheit\",Allgemein!$H$62,IF(Aug.!$C22=\"Fehlzeit\",VLOOKUP(Aug.!$M22,Allgemein!$I$50:$J$58,2,FALSE),IF(Aug.!$C22=\"Wochenende\",VLOOKUP(Aug.!$B22,Allgemein!$G$63:$H$64,2,FALSE),\"\")))","v":""},{"$f":"IF(Aug.!$C23=\"Anwesenheit\",Allgemein!$H$62,IF(Aug.!$C23=\"Fehlzeit\",VLOOKUP(Aug.!$M23,Allgemein!$I$50:$J$58,2,FALSE),IF(Aug.!$C23=\"Wochenende\",VLOOKUP(Aug.!$B23,Allgemein!$G$63:$H$64,2,FALSE),\"\")))","v":""},{"$f":"IF(Aug.!$C24=\"Anwesenheit\",Allgemein!$H$62,IF(Aug.!$C24=\"Fehlzeit\",VLOOKUP(Aug.!$M24,Allgemein!$I$50:$J$58,2,FALSE),IF(Aug.!$C24=\"Wochenende\",VLOOKUP(Aug.!$B24,Allgemein!$G$63:$H$64,2,FALSE),\"\")))","v":"F"},{"$f":"IF(Aug.!$C25=\"Anwesenheit\",Allgemein!$H$62,IF(Aug.!$C25=\"Fehlzeit\",VLOOKUP(Aug.!$M25,Allgemein!$I$50:$J$58,2,FALSE),IF(Aug.!$C25=\"Wochenende\",VLOOKUP(Aug.!$B25,Allgemein!$G$63:$H$64,2,FALSE),\"\")))","v":"#"},{"$f":"IF(Aug.!$C26=\"Anwesenheit\",Allgemein!$H$62,IF(Aug.!$C26=\"Fehlzeit\",VLOOKUP(Aug.!$M26,Allgemein!$I$50:$J$58,2,FALSE),IF(Aug.!$C26=\"Wochenende\",VLOOKUP(Aug.!$B26,Allgemein!$G$63:$H$64,2,FALSE),\"\")))","v":""},{"$f":"IF(Aug.!$C27=\"Anwesenheit\",Allgemein!$H$62,IF(Aug.!$C27=\"Fehlzeit\",VLOOKUP(Aug.!$M27,Allgemein!$I$50:$J$58,2,FALSE),IF(Aug.!$C27=\"Wochenende\",VLOOKUP(Aug.!$B27,Allgemein!$G$63:$H$64,2,FALSE),\"\")))","v":""},{"$f":"IF(Aug.!$C28=\"Anwesenheit\",Allgemein!$H$62,IF(Aug.!$C28=\"Fehlzeit\",VLOOKUP(Aug.!$M28,Allgemein!$I$50:$J$58,2,FALSE),IF(Aug.!$C28=\"Wochenende\",VLOOKUP(Aug.!$B28,Allgemein!$G$63:$H$64,2,FALSE),\"\")))","v":""},{"$f":"IF(Aug.!$C29=\"Anwesenheit\",Allgemein!$H$62,IF(Aug.!$C29=\"Fehlzeit\",VLOOKUP(Aug.!$M29,Allgemein!$I$50:$J$58,2,FALSE),IF(Aug.!$C29=\"Wochenende\",VLOOKUP(Aug.!$B29,Allgemein!$G$63:$H$64,2,FALSE),\"\")))","v":""},{"$f":"IF(Aug.!$C30=\"Anwesenheit\",Allgemein!$H$62,IF(Aug.!$C30=\"Fehlzeit\",VLOOKUP(Aug.!$M30,Allgemein!$I$50:$J$58,2,FALSE),IF(Aug.!$C30=\"Wochenende\",VLOOKUP(Aug.!$B30,Allgemein!$G$63:$H$64,2,FALSE),\"\")))","v":""},{"$f":"IF(Aug.!$C31=\"Anwesenheit\",Allgemein!$H$62,IF(Aug.!$C31=\"Fehlzeit\",VLOOKUP(Aug.!$M31,Allgemein!$I$50:$J$58,2,FALSE),IF(Aug.!$C31=\"Wochenende\",VLOOKUP(Aug.!$B31,Allgemein!$G$63:$H$64,2,FALSE),\"\")))","v":":"},{"$f":"IF(Aug.!$C32=\"Anwesenheit\",Allgemein!$H$62,IF(Aug.!$C32=\"Fehlzeit\",VLOOKUP(Aug.!$M32,Allgemein!$I$50:$J$58,2,FALSE),IF(Aug.!$C32=\"Wochenende\",VLOOKUP(Aug.!$B32,Allgemein!$G$63:$H$64,2,FALSE),\"\")))","v":"#"},{"$f":"IF(Aug.!$C33=\"Anwesenheit\",Allgemein!$H$62,IF(Aug.!$C33=\"Fehlzeit\",VLOOKUP(Aug.!$M33,Allgemein!$I$50:$J$58,2,FALSE),IF(Aug.!$C33=\"Wochenende\",VLOOKUP(Aug.!$B33,Allgemein!$G$63:$H$64,2,FALSE),\"\")))","v":""},{"$f":"IF(Aug.!$C34=\"Anwesenheit\",Allgemein!$H$62,IF(Aug.!$C34=\"Fehlzeit\",VLOOKUP(Aug.!$M34,Allgemein!$I$50:$J$58,2,FALSE),IF(Aug.!$C34=\"Wochenende\",VLOOKUP(Aug.!$B34,Allgemein!$G$63:$H$64,2,FALSE),\"\")))","v":""},{"$f":"IF(Aug.!$C35=\"Anwesenheit\",Allgemein!$H$62,IF(Aug.!$C35=\"Fehlzeit\",VLOOKUP(Aug.!$M35,Allgemein!$I$50:$J$58,2,FALSE),IF(Aug.!$C35=\"Wochenende\",VLOOKUP(Aug.!$B35,Allgemein!$G$63:$H$64,2,FALSE),\"\")))","v":""},{"$f":"IF(Aug.!$C36=\"Anwesenheit\",Allgemein!$H$62,IF(Aug.!$C36=\"Fehlzeit\",VLOOKUP(Aug.!$M36,Allgemein!$I$50:$J$58,2,FALSE),IF(Aug.!$C36=\"Wochenende\",VLOOKUP(Aug.!$B36,Allgemein!$G$63:$H$64,2,FALSE),\"\")))","v":""},{"$f":"IF(Aug.!$C37=\"Anwesenheit\",Allgemein!$H$62,IF(Aug.!$C37=\"Fehlzeit\",VLOOKUP(Aug.!$M37,Allgemein!$I$50:$J$58,2,FALSE),IF(Aug.!$C37=\"Wochenende\",VLOOKUP(Aug.!$B37,Allgemein!$G$63:$H$64,2,FALSE),\"\")))","v":""},{"$f":"IF(Aug.!$C38=\"Anwesenheit\",Allgemein!$H$62,IF(Aug.!$C38=\"Fehlzeit\",VLOOKUP(Aug.!$M38,Allgemein!$I$50:$J$58,2,FALSE),IF(Aug.!$C38=\"Wochenende\",VLOOKUP(Aug.!$B38,Allgemein!$G$63:$H$64,2,FALSE),\"\")))","v":":"},{"$f":"IF(Aug.!$C39=\"Anwesenheit\",Allgemein!$H$62,IF(Aug.!$C39=\"Fehlzeit\",VLOOKUP(Aug.!$M39,Allgemein!$I$50:$J$58,2,FALSE),IF(Aug.!$C39=\"Wochenende\",VLOOKUP(Aug.!$B39,Allgemein!$G$63:$H$64,2,FALSE),\"\")))","v":"#"},{"$f":"IF(Aug.!$C40=\"Anwesenheit\",Allgemein!$H$62,IF(Aug.!$C40=\"Fehlzeit\",VLOOKUP(Aug.!$M40,Allgemein!$I$50:$J$58,2,FALSE),IF(Aug.!$C40=\"Wochenende\",VLOOKUP(Aug.!$B40,Allgemein!$G$63:$H$64,2,FALSE),\"\")))","v":""}]
["Ang./Aushilfe",{"$nulls":5},"Fastnachtsdienstag","2026-02-17",{"v":0,"d":"0.00"},null,"2023-09-01",{"$f":"IF(Sep.!$C10=\"Anwesenheit\",Allgemein!$H$62,IF(Sep.!$C10=\"Fehlzeit\",VLOOKUP(Sep.!$M10,Allgemein!$I$50:$J$58,2,FALSE),IF(Sep.!$C10=\"Wochenende\",VLOOKUP(Sep.!$B10,Allgemein!$G$63:$H$64,2,FALSE),\"\")))","v":""},{"$f":"IF(Sep.!$C11=\"Anwesenheit\",Allgemein!$H$62,IF(Sep.!$C11=\"Fehlzeit\",VLOOKUP(Sep.!$M11,Allgemein!$I$50:$J$58,2,FALSE),IF(Sep.!$C11=\"Wochenende\",VLOOKUP(Sep.!$B11,Allgemein!$G$63:$H$64,2,FALSE),\"\")))","v":""},{"$f":"IF(Sep.!$C12=\"Anwesenheit\",Allgemein!$H$62,IF(Sep.!$C12=\"Fehlzeit\",VLOOKUP(Sep.!$M12,Allgemein!$I$50:$J$58,2,FALSE),IF(Sep.!$C12=\"Wochenende\",VLOOKUP(Sep.!$B12,Allgemein!$G$63:$H$64,2,FALSE),\"\")))","v":""},{"$f":"IF(Sep.!$C13=\"Anwesenheit\",Allgemein!$H$62,IF(Sep.!$C13=\"Fehlzeit\",VLOOKUP(Sep.!$M13,Allgemein!$I$50:$J$58,2,FALSE),IF(Sep.!$C13=\"Wochenende\",VLOOKUP(Sep.!$B13,Allgemein!$G$63:$H$64,2,FALSE),\"\")))","v":""},{"$f":"IF(Sep.!$C14=\"Anwesenheit\",Allgemein!$H$62,IF(Sep.!$C14=\"Fehlzeit\",VLOOKUP(Sep.!$M14,Allgemein!$I$50:$J$58,2,FALSE),IF(Sep.!$C14=\"Wochenende\",VLOOKUP(Sep.!$B14,Allgemein!$G$63:$H$64,2,FALSE),\"\")))","v":":"},{"$f":"IF(Sep.!$C15=\"Anwesenheit\",Allgemein!$H$62,IF(Sep.!$C15=\"Fehlzeit\",VLOOKUP(Sep.!$M15,Allgemein!$I$50:$J$58,2,FALSE),IF(Sep.!$C15=\"Wochenende\",VLOOKUP(Sep.!$B15,Allgemein!$G$63:$H$64,2,FALSE),\"\")))","v":"#"},{"$f":"IF(Sep.!$C16=\"Anwesenheit\",Allgemein!$H$62,IF(Sep.!$C16=\"Fehlzeit\",VLOOKUP(Sep.!$M16,Allgemein!$I$50:$J$58,2,FALSE),IF(Sep.!$C16=\"Wochenende\",VLOOKUP(Sep.!$B16,Allgemein!$G$63:$H$64,2,FALSE),\"\")))","v":""},{"$f":"IF(Sep.!$C17=\"Anwesenheit\",Allgemein!$H$62,IF(Sep.!$C17=\"Fehlzeit\",VLOOKUP(Sep.!$M17,Allgemein!$I$50:$J$58,2,FALSE),IF(Sep.!$C17=\"Wochenende\",VLOOKUP(Sep.!$B17,Allgemein!$G$63:$H$64,2,FALSE),\"\")))","v":""},{"$f":"IF(Sep.!$C18=\"Anwesenheit\",Allgemein!$H$62,IF(Sep.!$C18=\"Fehlzeit\",VLOOKUP(Sep.!$M18,Allgemein!$I$50:$J$58,2,FALSE),IF(Sep.!$C18=\"Wochenende\",VLOOKUP(Sep.!$B18,Allgemein!$G$63:$H$64,2,FALSE),\"\")))","v":""},{"$f":"IF(Sep.!$C19=\"Anwesenheit\",Allgemein!$H$62,IF(Sep.!$C19=\"Fehlzeit\",VLOOKUP(Sep.!$M19,Allgemein!$I$50:$J$58,2,FALSE),IF(Sep.!$C19=\"Wochenende\",VLOOKUP(Sep.!$B19,Allgemein!$G$63:$H$64,2,FALSE),\"\")))","v":""},{"$f":"IF(Sep.!$C20=\"Anwesenheit\",Allgemein!$H$62,IF(Sep.!$C20=\"Fehlzeit\",VLOOKUP(Sep.!$M20,Allgemein!$I$50:$J$58,2,FALSE),IF(Sep.!$C20=\"Wochenende\",VLOOKUP(Sep.!$B20,Allgemein!$G$63:$H$64,2,FALSE),\"\")))","v":""},{"$f":"IF(Sep.!$C21=\"Anwesenheit\",Allgemein!$H$62,IF(Sep.!$C21=\"Fehlzeit\",VLOOKUP(Sep.!$M21,Allgemein!$I$50:$J$58,2,FALSE),IF(Sep.!$C21=\"Wochenende\",VLOOKUP(Sep.!$B21,Allgemein!$G$63:$H$64,2,FALSE),\"\")))","v":":"},{"$f":"IF(Sep.!$C22=\"Anwesenheit\",Allgemein!$H$62,IF(Sep.!$C22=\"Fehlzeit\",VLOOKUP(Sep.!$M22,Allgemein!$I$50:$J$58,2,FALSE),IF(Sep.!$C22=\"Wochenende\",VLOOKUP(Sep.!$B22,Allgemein!$G$63:$H$64,2,FALSE),\"\")))","v":"#"},{"$f":"IF(Sep.!$C23=\"Anwesenheit\",Allgemein!$H$62,IF(Sep.!$C23=\"Fehlzeit\",VLOOKUP(Sep.!$M23,Allgemein!$I$50:$J$58,2,FALSE),IF(Sep.!$C23=\"Wochenende\",VLOOKUP(Sep.!$B23,Allgemein!$G$63:$H$64,2,FALSE),\"\")))","v":""},{"$f":"IF(Sep.!$C24=\"Anwesenheit\",Allgemein!$H$62,IF(Sep.!$C24=\"Fehlzeit\",VLOOKUP(Sep.!$M24,Allgemein!$I$50:$J$58,2,FALSE),IF(Sep.!$C24=\"Wochenende\",VLOOKUP(Sep.!$B24,Allgemein!$G$63:$H$64,2,FALSE),\"\")))","v":""},{"$f":"IF(Sep.!$C25=\"Anwesenheit\",Allgemein!$H$62,IF(Sep.!$C25=\"Fehlzeit\",VLOOKUP(Sep.!$M25,Allgemein!$I$50:$J$58,2,FALSE),IF(Sep.!$C25=\"Wochenende\",VLOOKUP(Sep.!$B25,Allgemein!$G$63:$H$64,2,FALSE),\"\")))","v":""},{"$f":"IF(Sep.!$C26=\"Anwesenheit\",Allgemein!$H$62,IF(Sep.!$C26=\"Fehlzeit\",VLOOKUP(Sep.!$M26,Allgemein!$I$50:$J$58,2,FALSE),IF(Sep.!$C26=\"Wochenende\",VLOOKUP(Sep.!$B26,Allgemein!$G$63:$H$64,2,FALSE),\"\")))","v":""},{"$f":"IF(Sep.!$C27=\"Anwesenheit\",Allgemein!$H$62,IF(Sep.!$C27=\"Fehlzeit\",VLOOKUP(Sep.!$M27,Allgemein!$I$50:$J$58,2,FALSE),IF(Sep.!$C27=\"Wochenende\",VLOOKUP(Sep.!$B27,Allgemein!$G$63:$H$64,2,FALSE),\"\")))","v":""},{"$f":"IF(Sep.!$C28=\"Anwesenheit\",Allgemein!$H$62,IF(Sep.!$C28=\"Fehlzeit\",VLOOKUP(Sep.!$M28,Allgemein!$I$50:$J$58,2,FALSE),IF(Sep.!$C28=\"Wochenende\",VLOOKUP(Sep.!$B28,Allgemein!$G$63:$H$64,2,FALSE),\"\")))","v":":"},{"$f":"IF(Sep.!$C29=\"Anwesenheit\",Allgemein!$H$62,IF(Sep.!$C29=\"Fehlzeit\",VLOOKUP(Sep.!$M29,Allgemein!$I$50:$J$58,2,FALSE),IF(Sep.!$C29=\"Wochenende\",VLOOKUP(Sep.!$B29,Allgemein!$G$63:$H$64,2,FALSE),\"\")))","v":"#"},{"$f":"IF(Sep.!$C30=\"Anwesenheit\",Allgemein!$H$62,IF(Sep.!$C30=\"Fehlzeit\",VLOOKUP(Sep.!$M30,Allgemein!$I$50:$J$58,2,FALSE),IF(Sep.!$C30=\"Wochenende\",VLOOKUP(Sep.!$B30,Allgemein!$G$63:$H$64,2,FALSE),\"\")))","v":""},{"$f":"IF(Sep.!$C31=\"Anwesenheit\",Allgemein!$H$62,IF(Sep.!$C31=\"Fehlzeit\",VLOOKUP(Sep.!$M31,Allgemein!$I$50:$J$58,2,FALSE),IF(Sep.!$C31=\"Wochenende\",VLOOKUP(Sep.!$B31,Allgemein!$G$63:$H$64,2,FALSE),\"\")))","v":""},{"$f":"IF(Sep.!$C32=\"Anwesenheit\",Allgemein!$H$62,IF(Sep.!$C32=\"Fehlzeit\",VLOOKUP(Sep.!$M32,Allgemein!$I$50:$J$58,2,FALSE),IF(Sep.!$C32=\"Wochenende\",VLOOKUP(Sep.!$B32,Allgemein!$G$63:$H$64,2,FALSE),\"\")))","v":""},{"$f":"IF(Sep.!$C33=\"Anwesenheit\",Allgemein!$H$62,IF(Sep.!$C33=\"Fehlzeit\",VLOOKUP(Sep.!$M33,Allgemein!$I$50:$J$58,2,FALSE),IF(Sep.!$C33=\"Wochenende\",VLOOKUP(Sep.!$B33,Allgemein!$G$63:$H$64,2,FALSE),\"\")))","v":""},{"$f":"IF(Sep.!$C34=\"Anwesenheit\",Allgemein!$H$62,IF(Sep.!$C34=\"Fehlzeit\",VLOOKUP(Sep.!$M34,Allgemein!$I$50:$J$58,2,FALSE),IF(Sep.!$C34=\"Wochenende\",VLOOKUP(Sep.!$B34,Allgemein!$G$63:$H$64,2,FALSE),\"\")))","v":""},{"$f":"IF(Sep.!$C35=\"Anwesenheit\",Allgemein!$H$62,IF(Sep.!$C35=\"Fehlzeit\",VLOOKUP(Sep.!$M35,Allgemein!$I$50:$J$58,2,FALSE),IF(Sep.!$C35=\"Wochenende\",VLOOKUP(Sep.!$B35,Allgemein!$G$63:$H$64,2,FALSE),\"\")))","v":":"},{"$f":"IF(Sep.!$C36=\"Anwesenheit\",Allgemein!$H$62,IF(Sep.!$C36=\"Fehlzeit\",VLOOKUP(Sep.!$M36,Allgemein!$I$50:$J$58,2,FALSE),IF(Sep.!$C36=\"Wochenende\",VLOOKUP(Sep.!$B36,Allgemein!$G$63:$H$64,2,FALSE),\"\")))","v":"#"},{"$f":"IF(Sep.!$C37=\"Anwesenheit\",Allgemein!$H$62,IF(Sep.!$C37=\"Fehlzeit\",VLOOKUP(Sep.!$M37,Allgemein!$I$50:$J$58,2,FALSE),IF(Sep.!$C37=\"Wochenende\",VLOOKUP(Sep.!$B37,Allgemein!$G$63:$H$64,2,FALSE),\"\")))","v":""},{"$f":"IF(Sep.!$C38=\"Anwesenheit\",Allgemein!$H$62,IF(Sep.!$C38=\"Fehlzeit\",VLOOKUP(Sep.!$M38,Allgemein!$I$50:$J$58,2,FALSE),IF(Sep.!$C38=\"Wochenende\",VLOOKUP(Sep.!$B38,Allgemein!$G$63:$H$64,2,FALSE),\"\")))","v":""},{"$f":"IF(Sep.!$C39=\"Anwesenheit\",Allgemein!$H$62,IF(Sep.!$C39=\"Fehlzeit\",VLOOKUP(Sep.!$M39,Allgemein!$I$50:$J$58,2,FALSE),IF(Sep.!$C39=\"Wochenende\",VLOOKUP(Sep.!$B39,Allgemein!$G$63:$H$64,2,FALSE),\"\")))","v":""}]
["Ang./Azubi",{"$nulls":5},"Aschermittwoch","2026-02-18",{"v":0,"d":"0.00"},null,"2023-10-01",{"$f":"IF(Okt.!$C10=\"Anwesenheit\",Allgemein!$H$62,IF(Okt.!$C10=\"Fehlzeit\",VLOOKUP(Okt.!$M10,Allgemein!$I$50:$J$58,2,FALSE),IF(Okt.!$C10=\"Wochenende\",VLOOKUP(Okt.!$B10,Allgemein!$G$63:$H$64,2,FALSE),\"\")))","v":""},{"$f":"IF(Okt.!$C11=\"Anwesenheit\",Allgemein!$H$62,IF(Okt.!$C11=\"Fehlzeit\",VLOOKUP(Okt.!$M11,Allgemein!$I$50:$J$58,2,FALSE),IF(Okt.!$C11=\"Wochenende\",VLOOKUP(Okt.!$B11,Allgemein!$G$63:$H$64,2,FALSE),\"\")))","v":""},{"$f":"IF(Okt.!$C12=\"Anwesenheit\",Allgemein!$H$62,IF(Okt.!$C12=\"Fehlzeit\",VLOOKUP(Okt.!$M12,Allgemein!$I$50:$J$58,2,FALSE),IF(Okt.!$C12=\"Wochenende\",VLOOKUP(Okt.!$B12,Allgemein!$G$63:$H$64,2,FALSE),\"\")))","v":"F"},{"$f":"IF(Okt.!$C13=\"Anwesenheit\",Allgemein!$H$62,IF(Okt.!$C13=\"Fehlzeit\",VLOOKUP(Okt.!$M13,Allgemein!$I$50:$J$58,2,FALSE),IF(Okt.!$C13=\"Wochenende\",VLOOKUP(Okt.!$B13,Allgemein!$G$63:$H$64,2,FALSE),\"\")))","v":"#"},{"$f":"IF(Okt.!$C14=\"Anwesenheit\",Allgemein!$H$62,IF(Okt.!$C14=\"Fehlzeit\",VLOOKUP(Okt.!$M14,Allgemein!$I$50:$J$58,2,FALSE),IF(Okt.!$C14=\"Wochenende\",VLOOKUP(Okt.!$B14,Allgemein!$G$63:$H$64,2,FALSE),\"\")))","v":""},{"$f":"IF(Okt.!$C15=\"Anwesenheit\",Allgemein!$H$62,IF(Okt.!$C15=\"Fehlzeit\",VLOOKUP(Okt.!$M15,Allgemein!$I$50:$J$58,2,FALSE),IF(Okt.!$C15=\"Wochenende\",VLOOKUP(Okt.!$B15,Allgemein!$G$63:$H$64,2,FALSE),\"\")))","v":""},{"$f":"IF(Okt.!$C16=\"Anwesenheit\",Allgemein!$H$62,IF(Okt.!$C16=\"Fehlzeit\",VLOOKUP(Okt.!$M16,Allgemein!$I$50:$J$58,2,FALSE),IF(Okt.!$C16=\"Wochenende\",VLOOKUP(Okt.!$B16,Allgemein!$G$63:$H$64,2,FALSE),\"\")))","v":""},{"$f":"IF(Okt.!$C17=\"Anwesenheit\",Allgemein!$H$62,IF(Okt.!$C17=\"Fehlzeit\",VLOOKUP(Okt.!$M17,Allgemein!$I$50:$J$58,2,FALSE),IF(Okt.!$C17=\"Wochenende\",VLOOKUP(Okt.!$B17,Allgemein!$G$63:$H$64,2,FALSE),\"\")))","v":""},{"$f":"IF(Okt.!$C18=\"Anwesenheit\",Allgemein!$H$62,IF(Okt.!$C18=\"Fehlzeit\",VLOOKUP(Okt.!$M18,Allgemein!$I$50:$J$58,2,FALSE),IF(Okt.!$C18=\"Wochenende\",VLOOKUP(Okt.!$B18,Allgemein!$G$63:$H$64,2,FALSE),\"\")))","v":""},{"$f":"IF(Okt.!$C19=\"Anwesenheit\",Allgemein!$H$62,IF(Okt.!$C19=\"Fehlzeit\",VLOOKUP(Okt.!$M19,Allgemein!$I$50:$J$58,2,FALSE),IF(Okt.!$C19=\"Wochenende\",VLOOKUP(Okt.!$B19,Allgemein!$G$63:$H$64,2,FALSE),\"\")))","v":":"},{"$f":"IF(Okt.!$C20=\"Anwesenheit\",Allgemein!$H$62,IF(Okt.!$C20=\"Fehlzeit\",VLOOKUP(Okt.!$M20,Allgemein!$I$50:$J$58,2,FALSE),IF(Okt.!$C20=\"Wochenende\",VLOOKUP(Okt.!$B20,Allgemein!$G$63:$H$64,2,FALSE),\"\")))","v":"#"},{"$f":"IF(Okt.!$C21=\"Anwesenheit\",Allgemein!$H$62,IF(Okt.!$C21=\"Fehlzeit\",VLOOKUP(Okt.!$M21,Allgemein!$I$50:$J$58,2,FALSE),IF(Okt.!$C21=\"Wochenende\",VLOOKUP(Okt.!$B21,Allgemein!$G$63:$H$64,2,FALSE),\"\")))","v":""},{"$f":"IF(Okt.!$C22=\"Anwesenheit\",Allgemein!$H$62,IF(Okt.!$C22=\"Fehlzeit\",VLOOKUP(Okt.!$M22,Allgemein!$I$50:$J$58,2,FALSE),IF(Okt.!$C22=\"Wochenende\",VLOOKUP(Okt.!$B22,Allgemein!$G$63:$H$64,2,FALSE),\"\")))","v":""},{"$f":"IF(Okt.!$C23=\"Anwesenheit\",Allgemein!$H$62,IF(Okt.!$C23=\"Fehlzeit\",VLOOKUP(Okt.!$M23,Allgemein!$I$50:$J$58,2,FALSE),IF(Okt.!$C23=\"Wochenende\",VLOOKUP(Okt.!$B23,Allgemein!$G$63:$H$64,2,FALSE),\"\")))","v":""},{"$f":"IF(Okt.!$C24=\"Anwesenheit\",Allgemein!$H$62,IF(Okt.!$C24=\"Fehlzeit\",VLOOKUP(Okt.!$M24,Allgemein!$I$50:$J$58,2,FALSE),IF(Okt.!$C24=\"Wochenende\",VLOOKUP(Okt.!$B24,Allgemein!$G$63:$H$64,2,FALSE),\"\")))","v":""},{"$f":"IF(Okt.!$C25=\"Anwesenheit\",Allgemein!$H$62,IF(Okt.!$C25=\"Fehlzeit\",VLOOKUP(Okt.!$M25,Allgemein!$I$50:$J$58,2,FALSE),IF(Okt.!$C25=\"Wochenende\",VLOOKUP(Okt.!$B25,Allgemein!$G$63:$H$64,2,FALSE),\"\")))","v":""},{"$f":"IF(Okt.!$C26=\"Anwesenheit\",Allgemein!$H$62,IF(Okt.!$C26=\"Fehlzeit\",VLOOKUP(Okt.!$M26,Allgemein!$I$50:$J$58,2,FALSE),IF(Okt.!$C26=\"Wochenende\",VLOOKUP(Okt.!$B26,Allgemein!$G$63:$H$64,2,FALSE),\"\")))","v":":"},{"$f":"IF(Okt.!$C27=\"Anwesenheit\",Allgemein!$H$62,IF(Okt.!$C27=\"Fehlzeit\",VLOOKUP(Okt.!$M27,Allgemein!$I$50:$J$58,2,FALSE),IF(Okt.!$C27=\"Wochenende\",VLOOKUP(Okt.!$B27,Allgemein!$G$63:$H$64,2,FALSE),\"\")))","v":"#"},{"$f":"IF(Okt.!$C28=\"Anwesenheit\",Allgemein!$H$62,IF(Okt.!$C28=\"Fehlzeit\",VLOOKUP(Okt.!$M28,Allgemein!$I$50:$J$58,2,FALSE),IF(Okt.!$C28=\"Wochenende\",VLOOKUP(Okt.!$B28,Allgemein!$G$63:$H$64,2,FALSE),\"\")))","v":""},{"$f":"IF(Okt.!$C29=\"Anwesenheit\",Allgemein!$H$62,IF(Okt.!$C29=\"Fehlzeit\",VLOOKUP(Okt.!$M29,Allgemein!$I$50:$J$58,2,FALSE),IF(Okt.!$C29=\"Wochenende\",VLOOKUP(Okt.!$B29,Allgemein!$G$63:$H$64,2,FALSE),\"\")))","v":""},{"$f":"IF(Okt.!$C30=\"Anwesenheit\",Allgemein!$H$62,IF(Okt.!$C30=\"Fehlzeit\",VLOOKUP(Okt.!$M30,Allgemein!$I$50:$J$58,2,FALSE),IF(Okt.!$C30=\"Wochenende\",VLOOKUP(Okt.!$B30,Allgemein!$G$63:$H$64,2,FALSE),\"\")))","v":""},{"$f":"IF(Okt.!$C31=\"Anwesenheit\",Allgemein!$H$62,IF(Okt.!$C31=\"Fehlzeit\",VLOOKUP(Okt.!$M31,Allgemein!$I$50:$J$58,2,FALSE),IF(Okt.!$C31=\"Wochenende\",VLOOKUP(Okt.!$B31,Allgemein!$G$63:$H$64,2,FALSE),\"\")))","v":""},{"$f":"IF(Okt.!$C32=\"Anwesenheit\",Allgemein!$H$62,IF(Okt.!$C32=\"Fehlzeit\",VLOOKUP(Okt.!$M32,Allgemein!$I$50:$J$58,2,FALSE),IF(Okt.!$C32=\"Wochenende\",VLOOKUP(Okt.!$B32,Allgemein!$G$63:$H$64,2,FALSE),\"\")))","v":""},{"$f":"IF(Okt.!$C33=\"Anwesenheit\",Allgemein!$H$62,IF(Okt.!$C33=\"Fehlzeit\",VLOOKUP(Okt.!$M33,Allgemein!$I$50:$J$58,2,FALSE),IF(Okt.!$C33=\"Wochenende\",VLOOKUP(Okt.!$B33,Allgemein!$G$63:$H$64,2,FALSE),\"\")))","v":":"},{"$f":"IF(Okt.!$C34=\"Anwesenheit\",Allgemein!$H$62,IF(Okt.!$C34=\"Fehlzeit\",VLOOKUP(Okt.!$M34,Allgemein!$I$50:$J$58,2,FALSE),IF(Okt.!$C34=\"Wochenende\",VLOOKUP(Okt.!$B34,Allgemein!$G$63:$H$64,2,FALSE),\"\")))","v":"#"},{"$f":"IF(Okt.!$C35=\"Anwesenheit\",Allgemein!$H$62,IF(Okt.!$C35=\"Fehlzeit\",VLOOKUP(Okt.!$M35,Allgemein!$I$50:$J$58,2,FALSE),IF(Okt.!$C35=\"Wochenende\",VLOOKUP(Okt.!$B35,Allgemein!$G$63:$H$64,2,FALSE),\"\")))","v":""},{"$f":"IF(Okt.!$C36=\"Anwesenheit\",Allgemein!$H$62,IF(Okt.!$C36=\"Fehlzeit\",VLOOKUP(Okt.!$M36,Allgemein!$I$50:$J$58,2,FALSE),IF(Okt.!$C36=\"Wochenende\",VLOOKUP(Okt.!$B36,Allgemein!$G$63:$H$64,2,FALSE),\"\")))","v":""},{"$f":"IF(Okt.!$C37=\"Anwesenheit\",Allgemein!$H$62,IF(Okt.!$C37=\"Fehlzeit\",VLOOKUP(Okt.!$M37,Allgemein!$I$50:$J$58,2,FALSE),IF(Okt.!$C37=\"Wochenende\",VLOOKUP(Okt.!$B37,Allgemein!$G$63:$H$64,2,FALSE),\"\")))","v":""},{"$f":"IF(Okt.!$C38=\"Anwesenheit\",Allgemein!$H$62,IF(Okt.!$C38=\"Fehlzeit\",VLOOKUP(Okt.!$M38,Allgemein!$I$50:$J$58,2,FALSE),IF(Okt.!$C38=\"Wochenende\",VLOOKUP(Okt.!$B38,Allgemein!$G$63:$H$64,2,FALSE),\"\")))","v":""},{"$f":"IF(Okt.!$C39=\"Anwesenheit\",Allgemein!$H$62,IF(Okt.!$C39=\"Fehlzeit\",VLOOKUP(Okt.!$M39,Allgemein!$I$50:$J$58,2,FALSE),IF(Okt.!$C39=\"Wochenende\",VLOOKUP(Okt.!$B39,Allgemein!$G$63:$H$64,2,FALSE),\"\")))","v":""},{"$f":"IF(Okt.!$C40=\"Anwesenheit\",Allgemein!$H$62,IF(Okt.!$C40=\"Fehlzeit\",VLOOKUP(Okt.!$M40,Allgemein!$I$50:$J$58,2,FALSE),IF(Okt.!$C40=\"Wochenende\",VLOOKUP(Okt.!$B40,Allgemein!$G$63:$H$64,2,FALSE),\"\")))","v":":"}]
["Beamter",{"$nulls":5},"Internationaler Frauentag","2026-03-08",{"v":0,"d":"0.00"},null,"2023-11-01",{"$f":"IF(Nov.!$C10=\"Anwesenheit\",Allgemein!$H$62,IF(Nov.!$C10=\"Fehlzeit\",VLOOKUP(Nov.!$M10,Allgemein!$I$50:$J$58,2,FALSE),IF(Nov.!$C10=\"Wochenende\",VLOOKUP(Nov.!$B10,Allgemein!$G$63:$H$64,2,FALSE),\"\")))","v":"F"},{"$f":"IF(Nov.!$C11=\"Anwesenheit\",Allgemein!$H$62,IF(Nov.!$C11=\"Fehlzeit\",VLOOKUP(Nov.!$M11,Allgemein!$I$50:$J$58,2,FALSE),IF(Nov.!$C11=\"Wochenende\",VLOOKUP(Nov.!$B11,Allgemein!$G$63:$H$64,2,FALSE),\"\")))","v":""},{"$f":"IF(Nov.!$C12=\"Anwesenheit\",Allgemein!$H$62,IF(Nov.!$C12=\"Fehlzeit\",VLOOKUP(Nov.!$M12,Allgemein!$I$50:$J$58,2,FALSE),IF(Nov.!$C12=\"Wochenende\",VLOOKUP(Nov.!$B12,Allgemein!$G$63:$H$64,2,FALSE),\"\")))","v":""},{"$f":"IF(Nov.!$C13=\"Anwesenheit\",Allgemein!$H$62,IF(Nov.!$C13=\"Fehlzeit\",VLOOKUP(Nov.!$M13,Allgemein!$I$50:$J$58,2,FALSE),IF(Nov.!$C13=\"Wochenende\",VLOOKUP(Nov.!$B13,Allgemein!$G$63:$H$64,2,FALSE),\"\")))","v":""},{"$f":"IF(Nov.!$C14=\"Anwesenheit\",Allgemein!$H$62,IF(Nov.!$C14=\"Fehlzeit\",VLOOKUP(Nov.!$M14,Allgemein!$I$50:$J$58,2,FALSE),IF(Nov.!$C14=\"Wochenende\",VLOOKUP(Nov.!$B14,Allgemein!$G$63:$H$64,2,FALSE),\"\")))","v":""},{"$f":"IF(Nov.!$C15=\"Anwesenheit\",Allgemein!$H$62,IF(Nov.!$C15=\"Fehlzeit\",VLOOKUP(Nov.!$M15,Allgemein!$I$50:$J$58,2,FALSE),IF(Nov.!$C15=\"Wochenende\",VLOOKUP(Nov.!$B15,Allgemein!$G$63:$H$64,2,FALSE),\"\")))","v":""},{"$f":"IF(Nov.!$C16=\"Anwesenheit\",Allgemein!$H$62,IF(Nov.!$C16=\"Fehlzeit\",VLOOKUP(Nov.!$M16,Allgemein!$I$50:$J$58,2,FALSE),IF(Nov.!$C16=\"Wochenende\",VLOOKUP(Nov.!$B16,Allgemein!$G$63:$H$64,2,FALSE),\"\")))","v":":"},{"$f":"IF(Nov.!$C17=\"Anwesenheit\",Allgemein!$H$62,IF(Nov.!$C17=\"Fehlzeit\",VLOOKUP(Nov.!$M17,Allgemein!$I$50:$J$58,2,FALSE),IF(Nov.!$C17=\"Wochenende\",VLOOKUP(Nov.!$B17,Allgemein!$G$63:$H$64,2,FALSE),\"\")))","v":"#"},{"$f":"IF(Nov.!$C18=\"Anwesenheit\",Allgemein!$H$62,IF(Nov.!$C18=\"Fehlzeit\",VLOOKUP(Nov.!$M18,Allgemein!$I$50:$J$58,2,FALSE),IF(Nov.!$C18=\"Wochenende\",VLOOKUP(Nov.!$B18,Allgemein!$G$63:$H$64,2,FALSE),\"\")))","v":""},{"$f":"IF(Nov.!$C19=\"Anwesenheit\",Allgemein!$H$62,IF(Nov.!$C19=\"Fehlzeit\",VLOOKUP(Nov.!$M19,Allgemein!$I$50:$J$58,2,FALSE),IF(Nov.!$C19=\"Wochenende\",VLOOKUP(Nov.!$B19,Allgemein!$G$63:$H$64,2,FALSE),\"\")))","v":""},{"$f":"IF(Nov.!$C20=\"Anwesenheit\",Allgemein!$H$62,IF(Nov.!$C20=\"Fehlzeit\",VLOOKUP(Nov.!$M20,Allgemein!$I$50:$J$58,2,FALSE),IF(Nov.!$C20=\"Wochenende\",VLOOKUP(Nov.!$B20,Allgemein!$G$63:$H$64,2,FALSE),\"\")))","v":""},{"$f":"IF(Nov.!$C21=\"Anwesenheit\",Allgemein!$H$62,IF(Nov.!$C21=\"Fehlzeit\",VLOOKUP(Nov.!$M21,Allgemein!$I$50:$J$58,2,FALSE),IF(Nov.!$C21=\"Wochenende\",VLOOKUP(Nov.!$B21,Allgemein!$G$63:$H$64,2,FALSE),\"\")))","v":""},{"$f":"IF(Nov.!$C22=\"Anwesenheit\",Allgemein!$H$62,IF(Nov.!$C22=\"Fehlzeit\",VLOOKUP(Nov.!$M22,Allgemein!$I$50:$J$58,2,FALSE),IF(Nov.!$C22=\"Wochenende\",VLOOKUP(Nov.!$B22,Allgemein!$G$63:$H$64,2,FALSE),\"\")))","v":""},{"$f":"IF(Nov.!$C23=\"Anwesenheit\",Allgemein!$H$62,IF(Nov.!$C23=\"Fehlzeit\",VLOOKUP(Nov.!$M23,Allgemein!$I$50:$J$58,2,FALSE),IF(Nov.!$C23=\"Wochenende\",VLOOKUP(Nov.!$B23,Allgemein!$G$63:$H$64,2,FALSE),\"\")))","v":":"},{"$f":"IF(Nov.!$C24=\"Anwesenheit\",Allgemein!$H$62,IF(Nov.!$C24=\"Fehlzeit\",VLOOKUP(Nov.!$M24,Allgemein!$I$50:$J$58,2,FALSE),IF(Nov.!$C24=\"Wochenende\",VLOOKUP(Nov.!$B24,Allgemein!$G$63:$H$64,2,FALSE),\"\")))","v":"#"},{"$f":"IF(Nov.!$C25=\"Anwesenheit\",Allgemein!$H$62,IF(Nov.!$C25=\"Fehlzeit\",VLOOKUP(Nov.!$M25,Allgemein!$I$50:$J$58,2,FALSE),IF(Nov.!$C25=\"Wochenende\",VLOOKUP(Nov.!$B25,Allgemein!$G$63:$H$64,2,FALSE),\"\")))","v":""},{"$f":"IF(Nov.!$C26=\"Anwesenheit\",Allgemein!$H$62,IF(Nov.!$C26=\"Fehlzeit\",VLOOKUP(Nov.!$M26,Allgemein!$I$50:$J$58,2,FALSE),IF(Nov.!$C26=\"Wochenende\",VLOOKUP(Nov.!$B26,Allgemein!$G$63:$H$64,2,FALSE),\"\")))","v":""},{"$f":"IF(Nov.!$C27=\"Anwesenheit\",Allgemein!$H$62,IF(Nov.!$C27=\"Fehlzeit\",VLOOKUP(Nov.!$M27,Allgemein!$I$50:$J$58,2,FALSE),IF(Nov.!$C27=\"Wochenende\",VLOOKUP(Nov.!$B27,Allgemein!$G$63:$H$64,2,FALSE),\"\")))","v":""},{"$f":"IF(Nov.!$C28=\"Anwesenheit\",Allgemein!$H$62,IF(Nov.!$C28=\"Fehlzeit\",VLOOKUP(Nov.!$M28,Allgemein!$I$50:$J$58,2,FALSE),IF(Nov.!$C28=\"Wochenende\",VLOOKUP(Nov.!$B28,Allgemein!$G$63:$H$64,2,FALSE),\"\")))","v":""},{"$f":"IF(Nov.!$C29=\"Anwesenheit\",Allgemein!$H$62,IF(Nov.!$C29=\"Fehlzeit\",VLOOKUP(Nov.!$M29,Allgemein!$I$50:$J$58,2,FALSE),IF(Nov.!$C29=\"Wochenende\",VLOOKUP(Nov.!$B29,Allgemein!$G$63:$H$64,2,FALSE),\"\")))","v":""},{"$f":"IF(Nov.!$C30=\"Anwesenheit\",Allgemein!$H$62,IF(Nov.!$C30=\"Fehlzeit\",VLOOKUP(Nov.!$M30,Allgemein!$I$50:$J$58,2,FALSE),IF(Nov.!$C30=\"Wochenende\",VLOOKUP(Nov.!$B30,Allgemein!$G$63:$H$64,2,FALSE),\"\")))","v":":"},{"$f":"IF(Nov.!$C31=\"Anwesenheit\",Allgemein!$H$62,IF(Nov.!$C31=\"Fehlzeit\",VLOOKUP(Nov.!$M31,Allgemein!$I$50:$J$58,2,FALSE),IF(Nov.!$C31=\"Wochenende\",VLOOKUP(Nov.!$B31,Allgemein!$G$63:$H$64,2,FALSE),\"\")))","v":"#"},{"$f":"IF(Nov.!$C32=\"Anwesenheit\",Allgemein!$H$62,IF(Nov.!$C32=\"Fehlzeit\",VLOOKUP(Nov.!$M32,Allgemein!$I$50:$J$58,2,FALSE),IF(Nov.!$C32=\"Wochenende\",VLOOKUP(Nov.!$B32,Allgemein!$G$63:$H$64,2,FALSE),\"\")))","v":""},{"$f":"IF(Nov.!$C33=\"Anwesenheit\",Allgemein!$H$62,IF(Nov.!$C33=\"Fehlzeit\",VLOOKUP(Nov.!$M33,Allgemein!$I$50:$J$58,2,FALSE),IF(Nov.!$C33=\"Wochenende\",VLOOKUP(Nov.!$B33,Allgemein!$G$63:$H$64,2,FALSE),\"\")))","v":""},{"$f":"IF(Nov.!$C34=\"Anwesenheit\",Allgemein!$H$62,IF(Nov.!$C34=\"Fehlzeit\",VLOOKUP(Nov.!$M34,Allgemein!$I$50:$J$58,2,FALSE),IF(Nov.!$C34=\"Wochenende\",VLOOKUP(Nov.!$B34,Allgemein!$G$63:$H$64,2,FALSE),\"\")))","v":""},{"$f":"IF(Nov.!$C35=\"Anwesenheit\",Allgemein!$H$62,IF(Nov.!$C35=\"Fehlzeit\",VLOOKUP(Nov.!$M35,Allgemein!$I$50:$J$58,2,FALSE),IF(Nov.!$C35=\"Wochenende\",VLOOKUP(Nov.!$B35,Allgemein!$G$63:$H$64,2,FALSE),\"\")))","v":""},{"$f":"IF(Nov.!$C36=\"Anwesenheit\",Allgemein!$H$62,IF(Nov.!$C36=\"Fehlzeit\",VLOOKUP(Nov.!$M36,Allgemein!$I$50:$J$58,2,FALSE),IF(Nov.!$C36=\"Wochenende\",VLOOKUP(Nov.!$B36,Allgemein!$G$63:$H$64,2,FALSE),\"\")))","v":""},{"$f":"IF(Nov.!$C37=\"Anwesenheit\",Allgemein!$H$62,IF(Nov.!$C37=\"Fehlzeit\",VLOOKUP(Nov.!$M37,Allgemein!$I$50:$J$58,2,FALSE),IF(Nov.!$C37=\"Wochenende\",VLOOKUP(Nov.!$B37,Allgemein!$G$63:$H$64,2,FALSE),\"\")))","v":":"},{"$f":"IF(Nov.!$C38=\"Anwesenheit\",Allgemein!$H$62,IF(Nov.!$C38=\"Fehlzeit\",VLOOKUP(Nov.!$M38,Allgemein!$I$50:$J$58,2,FALSE),IF(Nov.!$C38=\"Wochenende\",VLOOKUP(Nov.!$B38,Allgemein!$G$63:$H$64,2,FALSE),\"\")))","v":"#"},{"$f":"IF(Nov.!$C39=\"Anwesenheit\",Allgemein!$H$62,IF(Nov.!$C39=\"Fehlzeit\",VLOOKUP(Nov.!$M39,Allgemein!$I$50:$J$58,2,FALSE),IF(Nov.!$C39=\"Wochenende\",VLOOKUP(Nov.!$B39,Allgemein!$G$63:$H$64,2,FALSE),\"\")))","v":""}]
[" ",{"$nulls":5},"Palmsonntag","2026-03-29",{"v":0,"d":"0.00"},null,"2023-12-01",{"$f":"IF(Dez.!$C10=\"Anwesenheit\",Allgemein!$H$62,IF(Dez.!$C10=\"Fehlzeit\",VLOOKUP(Dez.!$M10,Allgemein!$I$50:$J$58,2,FALSE),IF(Dez.!$C10=\"Wochenende\",VLOOKUP(Dez.!$B10,Allgemein!$G$63:$H$64,2,FALSE),\"\")))","v":""},{"$f":"IF(Dez.!$C11=\"Anwesenheit\",Allgemein!$H$62,IF(Dez.!$C11=\"Fehlzeit\",VLOOKUP(Dez.!$M11,Allgemein!$I$50:$J$58,2,FALSE),IF(Dez.!$C11=\"Wochenende\",VLOOKUP(Dez.!$B11,Allgemein!$G$63:$H$64,2,FALSE),\"\")))","v":""},{"$f":"IF(Dez.!$C12=\"Anwesenheit\",Allgemein!$H$62,IF(Dez.!$C12=\"Fehlzeit\",VLOOKUP(Dez.!$M12,Allgemein!$I$50:$J$58,2,FALSE),IF(Dez.!$C12=\"Wochenende\",VLOOKUP(Dez.!$B12,Allgemein!$G$63:$H$64,2,FALSE),\"\")))","v":""},{"$f":"IF(Dez.!$C13=\"Anwesenheit\",Allgemein!$H$62,IF(Dez.!$C13=\"Fehlzeit\",VLOOKUP(Dez.!$M13,Allgemein!$I$50:$J$58,2,FALSE),IF(Dez.!$C13=\"Wochenende\",VLOOKUP(Dez.!$B13,Allgemein!$G$63:$H$64,2,FALSE),\"\")))","v":""},{"$f":"IF(Dez.!$C14=\"Anwesenheit\",Allgemein!$H$62,IF(Dez.!$C14=\"Fehlzeit\",VLOOKUP(Dez.!$M14,Allgemein!$I$50:$J$58,2,FALSE),IF(Dez.!$C14=\"Wochenende\",VLOOKUP(Dez.!$B14,Allgemein!$G$63:$H$64,2,FALSE),\"\")))","v":":"},{"$f":"IF(Dez.!$C15=\"Anwesenheit\",Allgemein!$H$62,IF(Dez.!$C15=\"Fehlzeit\",VLOOKUP(Dez.!$M15,Allgemein!$I$50:$J$58,2,FALSE),IF(Dez.!$C15=\"Wochenende\",VLOOKUP(Dez.!$B15,Allgemein!$G$63:$H$64,2,FALSE),\"\")))","v":"#"},{"$f":"IF(Dez.!$C16=\"Anwesenheit\",Allgemein!$H$62,IF(Dez.!$C16=\"Fehlzeit\",VLOOKUP(Dez.!$M16,Allgemein!$I$50:$J$58,2,FALSE),IF(Dez.!$C16=\"Wochenende\",VLOOKUP(Dez.!$B16,Allgemein!$G$63:$H$64,2,FALSE),\"\")))","v":""},{"$f":"IF(Dez.!$C17=\"Anwesenheit\",Allgemein!$H$62,IF(Dez.!$C17=\"Fehlzeit\",VLOOKUP(Dez.!$M17,Allgemein!$I$50:$J$58,2,FALSE),IF(Dez.!$C17=\"Wochenende\",VLOOKUP(Dez.!$B17,Allgemein!$G$63:$H$64,2,FALSE),\"\")))","v":""},{"$f":"IF(Dez.!$C18=\"Anwesenheit\",Allgemein!$H$62,IF(Dez.!$C18=\"Fehlzeit\",VLOOKUP(Dez.!$M18,Allgemein!$I$50:$J$58,2,FALSE),IF(Dez.!$C18=\"Wochenende\",VLOOKUP(Dez.!$B18,Allgemein!$G$63:$H$64,2,FALSE),\"\")))","v":""},{"$f":"IF(Dez.!$C19=\"Anwesenheit\",Allgemein!$H$62,IF(Dez.!$C19=\"Fehlzeit\",VLOOKUP(Dez.!$M19,Allgemein!$I$50:$J$58,2,FALSE),IF(Dez.!$C19=\"Wochenende\",VLOOKUP(Dez.!$B19,Allgemein!$G$63:$H$64,2,FALSE),\"\")))","v":""},{"$f":"IF(Dez.!$C20=\"Anwesenheit\",Allgemein!$H$62,IF(Dez.!$C20=\"Fehlzeit\",VLOOKUP(Dez.!$M20,Allgemein!$I$50:$J$58,2,FALSE),IF(Dez.!$C20=\"Wochenende\",VLOOKUP(Dez.!$B20,Allgemein!$G$63:$H$64,2,FALSE),\"\")))","v":""},{"$f":"IF(Dez.!$C21=\"Anwesenheit\",Allgemein!$H$62,IF(Dez.!$C21=\"Fehlzeit\",VLOOKUP(Dez.!$M21,Allgemein!$I$50:$J$58,2,FALSE),IF(Dez.!$C21=\"Wochenende\",VLOOKUP(Dez.!$B21,Allgemein!$G$63:$H$64,2,FALSE),\"\")))","v":":"},{"$f":"IF(Dez.!$C22=\"Anwesenheit\",Allgemein!$H$62,IF(Dez.!$C22=\"Fehlzeit\",VLOOKUP(Dez.!$M22,Allgemein!$I$50:$J$58,2,FALSE),IF(Dez.!$C22=\"Wochenende\",VLOOKUP(Dez.!$B22,Allgemein!$G$63:$H$64,2,FALSE),\"\")))","v":"#"},{"$f":"IF(Dez.!$C23=\"Anwesenheit\",Allgemein!$H$62,IF(Dez.!$C23=\"Fehlzeit\",VLOOKUP(Dez.!$M23,Allgemein!$I$50:$J$58,2,FALSE),IF(Dez.!$C23=\"Wochenende\",VLOOKUP(Dez.!$B23,Allgemein!$G$63:$H$64,2,FALSE),\"\")))","v":""},{"$f":"IF(Dez.!$C24=\"Anwesenheit\",Allgemein!$H$62,IF(Dez.!$C24=\"Fehlzeit\",VLOOKUP(Dez.!$M24,Allgemein!$I$50:$J$58,2,FALSE),IF(Dez.!$C24=\"Wochenende\",VLOOKUP(Dez.!$B24,Allgemein!$G$63:$H$64,2,FALSE),\"\")))","v":""},{"$f":"IF(Dez.!$C25=\"Anwesenheit\",Allgemein!$H$62,IF(Dez.!$C25=\"Fehlzeit\",VLOOKUP(Dez.!$M25,Allgemein!$I$50:$J$58,2,FALSE),IF(Dez.!$C25=\"Wochenende\",VLOOKUP(Dez.!$B25,Allgemein!$G$63:$H$64,2,FALSE),\"\")))","v":""},{"$f":"IF(Dez.!$C26=\"Anwesenheit\",Allgemein!$H$62,IF(Dez.!$C26=\"Fehlzeit\",VLOOKUP(Dez.!$M26,Allgemein!$I$50:$J$58,2,FALSE),IF(Dez.!$C26=\"Wochenende\",VLOOKUP(Dez.!$B26,Allgemein!$G$63:$H$64,2,FALSE),\"\")))","v":""},{"$f":"IF(Dez.!$C27=\"Anwesenheit\",Allgemein!$H$62,IF(Dez.!$C27=\"Fehlzeit\",VLOOKUP(Dez.!$M27,Allgemein!$I$50:$J$58,2,FALSE),IF(Dez.!$C27=\"Wochenende\",VLOOKUP(Dez.!$B27,Allgemein!$G$63:$H$64,2,FALSE),\"\")))","v":""},{"$f":"IF(Dez.!$C28=\"Anwesenheit\",Allgemein!$H$62,IF(Dez.!$C28=\"Fehlzeit\",VLOOKUP(Dez.!$M28,Allgemein!$I$50:$J$58,2,FALSE),IF(Dez.!$C28=\"Wochenende\",VLOOKUP(Dez.!$B28,Allgemein!$G$63:$H$64,2,FALSE),\"\")))","v":":"},{"$f":"IF(Dez.!$C29=\"Anwesenheit\",Allgemein!$H$62,IF(Dez.!$C29=\"Fehlzeit\",VLOOKUP(Dez.!$M29,Allgemein!$I$50:$J$58,2,FALSE),IF(Dez.!$C29=\"Wochenende\",VLOOKUP(Dez.!$B29,Allgemein!$G$63:$H$64,2,FALSE),\"\")))","v":"#"},{"$f":"IF(Dez.!$C30=\"Anwesenheit\",Allgemein!$H$62,IF(Dez.!$C30=\"Fehlzeit\",VLOOKUP(Dez.!$M30,Allgemein!$I$50:$J$58,2,FALSE),IF(Dez.!$C30=\"Wochenende\",VLOOKUP(Dez.!$B30,Allgemein!$G$63:$H$64,2,FALSE),\"\")))","v":""},{"$f":"IF(Dez.!$C31=\"Anwesenheit\",Allgemein!$H$62,IF(Dez.!$C31=\"Fehlzeit\",VLOOKUP(Dez.!$M31,Allgemein!$I$50:$J$58,2,FALSE),IF(Dez.!$C31=\"Wochenende\",VLOOKUP(Dez.!$B31,Allgemein!$G$63:$H$64,2,FALSE),\"\")))","v":""},{"$f":"IF(Dez.!$C32=\"Anwesenheit\",Allgemein!$H$62,IF(Dez.!$C32=\"Fehlzeit\",VLOOKUP(Dez.!$M32,Allgemein!$I$50:$J$58,2,FALSE),IF(Dez.!$C32=\"Wochenende\",VLOOKUP(Dez.!$B32,Allgemein!$G$63:$H$64,2,FALSE),\"\")))","v":""},{"$f":"IF(Dez.!$C33=\"Anwesenheit\",Allgemein!$H$62,IF(Dez.!$C33=\"Fehlzeit\",VLOOKUP(Dez.!$M33,Allgemein!$I$50:$J$58,2,FALSE),IF(Dez.!$C33=\"Wochenende\",VLOOKUP(Dez.!$B33,Allgemein!$G$63:$H$64,2,FALSE),\"\")))","v":"F"},{"$f":"IF(Dez.!$C34=\"Anwesenheit\",Allgemein!$H$62,IF(Dez.!$C34=\"Fehlzeit\",VLOOKUP(Dez.!$M34,Allgemein!$I$50:$J$58,2,FALSE),IF(Dez.!$C34=\"Wochenende\",VLOOKUP(Dez.!$B34,Allgemein!$G$63:$H$64,2,FALSE),\"\")))","v":"F"},{"$f":"IF(Dez.!$C35=\"Anwesenheit\",Allgemein!$H$62,IF(Dez.!$C35=\"Fehlzeit\",VLOOKUP(Dez.!$M35,Allgemein!$I$50:$J$58,2,FALSE),IF(Dez.!$C35=\"Wochenende\",VLOOKUP(Dez.!$B35,Allgemein!$G$63:$H$64,2,FALSE),\"\")))","v":"F"},{"$f":"IF(Dez.!$C36=\"Anwesenheit\",Allgemein!$H$62,IF(Dez.!$C36=\"Fehlzeit\",VLOOKUP(Dez.!$M36,Allgemein!$I$50:$J$58,2,FALSE),IF(Dez.!$C36=\"Wochenende\",VLOOKUP(Dez.!$B36,Allgemein!$G$63:$H$64,2,FALSE),\"\")))","v":"#"},{"$f":"IF(Dez.!$C37=\"Anwesenheit\",Allgemein!$H$62,IF(Dez.!$C37=\"Fehlzeit\",VLOOKUP(Dez.!$M37,Allgemein!$I$50:$J$58,2,FALSE),IF(Dez.!$C37=\"Wochenende\",VLOOKUP(Dez.!$B37,Allgemein!$G$63:$H$64,2,FALSE),\"\")))","v":""},{"$f":"IF(Dez.!$C38=\"Anwesenheit\",Allgemein!$H$62,IF(Dez.!$C38=\"Fehlzeit\",VLOOKUP(Dez.!$M38,Allgemein!$I$50:$J$58,2,FALSE),IF(Dez.!$C38=\"Wochenende\",VLOOKUP(Dez.!$B38,Allgemein!$G$63:$H$64,2,FALSE),\"\")))","v":""},{"$f":"IF(Dez.!$C39=\"Anwesenheit\",Allgemein!$H$62,IF(Dez.!$C39=\"Fehlzeit\",VLOOKUP(Dez.!$M39,Allgemein!$I$50:$J$58,2,FALSE),IF(Dez.!$C39=\"Wochenende\",VLOOKUP(Dez.!$B39,Allgemein!$G$63:$H$64,2,FALSE),\"\")))","v":""},{"$f":"IF(Dez.!$C40=\"Anwesenheit\",Allgemein!$H$62,IF(Dez.!$C40=\"Fehlzeit\",VLOOKUP(Dez.!$M40,Allgemein!$I$50:$J$58,2,FALSE),IF(Dez.!$C40=\"Wochenende\",VLOOKUP(Dez.!$B40,Allgemein!$G$63:$H$64,2,FALSE),\"\")))","v":"F"}]
["Personalangaben",{"$nulls":5},"Gründonnerstag","2026-04-02",{"v":0,"d":"0.00"}]
["Geschlecht","Titel","Region",{"$nulls":3},"Karfreitag","2026-04-03",{"v":1,"d":"1.00"}]
["Bitte auswählen","Bitte auswählen","Bitte auswählen",{"$nulls":3},"Karsamstag","2026-04-04",{"v":0,"d":"0.00"}]
["divers","Dipl. Ing.","Baden-Württemberg",{"$nulls":3},"Ostersonntag","2026-04-05",{"v":1,"d":"1.00"}]
["männlich","Dipl. Kfm.","Bayern",{"$nulls":3},"Ostermontag","2026-05-06",{"v":1,"d":"1.00"}]
["weiblich","Dipl. Wirtsch.-Ing.","Berlin",{"$nulls":3},"Walpurgisnacht","2026-04-30",{"v":0,"d":"0.00"}]
[" ","Dr.","Brandenburg",{"$nulls":3},"Tag der Arbeit","2026-05-01",{"v":1,"d":"1.00"}]
[null,"Dr. med.","Bremen",{"$nulls":3},"Muttertag","2026-05-10",{"v":0,"d":"0.00"}]
[null,"Dr.-Ing.","Hamburg",{"$nulls":3},"Christi Himmelfahrt / Vatertag","2026-05-14",{"v":1,"d":"1.00"}]
[null,"Ing.","Hessen",{"$nulls":3},"Pfingstsonntag","2026-05-24",{"v":1,"d":"1.00"}]
[null,"Prof.","Mecklenburg-Vorpommern",{"$nulls":3},"Pfingstmontag","2026-05-25",{"v":1,"d":"1.00"}]
[null,"Prof. Dr.","Niedersachsen",{"$nulls":3},"Internationaler Kindertag","2026-06-01",{"v":0,"d":"0.00"}]
[null,"Prof. Dr.-Ing.","Nordrhein-Westfalen",{"$nulls":3},"Fronleichnam","2026-06-04",{"v":1,"d":"1.00"}]
[null," ","Rheinland-Pfalz",{"$nulls":3},"Augsburger Friedensfest","2026-08-08",{"v":0,"d":"0.00"}]
[null,null,"Saarland",{"$nulls":3},"Mariä Himmelfahrt","2026-08-15",{"v":1,"d":"1.00"}]
[null,null,"Sachsen",{"$nulls":3},"Weltkindertag","2026-09-20",{"v":0,"d":"0.00"}]
[null,null,"Sachsen-Anhalt",{"$nulls":3},"Tag der deutschen Einheit","2026-10-03",{"v":1,"d":"1.00"}]
[null,null,"Schleswig-Holstein",{"$nulls":3},"Reformationstag","2026-10-31",{"v":0,"d":"0.00"}]
[null,null,"Thüringen",{"$nulls":3},"Allerheiligen","2026-11-01",{"v":1,"d":"1.00"}]
[null,null," ",{"$nulls":3},"Allerseelen","2026-11-02",{"v":0,"d":"0.00"}]
[{"$nulls":6},"Volkstrauertag","2026-11-15",{"v":0,"d":"0.00"}]
[{"$nulls":6},"Buß- und Bettag","2026-11-18",{"v":0,"d":"0.00"}]
[{"$nulls":6},"Totensonntag","2026-11-22",{"v":0,"d":"0.00"}]
[{"$nulls":6},"Heiligabend","2026-12-24",{"v":0.5,"d":"0.50"}]
[{"$nulls":6},"1. Weihnachtsfeiertag","2026-12-25",{"v":1,"d":"1.00"}]
[{"$nulls":6},"2. Weihnachtsfeiertag","2026-12-26",{"v":1,"d":"1.00"}]
[{"$nulls":6},"Silvester","2026-12-31",{"v":0.5,"d":"0.50"}]
[]
[{"$nulls":6},"Einzelbuchungen / Kalendarium"]
[{"$nulls":6},"Art","Arbeitsort","Fehlzeitenart","Kürzel"]
[{"$nulls":6},"Bitte auswählen","Büro","Bitte auswählen","-"]
[{"$nulls":6},"Anwesenheit","Homeoffice","Urlaub","U"]
[{"$nulls":6},"Fehlzeit","Mobiles Arbeiten","Krankheit","K"]
[{"$nulls":6},"Wochenende",null,"Kurzarbeit","KU"]
[{"$nulls":8},"Mutterschutz","MS"]
[{"$nulls":8},"Fortbildung","FB"]
[{"$nulls":8},"Elternzeit","EZ"]
[{"$nulls":8},"Gleittag","G"]
[{"$nulls":8},"Schule","S"]
[{"$nulls":8},"Feiertag","F"]
[]
[{"$nulls":6},"Kalendarium"]
[{"$nulls":6},"Art","Kürzel"]
[{"$nulls":6},"Anwesenheit","A"]
[{"$nulls":6},"Samstag",":"]
[{"$nulls":6},"Sonntag","#"]

{"sheet":"Personalstamm","index":1,"n_rows":29,"n_cols":9,"rows_kept":29,"merged":[[5,0,5,1],[5,3,5,5],[5,7,5,8],[14,0,14,1],[16,3,16,4],[18,7,18,8],[21,3,21,5]]}
[]
[]
[]
[]
[]
["Allgemein",null,null,"Verrechnung",{"$nulls":3},"Urlaub"]
["Personalnummer",null,null,"Wochentag","Sollstunden","FZ-Gutschrift",null,"Kontenart","Anzahl Tage"]
["Name, Vorname",null,null,"Montag",{"v":8,"d":"8.00"},{"v":8,"d":"8.00"},null,"Urlaubsvortrag",{"v":2,"d":"2.00"}]
["Beschäftigungsart",{"$f":"IF($B$7<>\"\",\"Bitte auswählen\",\"\")","v":""},null,"Dienstag",{"v":8,"d":"8.00"},{"v":8,"d":"8.00"},null,"Jahresanspruch",{"v":30,"d":"30.00"}]
["Funktion",{"$f":"IF($B$7<>\"\",\"Bitte auswählen\",\"\")","v":""},null,"Mittwoch",{"v":8,"d":"8.00"},{"v":8,"d":"8.00"},null,"Zusatzurlaub",{"v":0,"d":"0.00"}]
["Firma",{"$f":"IF($B$7<>\"\",\"Bitte auswählen\",\"\")","v":""},null,"Donnerstag",{"v":8,"d":"8.00"},{"v":8,"d":"8.00"},null,"Sonderurlaub",{"v":0,"d":"0.00"}]
["Werk",{"$f":"IF($B$7<>\"\",\"Bitte auswählen\",\"\")","v":""},null,"Freitag",{"v":8,"d":"8.00"},{"v":8,"d":"8.00"},null,"Anspruch gesamt",{"$f":"SUM(I8:I11)","v":{"v":32,"d":"32.00"}}]
["Abteilung",{"$f":"IF($B$7<>\"\",\"Bitte auswählen\",\"\")","v":""},null,"Samstag",{"v":0,"d":"0.00"},{"v":0,"d":"0.00"},null,"Urlaub gekappt",{"v":2,"d":"2.00"}]
[{"$nulls":3},"Sonntag",{"v":0,"d":"0.00"},{"v":0,"d":"0.00"},null,"Urlaub genommen",{"$f":"Jan.!$D$6+Feb.!$D$6+Mrz.!$D$6+Apr.!$D$6+Mai!$D$6+Jun.!$D$6+Jul.!$D$6+Aug.!$D$6+Sep.!$D$6+Okt.!$D$6+Nov.!$D$6+Dez.!$D$6","v":{"v":0,"d":"0.00"}}]
["Personalangaben",null,null,"Summe",{"$f":"SUM(E8:E14)","v":{"v":40,"d":"40.00"}},{"$f":"SUM(F8:F14)","v":{"v":40,"d":"40.00"}},null,"Resturlaub",{"$f":"I12-I13-I14","v":{"v":30,"d":"30.00"}}]
["Geschlecht",{"$f":"IF($B$7<>\"\",\"Bitte auswählen\",\"\")","v":""},{"$nulls":5},"Urlaub geplant",{"$f":"Jan.!$I$44+Feb.!$I$41+Mrz.!$I$44+Apr.!$I$43+Mai!$I$44+Jun.!$I$43+Jul.!$I$44+Aug.!$I$44+Sep.!$I$43+Okt.!$I$44+Nov.!$I$43+Dez.!$I$44","v":{"v":0,"d":"0.00"}}]
["Titel",{"$f":"IF($B$7<>\"\",\"Bitte auswählen\",\"\")","v":""},null,"Pausen",{"$nulls":3},"Urlaub offen",{"$f":"I15-I16","v":{"v":30,"d":"30.00"}}]
["Straße",null,null,"Ab Stunde","Abzug"]
["PLZ Ort",null,null,{"v":6,"d":"6.00"},{"v":0.5,"d":"0.50"},null,null,"Zeitkonten"]
["Region",{"$f":"IF($B$7<>\"\",\"Bitte auswählen\",\"\")","v":""},null,{"v":9,"d":"9.00"},0.75,null,null,"Kontenart","Anzahl Stunden"]
["Durchwahl",{"$nulls":6},"Saldovortrag",{"v":0,"d":"0.00"}]
["Telefonnummer",null,null,"Ampelkonto"]
["Mobilfunknummer",null,null,"Farbe","Negativ","Positiv"]
["E-Mail-Adresse",null,null,"Grün",{"v":0,"d":"0.00"},{"v":0,"d":"0.00"}]
["KFZ-Kennzeichen",null,null,"Gelb",{"v":-10,"d":"-10.00"},{"v":30,"d":"30.00"}]
["Geburtsdatum",null,null,"Rot",{"v":-20,"d":"-20.00"},{"v":50,"d":"50.00"}]
["Eintrittsdatum",{"$f":"IF($B$7<>\"\",TODAY(),\"\")","v":""}]
["Austrittsdatum"]
["Bemerkung"]

{"sheet":"Zeitkonten","index":2,"n_rows":19,"n_cols":7,"rows_kept":19}
[]
[]
[]
[]
[]
["Monat","Bruttoarbeitszeit","Pause","Nettoarbeitszeit","Fehlstunden","Sollstunden","Saldoänderung"]
["2026-01-01",{"$f":"Jan.!$I$41","v":{"v":0,"d":"0.00"}},{"$f":"Jan.!$J$41+Jan.!$K$41","v":{"v":0,"d":"0.00"}},{"$f":"Jan.!$L$41","v":{"v":0,"d":"0.00"}},{"$f":"Jan.!$N$41","v":{"v":16,"d":"16.00"}},{"$f":"Jan.!$O$41","v":{"v":176,"d":"176.00"}},{"$f":"Jan.!$P$41","v":{"v":0,"d":"0.00"}}]
["2026-02-01",{"$f":"Feb.!$I$38","v":{"v":0,"d":"0.00"}},{"$f":"Feb.!$J$38+Feb.!$K$38","v":{"v":0,"d":"0.00"}},{"$f":"Feb.!$L$38","v":{"v":0,"d":"0.00"}},{"$f":"Feb.!$N$38","v":{"v":0,"d":"0.00"}},{"$f":"Feb.!$O$38","v":{"v":160,"d":"160.00"}},{"$f":"Feb.!$P$38","v":{"v":0,"d":"0.00"}}]
["2026-03-01",{"$f":"Mrz.!$I$41","v":{"v":0,"d":"0.00"}},{"$f":"Mrz.!$J$41+Mrz.!$K$41","v":{"v":0,"d":"0.00"}},{"$f":"Mrz.!$L$41","v":{"v":0,"d":"0.00"}},{"$f":"Mrz.!$N$41","v":{"v":0,"d":"0.00"}},{"$f":"Mrz.!$O$41","v":{"v":176,"d":"176.00"}},{"$f":"Mrz.!$P$41","v":{"v":0,"d":"0.00"}}]
["2026-04-01",{"$f":"Apr.!$I$40","v":{"v":0,"d":"0.00"}},{"$f":"Apr.!$J$40+Apr.!$K$40","v":{"v":0,"d":"0.00"}},{"$f":"Apr.!$L$40","v":{"v":0,"d":"0.00"}},{"$f":"Apr.!$N$40","v":{"v":8,"d":"8.00"}},{"$f":"Apr.!$O$40","v":{"v":176,"d":"176.00"}},{"$f":"Apr.!$P$40","v":{"v":0,"d":"0.00"}}]
["2026-05-01",{"$f":"Mai!$I$41","v":{"v":0,"d":"0.00"}},{"$f":"Mai!$J$41+Mai!$K$41","v":{"v":0,"d":"0.00"}},{"$f":"Mai!$L$41","v":{"v":0,"d":"0.00"}},{"$f":"Mai!$N$41","v":{"v":32,"d":"32.00"}},{"$f":"Mai!$O$41","v":{"v":168,"d":"168.00"}},{"$f":"Mai!$P$41","v":{"v":0,"d":"0.00"}}]
["2026-06-01",{"$f":"Jun.!$I$40","v":{"v":0,"d":"0.00"}},{"$f":"Jun.!$J$40+Jun.!$K$40","v":{"v":0,"d":"0.00"}},{"$f":"Jun.!$L$40","v":{"v":0,"d":"0.00"}},{"$f":"Jun.!$N$40","v":{"v":8,"d":"8.00"}},{"$f":"Jun.!$O$40","v":{"v":176,"d":"176.00"}},{"$f":"Jun.!$P$40","v":{"v":0,"d":"0.00"}}]
["2026-07-01",{"$f":"Jul.!$I$41","v":{"v":0,"d":"0.00"}},{"$f":"Jul.!$J41+Jul.!$K41","v":{"v":0,"d":"0.00"}},{"$f":"Jul.!$L$41","v":{"v":0,"d":"0.00"}},{"$f":"Jul.!$N$41","v":{"v":0,"d":"0.00"}},{"$f":"Jul.!$O$41","v":{"v":184,"d":"184.00"}},{"$f":"Jul.!$P$41","v":{"v":0,"d":"0.00"}}]
["2026-08-01",{"$f":"Aug.!$I$41","v":{"v":0,"d":"0.00"}},{"$f":"Aug.!J41+Aug.!$K$41","v":{"v":0,"d":"0.00"}},{"$f":"Aug.!$L$41","v":{"v":0,"d":"0.00"}},{"$f":"Aug.!$N$41","v":{"v":0,"d":"0.00"}},{"$f":"Aug.!$O$41","v":{"v":168,"d":"168.00"}},{"$f":"Aug.!$P$41","v":{"v":0,"d":"0.00"}}]
["2026-09-01",{"$f":"Sep.!$I$40","v":{"v":0,"d":"0.00"}},{"$f":"Sep.!J40+Sep.!$K$40","v":{"v":0,"d":"0.00"}},{"$f":"Sep.!$L$40","v":{"v":0,"d":"0.00"}},{"$f":"Sep.!$N$40","v":{"v":0,"d":"0.00"}},{"$f":"Sep.!$O$40","v":{"v":176,"d":"176.00"}},{"$f":"Sep.!$P$40","v":{"v":0,"d":"0.00"}}]
["2026-10-01",{"$f":"Okt.!$I$41","v":{"v":0,"d":"0.00"}},{"$f":"Okt.!$J$41+Okt.!$K$41","v":{"v":0,"d":"0.00"}},{"$f":"Okt.!$L$41","v":{"v":0,"d":"0.00"}},{"$f":"Okt.!$N$41","v":{"v":0,"d":"0.00"}},{"$f":"Okt.!$O$41","v":{"v":176,"d":"176.00"}},{"$f":"Okt.!$P$41","v":{"v":0,"d":"0.00"}}]
["2026-11-01",{"$f":"Nov.!$I$40","v":{"v":0,"d":"0.00"}},{"$f":"Nov.!$J$40+Nov.!$K$40","v":{"v":0,"d":"0.00"}},{"$f":"Nov.!$L$40","v":{"v":0,"d":"0.00"}},{"$f":"Nov.!$N$40","v":{"v":0,"d":"0.00"}},{"$f":"Nov.!$O$40","v":{"v":168,"d":"168.00"}},{"$f":"Nov.!$P$40","v":{"v":0,"d":"0.00"}}]
["2026-12-01",{"$f":"Dez.!$I$41","v":{"v":0,"d":"0.00"}},{"$f":"Dez.!$J$41+Dez.!$K$41","v":{"v":0,"d":"0.00"}},{"$f":"Dez.!$L$42","v":{"v":0,"d":"0.00"}},{"$f":"Dez.!$N$41","v":{"v":16,"d":"16.00"}},{"$f":"Dez.!$O$41","v":{"v":184,"d":"184.00"}},{"$f":"Dez.!$P$41","v":{"v":0,"d":"0.00"}}]
["Summe",{"$f":"SUM(B7:B18)","v":{"v":0,"d":"0.00"}},{"v":0,"d":"0.00"},{"v":0,"d":"0.00"},{"v":80,"d":"80.00"},{"v":2088,"d":"2088.00"},{"v":0,"d":"0.00"}]

{"sheet":"Fehlzeiten","index":3,"n_rows":19,"n_cols":10,"rows_kept":19}
[]
[]
[]
[]
[]
["Monat","Urlaub","Krankheit","Kurzarbeit","Mutterschutz","Fortbildung","Elternzeit","Gleittag","Schule","Feiertag"]
["2026-01-01",{"$f":"Jan.!$F$44","v":{"v":0,"d":"0.00"}},{"$f":"Jan.!$F$45","v":{"v":0,"d":"0.00"}},{"$f":"Jan.!$F$46","v":{"v":0,"d":"0.00"}},{"$f":"Jan.!$F$47","v":{"v":0,"d":"0.00"}},{"$f":"Jan.!$F$48","v":{"v":0,"d":"0.00"}},{"$f":"Jan.!$F$49","v":{"v":0,"d":"0.00"}},{"$f":"Jan.!$F$50","v":{"v":0,"d":"0.00"}},{"$f":"Jan.!$F$51","v":{"v":0,"d":"0.00"}},{"$f":"Jan.!$F$52","v":{"v":16,"d":"16.00"}}]
["2026-02-01",{"$f":"Feb.!$F$41","v":{"v":0,"d":"0.00"}},{"$f":"Feb.!$F$42","v":{"v":0,"d":"0.00"}},{"$f":"Feb.!$F$43","v":{"v":0,"d":"0.00"}},{"$f":"Feb.!$F$44","v":{"v":0,"d":"0.00"}},{"$f":"Feb.!$F$45","v":{"v":0,"d":"0.00"}},{"$f":"Feb.!$F$46","v":{"v":0,"d":"0.00"}},{"$f":"Feb.!$F$47","v":{"v":0,"d":"0.00"}},{"$f":"Feb.!$F$48","v":{"v":0,"d":"0.00"}},{"$f":"Feb.!$F$49","v":{"v":0,"d":"0.00"}}]
["2026-03-01",{"$f":"Mrz.!$F$44","v":{"v":0,"d":"0.00"}},{"$f":"Mrz.!$F$45","v":{"v":0,"d":"0.00"}},{"$f":"Mrz.!$F$46","v":{"v":0,"d":"0.00"}},{"$f":"Mrz.!$F$47","v":{"v":0,"d":"0.00"}},{"$f":"Mrz.!$F$48","v":{"v":0,"d":"0.00"}},{"$f":"Mrz.!$F$49","v":{"v":0,"d":"0.00"}},{"$f":"Mrz.!$F$50","v":{"v":0,"d":"0.00"}},{"$f":"Mrz.!$F$51","v":{"v":0,"d":"0.00"}},{"$f":"Mrz.!$F$52","v":{"v":0,"d":"0.00"}}]
["2026-04-01",{"$f":"Apr.!$F$43","v":{"v":0,"d":"0.00"}},{"$f":"Apr.!$F$44","v":{"v":0,"d":"0.00"}},{"$f":"Apr.!$F$45","v":{"v":0,"d":"0.00"}},{"$f":"Apr.!$F$46","v":{"v":0,"d":"0.00"}},{"$f":"Apr.!$F$47","v":{"v":0,"d":"0.00"}},{"$f":"Apr.!$F$48","v":{"v":0,"d":"0.00"}},{"$f":"Apr.!$F$49","v":{"v":0,"d":"0.00"}},{"$f":"Apr.!$F$50","v":{"v":0,"d":"0.00"}},{"$f":"Apr.!$F$51","v":{"v":8,"d":"8.00"}}]
["2026-05-01",{"$f":"Mai!$F$44","v":{"v":0,"d":"0.00"}},{"$f":"Mai!$F$45","v":{"v":0,"d":"0.00"}},{"$f":"Mai!$F$46","v":{"v":0,"d":"0.00"}},{"$f":"Mai!$F$47","v":{"v":0,"d":"0.00"}},{"$f":"Mai!$F$48","v":{"v":0,"d":"0.00"}},{"$f":"Mai!$F$49","v":{"v":0,"d":"0.00"}},{"$f":"Mai!$F$50","v":{"v":0,"d":"0.00"}},{"$f":"Mai!$F$51","v":{"v":0,"d":"0.00"}},{"$f":"Mai!$F$52","v":{"v":32,"d":"32.00"}}]
["2026-06-01",{"$f":"Jun.!$F$43","v":{"v":0,"d":"0.00"}},{"$f":"Jun.!$F$44","v":{"v":0,"d":"0.00"}},{"$f":"Jun.!$F$45","v":{"v":0,"d":"0.00"}},{"$f":"Jun.!$F$46","v":{"v":0,"d":"0.00"}},{"$f":"Jun.!$F$47","v":{"v":0,"d":"0.00"}},{"$f":"Jun.!$F$48","v":{"v":0,"d":"0.00"}},{"$f":"Jun.!$F$49","v":{"v":0,"d":"0.00"}},{"$f":"Jun.!$F$50","v":{"v":0,"d":"0.00"}},{"$f":"Jun.!$F$51","v":{"v":8,"d":"8.00"}}]
["2026-07-01",{"$f":"Jul.!$F$44","v":{"v":0,"d":"0.00"}},{"$f":"Jul.!$F$45","v":{"v":0,"d":"0.00"}},{"$f":"Jul.!$F$46","v":{"v":0,"d":"0.00"}},{"$f":"Jul.!$F$47","v":{"v":0,"d":"0.00"}},{"$f":"Jul.!$F$48","v":{"v":0,"d":"0.00"}},{"$f":"Jul.!$F$49","v":{"v":0,"d":"0.00"}},{"$f":"Jul.!$F$50","v":{"v":0,"d":"0.00"}},{"$f":"Jul.!$F$51","v":{"v":0,"d":"0.00"}},{"$f":"Jul.!$F$52","v":{"v":0,"d":"0.00"}}]
["2026-08-01",{"$f":"Aug.!$F$44","v":{"v":0,"d":"0.00"}},{"$f":"Aug.!$F$45","v":{"v":0,"d":"0.00"}},{"$f":"Aug.!$F$46","v":{"v":0,"d":"0.00"}},{"$f":"Aug.!$F$47","v":{"v":0,"d":"0.00"}},{"$f":"Aug.!$F$48","v":{"v":0,"d":"0.00"}},{"$f":"Aug.!$F$49","v":{"v":0,"d":"0.00"}},{"$f":"Aug.!$F$50","v":{"v":0,"d":"0.00"}},{"$f":"Aug.!$F$51","v":{"v":0,"d":"0.00"}},{"$f":"Aug.!$F$52","v":{"v":0,"d":"0.00"}}]
["2026-09-01",{"$f":"Sep.!$F$43","v":{"v":0,"d":"0.00"}},{"$f":"Sep.!$F$44","v":{"v":0,"d":"0.00"}},{"$f":"Sep.!$F$45","v":{"v":0,"d":"0.00"}},{"$f":"Sep.!$F$46","v":{"v":0,"d":"0.00"}},{"$f":"Sep.!$F$47","v":{"v":0,"d":"0.00"}},{"$f":"Sep.!$F$48","v":{"v":0,"d":"0.00"}},{"$f":"Sep.!$F$49","v":{"v":0,"d":"0.00"}},{"$f":"Sep.!$F$50","v":{"v":0,"d":"0.00"}},{"$f":"Sep.!$F$51","v":{"v":0,"d":"0.00"}}]
["2026-10-01",{"$f":"Okt.!$F$44","v":{"v":0,"d":"0.00"}},{"$f":"Okt.!$F$45","v":{"v":0,"d":"0.00"}},{"$f":"Okt.!$F$46","v":{"v":0,"d":"0.00"}},{"$f":"Okt.!$F$47","v":{"v":0,"d":"0.00"}},{"$f":"Okt.!$F$48","v":{"v":0,"d":"0.00"}},{"$f":"Okt.!$F$49","v":{"v":0,"d":"0.00"}},{"$f":"Okt.!$F$50","v":{"v":0,"d":"0.00"}},{"$f":"Okt.!$F$51","v":{"v":0,"d":"0.00"}},{"$f":"Okt.!$F$52","v":{"v":0,"d":"0.00"}}]
["2026-11-01",{"$f":"Nov.!$F$43","v":{"v":0,"d":"0.00"}},{"$f":"Nov.!$F$44","v":{"v":0,"d":"0.00"}},{"$f":"Nov.!$F$45","v":{"v":0,"d":"0.00"}},{"$f":"Nov.!$F$46","v":{"v":0,"d":"0.00"}},{"$f":"Nov.!$F$47","v":{"v":0,"d":"0.00"}},{"$f":"Nov.!$F$48","v":{"v":0,"d":"0.00"}},{"$f":"Nov.!$F$49","v":{"v":0,"d":"0.00"}},{"$f":"Nov.!$F$50","v":{"v":0,"d":"0.00"}},{"$f":"Nov.!$F$51","v":{"v":0,"d":"0.00"}}]
["2026-12-01",{"$f":"Dez.!$F$44","v":{"v":0,"d":"0.00"}},{"$f":"Dez.!$F$45","v":{"v":0,"d":"0.00"}},{"$f":"Dez.!$F$46","v":{"v":0,"d":"0.00"}},{"$f":"Dez.!$F$47","v":{"v":0,"d":"0.00"}},{"$f":"Dez.!$F$48","v":{"v":0,"d":"0.00"}},{"$f":"Dez.!$F$49","v":{"v":0,"d":"0.00"}},{"$f":"Dez.!$F$50","v":{"v":0,"d":"0.00"}},{"$f":"Dez.!$F$51","v":{"v":0,"d":"0.00"}},{"$f":"Dez.!$F$52","v":{"v":16,"d":"16.00"}}]
["Summe",{"$f":"SUM(B7:B18)","v":{"v":0,"d":"0.00"}},{"v":0,"d":"0.00"},{"v":0,"d":"0.00"},{"v":0,"d":"0.00"},{"v":0,"d":"0.00"},{"v":0,"d":"0.00"},{"v":0,"d":"0.00"},{"v":0,"d":"0.00"},{"v":80,"d":"80.00"}]

{"sheet":"Kalendarium","index":4,"n_rows":22,"n_cols":32,"rows_kept":22,"merged":[[19,2,19,5],[19,10,19,13],[19,18,19,21],[19,26,19,29],[20,2,20,5],[20,10,20,13],[20,18,20,21],[20,26,20,29],[21,2,21,5],[21,10,21,13],[21,18,21,21],[21,26,21,29]]}
[]
[]
[]
[]
[]
[null,{"v":1,"d":"01"},{"v":2,"d":"02"},{"v":3,"d":"03"},{"v":4,"d":"04"},{"v":5,"d":"05"},{"v":6,"d":"06"},{"v":7,"d":"07"},{"v":8,"d":"08"},{"v":9,"d":"09"},10,11,12,13,14,15,16,17,18,19,20,21,22,23,24,25,26,27,28,29,30,31]
["2026-01-01",{"$f":"Allgemein!L$7","v":"F"},{"$f":"Allgemein!M$7","v":""},{"$f":"Allgemein!N$7","v":":"},{"$f":"Allgemein!O$7","v":"#"},{"$f":"Allgemein!P$7","v":""},{"$f":"Allgemein!Q$7","v":"F"},{"$f":"Allgemein!R$7","v":""},{"$f":"Allgemein!S$7","v":""},{"$f":"Allgemein!T$7","v":""},{"$f":"Allgemein!U$7","v":":"},{"$f":"Allgemein!V$7","v":"#"},{"$f":"Allgemein!W$7","v":""},{"$f":"Allgemein!X$7","v":""},{"$f":"Allgemein!Y$7","v":""},{"$f":"Allgemein!Z$7","v":""},{"$f":"Allgemein!AA$7","v":""},{"$f":"Allgemein!AB$7","v":":"},{"$f":"Allgemein!AC$7","v":"#"},{"$f":"Allgemein!AD$7","v":""},{"$f":"Allgemein!AE$7","v":""},{"$f":"Allgemein!AF$7","v":""},{"$f":"Allgemein!AG$7","v":""},{"$f":"Allgemein!AH$7","v":""},{"$f":"Allgemein!AI$7","v":":"},{"$f":"Allgemein!AJ$7","v":"#"},{"$f":"Allgemein!AK$7","v":""},{"$f":"Allgemein!AL$7","v":""},{"$f":"Allgemein!AM$7","v":""},{"$f":"Allgemein!AN$7","v":""},{"$f":"Allgemein!AO$7","v":""},{"$f":"Allgemein!AP$7","v":":"}]
["2026-02-01",{"$f":"Allgemein!L$8","v":"#"},{"$f":"Allgemein!M$8","v":""},{"$f":"Allgemein!N$8","v":""},{"$f":"Allgemein!O$8","v":""},{"$f":"Allgemein!P$8","v":""},{"$f":"Allgemein!Q$8","v":""},{"$f":"Allgemein!R$8","v":":"},{"$f":"Allgemein!S$8","v":"#"},{"$f":"Allgemein!T$8","v":""},{"$f":"Allgemein!U$8","v":""},{"$f":"Allgemein!V$8","v":""},{"$f":"Allgemein!W$8","v":""},{"$f":"Allgemein!X$8","v":""},{"$f":"Allgemein!Y$8","v":":"},{"$f":"Allgemein!Z$8","v":"#"},{"$f":"Allgemein!AA$8","v":""},{"$f":"Allgemein!AB$8","v":""},{"$f":"Allgemein!AC$8","v":""},{"$f":"Allgemein!AD$8","v":""},{"$f":"Allgemein!AE$8","v":""},{"$f":"Allgemein!AF$8","v":":"},{"$f":"Allgemein!AG$8","v":"#"},{"$f":"Allgemein!AH$8","v":""},{"$f":"Allgemein!AI$8","v":""},{"$f":"Allgemein!AJ$8","v":""},{"$f":"Allgemein!AK$8","v":""},{"$f":"Allgemein!AL$8","v":""},{"$f":"Allgemein!AM$8","v":":"}]
["2026-03-01",{"$f":"Allgemein!L$9","v":"#"},{"$f":"Allgemein!M$9","v":""},{"$f":"Allgemein!N$9","v":""},{"$f":"Allgemein!O$9","v":""},{"$f":"Allgemein!P$9","v":""},{"$f":"Allgemein!Q$9","v":""},{"$f":"Allgemein!R$9","v":":"},{"$f":"Allgemein!S$9","v":"#"},{"$f":"Allgemein!T$9","v":""},{"$f":"Allgemein!U$9","v":""},{"$f":"Allgemein!V$9","v":""},{"$f":"Allgemein!W$9","v":""},{"$f":"Allgemein!X$9","v":""},{"$f":"Allgemein!Y$9","v":":"},{"$f":"Allgemein!Z$9","v":"#"},{"$f":"Allgemein!AA$9","v":""},{"$f":"Allgemein!AB$9","v":""},{"$f":"Allgemein!AC$9","v":""},{"$f":"Allgemein!AD$9","v":""},{"$f":"Allgemein!AE$9","v":""},{"$f":"Allgemein!AF$9","v":":"},{"$f":"Allgemein!AG$9","v":"#"},{"$f":"Allgemein!AH$9","v":""},{"$f":"Allgemein!AI$9","v":""},{"$f":"Allgemein!AJ$9","v":""},{"$f":"Allgemein!AK$9","v":""},{"$f":"Allgemein!AL$9","v":""},{"$f":"Allgemein!AM$9","v":":"},{"$f":"Allgemein!AN$9","v":"#"},{"$f":"Allgemein!AO$9","v":""},{"$f":"Allgemein!AP$9","v":""}]
["2026-04-01",{"$f":"Allgemein!L$10","v":""},{"$f":"Allgemein!M$10","v":""},{"$f":"Allgemein!N$10","v":"F"},{"$f":"Allgemein!O$10","v":":"},{"$f":"Allgemein!P$10","v":"F"},{"$f":"Allgemein!Q$10","v":""},{"$f":"Allgemein!R$10","v":""},{"$f":"Allgemein!S$10","v":""},{"$f":"Allgemein!T$10","v":""},{"$f":"Allgemein!U$10","v":""},{"$f":"Allgemein!V$10","v":":"},{"$f":"Allgemein!W$10","v":"#"},{"$f":"Allgemein!X$10","v":""},{"$f":"Allgemein!Y$10","v":""},{"$f":"Allgemein!Z$10","v":""},{"$f":"Allgemein!AA$10","v":""},{"$f":"Allgemein!AB$10","v":""},{"$f":"Allgemein!AC$10","v":":"},{"$f":"Allgemein!AD$10","v":"#"},{"$f":"Allgemein!AE$10","v":""},{"$f":"Allgemein!AF$10","v":""},{"$f":"Allgemein!AG$10","v":""},{"$f":"Allgemein!AH$10","v":""},{"$f":"Allgemein!AI$10","v":""},{"$f":"Allgemein!AJ$10","v":":"},{"$f":"Allgemein!AK$10","v":"#"},{"$f":"Allgemein!AL$10","v":""},{"$f":"Allgemein!AM$10","v":""},{"$f":"Allgemein!AN$10","v":""},{"$f":"Allgemein!AO$10","v":""}]
["2026-05-01",{"$f":"Allgemein!L$11","v":"F"},{"$f":"Allgemein!M$11","v":":"},{"$f":"Allgemein!N$11","v":"#"},{"$f":"Allgemein!O$11","v":""},{"$f":"Allgemein!P$11","v":""},{"$f":"Allgemein!Q$11","v":"F"},{"$f":"Allgemein!R$11","v":""},{"$f":"Allgemein!S$11","v":""},{"$f":"Allgemein!T$11","v":":"},{"$f":"Allgemein!U$11","v":"#"},{"$f":"Allgemein!V$11","v":""},{"$f":"Allgemein!W$11","v":""},{"$f":"Allgemein!X$11","v":""},{"$f":"Allgemein!Y$11","v":"F"},{"$f":"Allgemein!Z$11","v":""},{"$f":"Allgemein!AA$11","v":":"},{"$f":"Allgemein!AB$11","v":"#"},{"$f":"Allgemein!AC$11","v":""},{"$f":"Allgemein!AD$11","v":""},{"$f":"Allgemein!AE$11","v":""},{"$f":"Allgemein!AF$11","v":""},{"$f":"Allgemein!AG$11","v":""},{"$f":"Allgemein!AH$11","v":":"},{"$f":"Allgemein!AI$11","v":"F"},{"$f":"Allgemein!AJ$11","v":"F"},{"$f":"Allgemein!AK$11","v":""},{"$f":"Allgemein!AL$11","v":""},{"$f":"Allgemein!AM$11","v":""},{"$f":"Allgemein!AN$11","v":""},{"$f":"Allgemein!AO$11","v":":"},{"$f":"Allgemein!AP$11","v":"#"}]
["2026-06-01",{"$f":"Allgemein!L$12","v":""},{"$f":"Allgemein!M$12","v":""},{"$f":"Allgemein!N$12","v":""},{"$f":"Allgemein!O$12","v":"F"},{"$f":"Allgemein!P$12","v":""},{"$f":"Allgemein!Q$12","v":":"},{"$f":"Allgemein!R$12","v":"#"},{"$f":"Allgemein!S$12","v":""},{"$f":"Allgemein!T$12","v":""},{"$f":"Allgemein!U$12","v":""},{"$f":"Allgemein!V$12","v":""},{"$f":"Allgemein!W$12","v":""},{"$f":"Allgemein!X$12","v":":"},{"$f":"Allgemein!Y$12","v":"#"},{"$f":"Allgemein!Z$12","v":""},{"$f":"Allgemein!AA$12","v":""},{"$f":"Allgemein!AB$12","v":""},{"$f":"Allgemein!AC$12","v":""},{"$f":"Allgemein!AD$12","v":""},{"$f":"Allgemein!AE$12","v":":"},{"$f":"Allgemein!AF$12","v":"#"},{"$f":"Allgemein!AG$12","v":""},{"$f":"Allgemein!AH$12","v":""},{"$f":"Allgemein!AI$12","v":""},{"$f":"Allgemein!AJ$12","v":""},{"$f":"Allgemein!AK$12","v":""},{"$f":"Allgemein!AL$12","v":":"},{"$f":"Allgemein!AM$12","v":"#"},{"$f":"Allgemein!AN$12","v":""},{"$f":"Allgemein!AO$12","v":""}]
["2026-07-01",{"$f":"Allgemein!L$13","v":""},{"$f":"Allgemein!M$13","v":""},{"$f":"Allgemein!N$13","v":""},{"$f":"Allgemein!O$13","v":":"},{"$f":"Allgemein!P$13","v":"#"},{"$f":"Allgemein!Q$13","v":""},{"$f":"Allgemein!R$13","v":""},{"$f":"Allgemein!S$13","v":""},{"$f":"Allgemein!T$13","v":""},{"$f":"Allgemein!U$13","v":""},{"$f":"Allgemein!V$13","v":":"},{"$f":"Allgemein!W$13","v":"#"},{"$f":"Allgemein!X$13","v":""},{"$f":"Allgemein!Y$13","v":""},{"$f":"Allgemein!Z$13","v":""},{"$f":"Allgemein!AA$13","v":""},{"$f":"Allgemein!AB$13","v":""},{"$f":"Allgemein!AC$13","v":":"},{"$f":"Allgemein!AD$13","v":"#"},{"$f":"Allgemein!AE$13","v":""},{"$f":"Allgemein!AF$13","v":""},{"$f":"Allgemein!AG$13","v":""},{"$f":"Allgemein!AH$13","v":""},{"$f":"Allgemein!AI$13","v":""},{"$f":"Allgemein!AJ$13","v":":"},{"$f":"Allgemein!AK$13","v":"#"},{"$f":"Allgemein!AL$13","v":""},{"$f":"Allgemein!AM$13","v":""},{"$f":"Allgemein!AN$13","v":""},{"$f":"Allgemein!AO$13","v":""},{"$f":"Allgemein!AP$13","v":""}]
["2026-08-01",{"$f":"Allgemein!L$14","v":":"},{"$f":"Allgemein!M$14","v":"#"},{"$f":"Allgemein!N$14","v":""},{"$f":"Allgemein!O$14","v":""},{"$f":"Allgemein!P$14","v":""},{"$f":"Allgemein!Q$14","v":""},{"$f":"Allgemein!R$14","v":""},{"$f":"Allgemein!S$14","v":":"},{"$f":"Allgemein!T$14","v":"#"},{"$f":"Allgemein!U$14","v":""},{"$f":"Allgemein!V$14","v":""},{"$f":"Allgemein!W$14","v":""},{"$f":"Allgemein!X$14","v":""},{"$f":"Allgemein!Y$14","v":""},{"$f":"Allgemein!Z$14","v":"F"},{"$f":"Allgemein!AA$14","v":"#"},{"$f":"Allgemein!AB$14","v":""},{"$f":"Allgemein!AC$14","v":""},{"$f":"Allgemein!AD$14","v":""},{"$f":"Allgemein!AE$14","v":""},{"$f":"Allgemein!AF$14","v":""},{"$f":"Allgemein!AG$14","v":":"},{"$f":"Allgemein!AH$14","v":"#"},{"$f":"Allgemein!AI$14","v":""},{"$f":"Allgemein!AJ$14","v":""},{"$f":"Allgemein!AK$14","v":""},{"$f":"Allgemein!AL$14","v":""},{"$f":"Allgemein!AM$14","v":""},{"$f":"Allgemein!AN$14","v":":"},{"$f":"Allgemein!AO$14","v":"#"},{"$f":"Allgemein!AP$14","v":""}]
["2026-09-01",{"$f":"Allgemein!L$15","v":""},{"$f":"Allgemein!M$15","v":""},{"$f":"Allgemein!N$15","v":""},{"$f":"Allgemein!O$15","v":""},{"$f":"Allgemein!P$15","v":":"},{"$f":"Allgemein!Q$15","v":"#"},{"$f":"Allgemein!R$15","v":""},{"$f":"Allgemein!S$15","v":""},{"$f":"Allgemein!T$15","v":""},{"$f":"Allgemein!U$15","v":""},{"$f":"Allgemein!V$15","v":""},{"$f":"Allgemein!W$15","v":":"},{"$f":"Allgemein!X$15","v":"#"},{"$f":"Allgemein!Y$15","v":""},{"$f":"Allgemein!Z$15","v":""},{"$f":"Allgemein!AA$15","v":""},{"$f":"Allgemein!AB$15","v":""},{"$f":"Allgemein!AC$15","v":""},{"$f":"Allgemein!AD$15","v":":"},{"$f":"Allgemein!AE$15","v":"#"},{"$f":"Allgemein!AF$15","v":""},{"$f":"Allgemein!AG$15","v":""},{"$f":"Allgemein!AH$15","v":""},{"$f":"Allgemein!AI$15","v":""},{"$f":"Allgemein!AJ$15","v":""},{"$f":"Allgemein!AK$15","v":":"},{"$f":"Allgemein!AL$15","v":"#"},{"$f":"Allgemein!AM$15","v":""},{"$f":"Allgemein!AN$15","v":""},{"$f":"Allgemein!AO$15","v":""}]
["2026-10-01",{"$f":"Allgemein!L$16","v":""},{"$f":"Allgemein!M$16","v":""},{"$f":"Allgemein!N$16","v":"F"},{"$f":"Allgemein!O$16","v":"#"},{"$f":"Allgemein!P$16","v":""},{"$f":"Allgemein!Q$16","v":""},{"$f":"Allgemein!R$16","v":""},{"$f":"Allgemein!S$16","v":""},{"$f":"Allgemein!T$16","v":""},{"$f":"Allgemein!U$16","v":":"},{"$f":"Allgemein!V$16","v":"#"},{"$f":"Allgemein!W$16","v":""},{"$f":"Allgemein!X$16","v":""},{"$f":"Allgemein!Y$16","v":""},{"$f":"Allgemein!Z$16","v":""},{"$f":"Allgemein!AA$16","v":""},{"$f":"Allgemein!AB$16","v":":"},{"$f":"Allgemein!AC$16","v":"#"},{"$f":"Allgemein!AD$16","v":""},{"$f":"Allgemein!AE$16","v":""},{"$f":"Allgemein!AF$16","v":""},{"$f":"Allgemein!AG$16","v":""},{"$f":"Allgemein!AH$16","v":""},{"$f":"Allgemein!AI$16","v":":"},{"$f":"Allgemein!AJ$16","v":"#"},{"$f":"Allgemein!AK$16","v":""},{"$f":"Allgemein!AL$16","v":""},{"$f":"Allgemein!AM$16","v":""},{"$f":"Allgemein!AN$16","v":""},{"$f":"Allgemein!AO$16","v":""},{"$f":"Allgemein!AP$16","v":":"}]
["2026-11-01",{"$f":"Allgemein!L$17","v":"F"},{"$f":"Allgemein!M$17","v":""},{"$f":"Allgemein!N$17","v":""},{"$f":"Allgemein!O$17","v":""},{"$f":"Allgemein!P$17","v":""},{"$f":"Allgemein!Q$17","v":""},{"$f":"Allgemein!R$17","v":":"},{"$f":"Allgemein!S$17","v":"#"},{"$f":"Allgemein!T$17","v":""},{"$f":"Allgemein!U$17","v":""},{"$f":"Allgemein!V$17","v":""},{"$f":"Allgemein!W$17","v":""},{"$f":"Allgemein!X$17","v":""},{"$f":"Allgemein!Y$17","v":":"},{"$f":"Allgemein!Z$17","v":"#"},{"$f":"Allgemein!AA$17","v":""},{"$f":"Allgemein!AB$17","v":""},{"$f":"Allgemein!AC$17","v":""},{"$f":"Allgemein!AD$17","v":""},{"$f":"Allgemein!AE$17","v":""},{"$f":"Allgemein!AF$17","v":":"},{"$f":"Allgemein!AG$17","v":"#"},{"$f":"Allgemein!AH$17","v":""},{"$f":"Allgemein!AI$17","v":""},{"$f":"Allgemein!AJ$17","v":""},{"$f":"Allgemein!AK$17","v":""},{"$f":"Allgemein!AL$17","v":""},{"$f":"Allgemein!AM$17","v":":"},{"$f":"Allgemein!AN$17","v":"#"},{"$f":"Allgemein!AO$17","v":""}]
["2026-12-01",{"$f":"Allgemein!L$18","v":""},{"$f":"Allgemein!M$18","v":""},{"$f":"Allgemein!N$18","v":""},{"$f":"Allgemein!O$18","v":""},{"$f":"Allgemein!P$18","v":":"},{"$f":"Allgemein!Q$18","v":"#"},{"$f":"Allgemein!R$18","v":""},{"$f":"Allgemein!S$18","v":""},{"$f":"Allgemein!T$18","v":""},{"$f":"Allgemein!U$18","v":""},{"$f":"Allgemein!V$18","v":""},{"$f":"Allgemein!W$18","v":":"},{"$f":"Allgemein!X$18","v":"#"},{"$f":"Allgemein!Y$18","v":""},{"$f":"Allgemein!Z$18","v":""},{"$f":"Allgemein!AA$18","v":""},{"$f":"Allgemein!AB$18","v":""},{"$f":"Allgemein!AC$18","v":""},{"$f":"Allgemein!AD$18","v":":"},{"$f":"Allgemein!AE$18","v":"#"},{"$f":"Allgemein!AF$18","v":""},{"$f":"Allgemein!AG$18","v":""},{"$f":"Allgemein!AH$18","v":""},{"$f":"Allgemein!AI$18","v":"F"},{"$f":"Allgemein!AJ$18","v":"F"},{"$f":"Allgemein!AK$18","v":"F"},{"$f":"Allgemein!AL$18","v":"#"},{"$f":"Allgemein!AM$18","v":""},{"$f":"Allgemein!AN$18","v":""},{"$f":"Allgemein!AO$18","v":""},{"$f":"Allgemein!AP$18","v":"F"}]
[]
["Summe",null,"Anwesenheit",{"$nulls":4},{"$f":"COUNTIF($B$7:$AF$18,Allgemein!H62)","v":0},null,null,"Urlaub",{"$nulls":4},{"$f":"COUNTIF($B$7:$AF$18,Allgemein!J50)","v":0},null,null,"Kurzarbeit",{"$nulls":4},{"$f":"COUNTIF($B$7:$AF$18,Allgemein!J52)","v":0},null,null,"Elternzeit",{"$nulls":4},{"$f":"COUNTIF($B$7:$AF$18,Allgemein!J55)","v":0}]
[null,null,"Samstag",{"$nulls":4},{"$f":"COUNTIF($B$7:$AF$18,Allgemein!H63)","v":49},null,null,"Krankheit",{"$nulls":4},{"$f":"COUNTIF($B$7:$AF$18,Allgemein!J51)","v":0},null,null,"Mutterschutz",{"$nulls":4},{"$f":"COUNTIF($B$7:$AF$18,Allgemein!J53)","v":0},null,null,"Gleittag",{"$nulls":4},{"$f":"COUNTIF($B$7:$AF$18,Allgemein!J56)","v":0}]
[null,null,"Sonntag",{"$nulls":4},{"$f":"COUNTIF($B$7:$AF$18,Allgemein!H64)","v":49},null,null,"Feiertag",{"$nulls":4},{"$f":"COUNTIF($B$7:$AF$18,Allgemein!J58)","v":17},null,null,"Fortbildung",{"$nulls":4},{"$f":"COUNTIF($B$7:$AF$18,Allgemein!J54)","v":0},null,null,"Schule",{"$nulls":4},{"$f":"COUNTIF($B$7:$AF$18,Allgemein!J57)","v":0}]

{"sheet":"Jan.","index":5,"n_rows":53,"n_cols":23,"rows_kept":53}
[]
[]
[]
[]
[]
["Urlaubsvortrag",{"$f":"Personalstamm!$I$12-Personalstamm!$I$13","v":{"v":30,"d":"30.00"}},"Urlaub genommen",{"$f":"$H$44","v":{"v":0,"d":"0.00"}},"Resturlaub",{"$f":"$B$6-$D$6","v":{"v":30,"d":"30.00"}}]
["Saldovortrag",{"$f":"Personalstamm!$I$21","v":{"v":0,"d":"0.00"}},"Saldoänderung",{"$f":"$P$41","v":{"v":0,"d":"0.00"}},"Kumulierter Saldo",{"$f":"$B$7+$D$7","v":{"v":0,"d":"0.00"}}]
[]
["Datum","Wochentag","Art","Arbeitsort","Von Uhrzeit","Bis Uhrzeit","Von Uhrzeit","Bis Uhrzeit","Bruttoarbeitszeit","Geb. Pause","Mindestpause","Nettoarbeitszeit","Fehlzeitenart","Fehlstunden","Sollstunden","Tagessaldo","Kumulierter Saldo",null,"Feiertag","Feiertag Anteil Tag","FZ-Gutschrift","Gleittag","Ausgewertet"]
["2026-01-01",{"$f":"TEXT(A10,\"tttt\")","v":"Donnerstag"},{"$f":"IF(AND(S10=\"Feiertag\",T10>0),\"Fehlzeit\",IF(OR(B10=\"Samstag\",B10=\"Sonntag\"),\"Wochenende\",\"Bitte auswählen\"))","v":"Fehlzeit"},{"$nulls":5},{"$f":"IF(AND(OR(C10=\"Anwesenheit\",C10=\"Wochenende\"),E10<>\"\",F10<>\"\",W10=\"Ja\"),((F10-E10)+(H10-G10))*24,\"\")","v":""},{"$f":"IF(I10=\"\",\"\",IF(AND(G10<>\"\",H10<>\"\"),(G10-F10)*24,0))","v":""},{"$f":"IF(I10=\"\",\"\",IF(AND(I10<>\"\",J10=\"\",I10>=Personalstamm!$D$20),Personalstamm!$E$20,IF(AND(I10<>\"\",J10=\"\",I10>=Personalstamm!$D$19),Personalstamm!$E$19,IF(AND(I10<>\"\",J10<Personalstamm!$E$20,I10>=Personalstamm!$D$20),Personalstamm!$E$20-J10,IF(AND(I10<>\"\",J10<Personalstamm!E$19,I10>=Personalstamm!$D$19),Personalstamm!$E$19-J10,0)))))","v":""},{"$f":"IF(I10<>\"\",I10-K10,\"\")","v":""},{"$f":"IF(AND(S10=\"Feiertag\",T10>0),\"Feiertag\",IF(C10=\"Fehlzeit\",\"Bitte auswählen\",\"\"))","v":"Feiertag"},{"$f":"IF(OR(M10=\"\",M10=\"Bitte auswählen\"),\"\",IF(M10=\"Feiertag\",T10*U10,IF(M10=\"Gleittag\",0,VLOOKUP(B10,Personalstamm!$D$8:$F$14,3,FALSE))))","v":{"v":8,"d":"8.00"}},{"$f":"VLOOKUP(B10,Personalstamm!$D$8:$E$14,2,FALSE)","v":{"v":8,"d":"8.00"}},{"$f":"IF(AND(OR(C10=\"Anwesenheit\",C10=\"Wochenende\"),L10<>\"\"),L10-O10,IF(AND(C10=\"Fehlzeit\",N10<>\"\",W10=\"Ja\"),N10-O10,IF(W10=\"Ja\",-O10,\"\")))","v":""},{"$f":"IF(P10=\"\",B7,B7+P10)","v":{"v":0,"d":"0.00"}},null,{"$f":"IF(COUNTIF(Allgemein!$H$8:$H$45,A10)>0,\"Feiertag\",\"\")","v":"Feiertag"},{"$f":"IFERROR(VLOOKUP(A10,Allgemein!$H$8:$I$45,2,FALSE),\"\")","v":{"v":1,"d":"1.00"}},{"$f":"VLOOKUP(B10,Personalstamm!$D$8:$F$14,3,FALSE)","v":{"v":8,"d":"8.00"}},{"$f":"IF(M10=\"Gleittag\",ABS(P10),\"\")","v":""},{"$f":"IF(A10<=TODAY(),\"Ja\",\"\")","v":""}]
["2026-01-02",{"$f":"TEXT(A11,\"tttt\")","v":"Freitag"},"Bitte auswählen",{"$nulls":5},"",{"$f":"IF(I11=\"\",\"\",IF(AND(G11<>\"\",H11<>\"\"),(G11-F11)*24,0))","v":""},{"$f":"IF(I11=\"\",\"\",IF(AND(I11<>\"\",J11=\"\",I11>=Personalstamm!$D$20),Personalstamm!$E$20,IF(AND(I11<>\"\",J11=\"\",I11>=Personalstamm!$D$19),Personalstamm!$E$19,IF(AND(I11<>\"\",J11<Personalstamm!$E$20,I11>=Personalstamm!$D$20),Personalstamm!$E$20-J11,IF(AND(I11<>\"\",J11<Personalstamm!E$19,I11>=Personalstamm!$D$19),Personalstamm!$E$19-J11,0)))))","v":""},{"$f":"IF(I11<>\"\",I11-K11,\"\")","v":""},"",{"$f":"IF(OR(M11=\"\",M11=\"Bitte auswählen\"),\"\",IF(M11=\"Feiertag\",T11*U11,IF(M11=\"Gleittag\",0,VLOOKUP(B11,Personalstamm!$D$8:$F$14,3,FALSE))))","v":""},{"$f":"VLOOKUP(B11,Personalstamm!$D$8:$E$14,2,FALSE)","v":{"v":8,"d":"8.00"}},"",{"$f":"IF(P11=\"\",Q10,Q10+P11)","v":{"v":0,"d":"0.00"}},null,{"$f":"IF(COUNTIF(Allgemein!$H$8:$H$45,A11)>0,\"Feiertag\",\"\")","v":""},{"$f":"IFERROR(VLOOKUP(A11,Allgemein!$H$8:$I$45,2,FALSE),\"\")","v":""},{"$f":"VLOOKUP(B11,Personalstamm!$D$8:$F$14,3,FALSE)","v":{"v":8,"d":"8.00"}},{"$f":"IF(M11=\"Gleittag\",ABS(P11),\"\")","v":""},""]
["2026-01-03","Samstag","Wochenende",{"$nulls":5},"","",{"$f":"IF(I12=\"\",\"\",IF(AND(I12<>\"\",J12=\"\",I12>=Personalstamm!$D$20),Personalstamm!$E$20,IF(AND(I12<>\"\",J12=\"\",I12>=Personalstamm!$D$19),Personalstamm!$E$19,IF(AND(I12<>\"\",J12<Personalstamm!$E$20,I12>=Personalstamm!$D$20),Personalstamm!$E$20-J12,IF(AND(I12<>\"\",J12<Personalstamm!E$19,I12>=Personalstamm!$D$19),Personalstamm!$E$19-J12,0)))))","v":""},"","",{"$f":"IF(OR(M12=\"\",M12=\"Bitte auswählen\"),\"\",IF(M12=\"Feiertag\",T12*U12,IF(M12=\"Gleittag\",0,VLOOKUP(B12,Personalstamm!$D$8:$F$14,3,FALSE))))","v":""},{"$f":"VLOOKUP(B12,Personalstamm!$D$8:$E$14,2,FALSE)","v":{"v":0,"d":"0.00"}},"",{"$f":"IF(P12=\"\",Q11,Q11+P12)","v":{"v":0,"d":"0.00"}},null,{"$f":"IF(COUNTIF(Allgemein!$H$8:$H$45,A12)>0,\"Feiertag\",\"\")","v":""},{"$f":"IFERROR(VLOOKUP(A12,Allgemein!$H$8:$I$45,2,FALSE),\"\")","v":""},{"$f":"VLOOKUP(B12,Personalstamm!$D$8:$F$14,3,FALSE)","v":{"v":0,"d":"0.00"}},"",""]
["2026-01-04","Sonntag","Wochenende",{"$nulls":5},"","",{"$f":"IF(I13=\"\",\"\",IF(AND(I13<>\"\",J13=\"\",I13>=Personalstamm!$D$20),Personalstamm!$E$20,IF(AND(I13<>\"\",J13=\"\",I13>=Personalstamm!$D$19),Personalstamm!$E$19,IF(AND(I13<>\"\",J13<Personalstamm!$E$20,I13>=Personalstamm!$D$20),Personalstamm!$E$20-J13,IF(AND(I13<>\"\",J13<Personalstamm!E$19,I13>=Personalstamm!$D$19),Personalstamm!$E$19-J13,0)))))","v":""},"","",{"$f":"IF(OR(M13=\"\",M13=\"Bitte auswählen\"),\"\",IF(M13=\"Feiertag\",T13*U13,IF(M13=\"Gleittag\",0,VLOOKUP(B13,Personalstamm!$D$8:$F$14,3,FALSE))))","v":""},{"$f":"VLOOKUP(B13,Personalstamm!$D$8:$E$14,2,FALSE)","v":{"v":0,"d":"0.00"}},"",{"v":0,"d":"0.00"},null,{"$f":"IF(COUNTIF(Allgemein!$H$8:$H$45,A13)>0,\"Feiertag\",\"\")","v":""},{"$f":"IFERROR(VLOOKUP(A13,Allgemein!$H$8:$I$45,2,FALSE),\"\")","v":""},{"$f":"VLOOKUP(B13,Personalstamm!$D$8:$F$14,3,FALSE)","v":{"v":0,"d":"0.00"}},"",""]
["2026-01-05","Montag","Bitte auswählen",{"$nulls":5},"","",{"$f":"IF(I14=\"\",\"\",IF(AND(I14<>\"\",J14=\"\",I14>=Personalstamm!$D$20),Personalstamm!$E$20,IF(AND(I14<>\"\",J14=\"\",I14>=Personalstamm!$D$19),Personalstamm!$E$19,IF(AND(I14<>\"\",J14<Personalstamm!$E$20,I14>=Personalstamm!$D$20),Personalstamm!$E$20-J14,IF(AND(I14<>\"\",J14<Personalstamm!E$19,I14>=Personalstamm!$D$19),Personalstamm!$E$19-J14,0)))))","v":""},"","",{"$f":"IF(OR(M14=\"\",M14=\"Bitte auswählen\"),\"\",IF(M14=\"Feiertag\",T14*U14,IF(M14=\"Gleittag\",0,VLOOKUP(B14,Personalstamm!$D$8:$F$14,3,FALSE))))","v":""},{"$f":"VLOOKUP(B14,Personalstamm!$D$8:$E$14,2,FALSE)","v":{"v":8,"d":"8.00"}},"",{"v":0,"d":"0.00"},null,{"$f":"IF(COUNTIF(Allgemein!$H$8:$H$45,A14)>0,\"Feiertag\",\"\")","v":""},{"$f":"IFERROR(VLOOKUP(A14,Allgemein!$H$8:$I$45,2,FALSE),\"\")","v":""},{"$f":"VLOOKUP(B14,Personalstamm!$D$8:$F$14,3,FALSE)","v":{"v":8,"d":"8.00"}},"",""]
["2026-01-06","Dienstag","Fehlzeit",{"$nulls":5},"","",{"$f":"IF(I15=\"\",\"\",IF(AND(I15<>\"\",J15=\"\",I15>=Personalstamm!$D$20),Personalstamm!$E$20,IF(AND(I15<>\"\",J15=\"\",I15>=Personalstamm!$D$19),Personalstamm!$E$19,IF(AND(I15<>\"\",J15<Personalstamm!$E$20,I15>=Personalstamm!$D$20),Personalstamm!$E$20-J15,IF(AND(I15<>\"\",J15<Personalstamm!E$19,I15>=Personalstamm!$D$19),Personalstamm!$E$19-J15,0)))))","v":""},"","Feiertag",{"$f":"IF(OR(M15=\"\",M15=\"Bitte auswählen\"),\"\",IF(M15=\"Feiertag\",T15*U15,IF(M15=\"Gleittag\",0,VLOOKUP(B15,Personalstamm!$D$8:$F$14,3,FALSE))))","v":{"v":8,"d":"8.00"}},{"$f":"VLOOKUP(B15,Personalstamm!$D$8:$E$14,2,FALSE)","v":{"v":8,"d":"8.00"}},"",{"v":0,"d":"0.00"},null,{"$f":"IF(COUNTIF(Allgemein!$H$8:$H$45,A15)>0,\"Feiertag\",\"\")","v":"Feiertag"},{"$f":"IFERROR(VLOOKUP(A15,Allgemein!$H$8:$I$45,2,FALSE),\"\")","v":{"v":1,"d":"1.00"}},{"$f":"VLOOKUP(B15,Personalstamm!$D$8:$F$14,3,FALSE)","v":{"v":8,"d":"8.00"}},"",""]
["2026-01-07","Mittwoch","Bitte auswählen",{"$nulls":5},"","",{"$f":"IF(I16=\"\",\"\",IF(AND(I16<>\"\",J16=\"\",I16>=Personalstamm!$D$20),Personalstamm!$E$20,IF(AND(I16<>\"\",J16=\"\",I16>=Personalstamm!$D$19),Personalstamm!$E$19,IF(AND(I16<>\"\",J16<Personalstamm!$E$20,I16>=Personalstamm!$D$20),Personalstamm!$E$20-J16,IF(AND(I16<>\"\",J16<Personalstamm!E$19,I16>=Personalstamm!$D$19),Personalstamm!$E$19-J16,0)))))","v":""},"","",{"$f":"IF(OR(M16=\"\",M16=\"Bitte auswählen\"),\"\",IF(M16=\"Feiertag\",T16*U16,IF(M16=\"Gleittag\",0,VLOOKUP(B16,Personalstamm!$D$8:$F$14,3,FALSE))))","v":""},{"$f":"VLOOKUP(B16,Personalstamm!$D$8:$E$14,2,FALSE)","v":{"v":8,"d":"8.00"}},"",{"v":0,"d":"0.00"},null,{"$f":"IF(COUNTIF(Allgemein!$H$8:$H$45,A16)>0,\"Feiertag\",\"\")","v":""},{"$f":"IFERROR(VLOOKUP(A16,Allgemein!$H$8:$I$45,2,FALSE),\"\")","v":""},{"$f":"VLOOKUP(B16,Personalstamm!$D$8:$F$14,3,FALSE)","v":{"v":8,"d":"8.00"}},"",""]
["2026-01-08","Donnerstag","Bitte auswählen",{"$nulls":5},"","",{"$f":"IF(I17=\"\",\"\",IF(AND(I17<>\"\",J17=\"\",I17>=Personalstamm!$D$20),Personalstamm!$E$20,IF(AND(I17<>\"\",J17=\"\",I17>=Personalstamm!$D$19),Personalstamm!$E$19,IF(AND(I17<>\"\",J17<Personalstamm!$E$20,I17>=Personalstamm!$D$20),Personalstamm!$E$20-J17,IF(AND(I17<>\"\",J17<Personalstamm!E$19,I17>=Personalstamm!$D$19),Personalstamm!$E$19-J17,0)))))","v":""},"","",{"$f":"IF(OR(M17=\"\",M17=\"Bitte auswählen\"),\"\",IF(M17=\"Feiertag\",T17*U17,IF(M17=\"Gleittag\",0,VLOOKUP(B17,Personalstamm!$D$8:$F$14,3,FALSE))))","v":""},{"$f":"VLOOKUP(B17,Personalstamm!$D$8:$E$14,2,FALSE)","v":{"v":8,"d":"8.00"}},"",{"v":0,"d":"0.00"},null,{"$f":"IF(COUNTIF(Allgemein!$H$8:$H$45,A17)>0,\"Feiertag\",\"\")","v":""},{"$f":"IFERROR(VLOOKUP(A17,Allgemein!$H$8:$I$45,2,FALSE),\"\")","v":""},{"$f":"VLOOKUP(B17,Personalstamm!$D$8:$F$14,3,FALSE)","v":{"v":8,"d":"8.00"}},"",""]
["2026-01-09","Freitag","Bitte auswählen",{"$nulls":5},"","",{"$f":"IF(I18=\"\",\"\",IF(AND(I18<>\"\",J18=\"\",I18>=Personalstamm!$D$20),Personalstamm!$E$20,IF(AND(I18<>\"\",J18=\"\",I18>=Personalstamm!$D$19),Personalstamm!$E$19,IF(AND(I18<>\"\",J18<Personalstamm!$E$20,I18>=Personalstamm!$D$20),Personalstamm!$E$20-J18,IF(AND(I18<>\"\",J18<Personalstamm!E$19,I18>=Personalstamm!$D$19),Personalstamm!$E$19-J18,0)))))","v":""},"","",{"$f":"IF(OR(M18=\"\",M18=\"Bitte auswählen\"),\"\",IF(M18=\"Feiertag\",T18*U18,IF(M18=\"Gleittag\",0,VLOOKUP(B18,Personalstamm!$D$8:$F$14,3,FALSE))))","v":""},{"$f":"VLOOKUP(B18,Personalstamm!$D$8:$E$14,2,FALSE)","v":{"v":8,"d":"8.00"}},"",{"v":0,"d":"0.00"},null,{"$f":"IF(COUNTIF(Allgemein!$H$8:$H$45,A18)>0,\"Feiertag\",\"\")","v":""},{"$f":"IFERROR(VLOOKUP(A18,Allgemein!$H$8:$I$45,2,FALSE),\"\")","v":""},{"$f":"VLOOKUP(B18,Personalstamm!$D$8:$F$14,3,FALSE)","v":{"v":8,"d":"8.00"}},"",""]
["2026-01-10","Samstag","Wochenende",{"$nulls":5},"","",{"$f":"IF(I19=\"\",\"\",IF(AND(I19<>\"\",J19=\"\",I19>=Personalstamm!$D$20),Personalstamm!$E$20,IF(AND(I19<>\"\",J19=\"\",I19>=Personalstamm!$D$19),Personalstamm!$E$19,IF(AND(I19<>\"\",J19<Personalstamm!$E$20,I19>=Personalstamm!$D$20),Personalstamm!$E$20-J19,IF(AND(I19<>\"\",J19<Personalstamm!E$19,I19>=Personalstamm!$D$19),Personalstamm!$E$19-J19,0)))))","v":""},"","",{"$f":"IF(OR(M19=\"\",M19=\"Bitte auswählen\"),\"\",IF(M19=\"Feiertag\",T19*U19,IF(M19=\"Gleittag\",0,VLOOKUP(B19,Personalstamm!$D$8:$F$14,3,FALSE))))","v":""},{"$f":"VLOOKUP(B19,Personalstamm!$D$8:$E$14,2,FALSE)","v":{"v":0,"d":"0.00"}},"",{"v":0,"d":"0.00"},null,{"$f":"IF(COUNTIF(Allgemein!$H$8:$H$45,A19)>0,\"Feiertag\",\"\")","v":""},{"$f":"IFERROR(VLOOKUP(A19,Allgemein!$H$8:$I$45,2,FALSE),\"\")","v":""},{"$f":"VLOOKUP(B19,Personalstamm!$D$8:$F$14,3,FALSE)","v":{"v":0,"d":"0.00"}},"",""]
["2026-01-11","Sonntag","Wochenende",{"$nulls":5},"","",{"$f":"IF(I20=\"\",\"\",IF(AND(I20<>\"\",J20=\"\",I20>=Personalstamm!$D$20),Personalstamm!$E$20,IF(AND(I20<>\"\",J20=\"\",I20>=Personalstamm!$D$19),Personalstamm!$E$19,IF(AND(I20<>\"\",J20<Personalstamm!$E$20,I20>=Personalstamm!$D$20),Personalstamm!$E$20-J20,IF(AND(I20<>\"\",J20<Personalstamm!E$19,I20>=Personalstamm!$D$19),Personalstamm!$E$19-J20,0)))))","v":""},"","",{"$f":"IF(OR(M20=\"\",M20=\"Bitte auswählen\"),\"\",IF(M20=\"Feiertag\",T20*U20,IF(M20=\"Gleittag\",0,VLOOKUP(B20,Personalstamm!$D$8:$F$14,3,FALSE))))","v":""},{"$f":"VLOOKUP(B20,Personalstamm!$D$8:$E$14,2,FALSE)","v":{"v":0,"d":"0.00"}},"",{"v":0,"d":"0.00"},null,{"$f":"IF(COUNTIF(Allgemein!$H$8:$H$45,A20)>0,\"Feiertag\",\"\")","v":""},{"$f":"IFERROR(VLOOKUP(A20,Allgemein!$H$8:$I$45,2,FALSE),\"\")","v":""},{"$f":"VLOOKUP(B20,Personalstamm!$D$8:$F$14,3,FALSE)","v":{"v":0,"d":"0.00"}},"",""]
["2026-01-12","Montag","Bitte auswählen",{"$nulls":5},"","",{"$f":"IF(I21=\"\",\"\",IF(AND(I21<>\"\",J21=\"\",I21>=Personalstamm!$D$20),Personalstamm!$E$20,IF(AND(I21<>\"\",J21=\"\",I21>=Personalstamm!$D$19),Personalstamm!$E$19,IF(AND(I21<>\"\",J21<Personalstamm!$E$20,I21>=Personalstamm!$D$20),Personalstamm!$E$20-J21,IF(AND(I21<>\"\",J21<Personalstamm!E$19,I21>=Personalstamm!$D$19),Personalstamm!$E$19-J21,0)))))","v":""},"","",{"$f":"IF(OR(M21=\"\",M21=\"Bitte auswählen\"),\"\",IF(M21=\"Feiertag\",T21*U21,IF(M21=\"Gleittag\",0,VLOOKUP(B21,Personalstamm!$D$8:$F$14,3,FALSE))))","v":""},{"$f":"VLOOKUP(B21,Personalstamm!$D$8:$E$14,2,FALSE)","v":{"v":8,"d":"8.00"}},"",{"v":0,"d":"0.00"},null,{"$f":"IF(COUNTIF(Allgemein!$H$8:$H$45,A21)>0,\"Feiertag\",\"\")","v":""},{"$f":"IFERROR(VLOOKUP(A21,Allgemein!$H$8:$I$45,2,FALSE),\"\")","v":""},{"$f":"VLOOKUP(B21,Personalstamm!$D$8:$F$14,3,FALSE)","v":{"v":8,"d":"8.00"}},"",""]
["2026-01-13","Dienstag","Bitte auswählen",{"$nulls":5},"","",{"$f":"IF(I22=\"\",\"\",IF(AND(I22<>\"\",J22=\"\",I22>=Personalstamm!$D$20),Personalstamm!$E$20,IF(AND(I22<>\"\",J22=\"\",I22>=Personalstamm!$D$19),Personalstamm!$E$19,IF(AND(I22<>\"\",J22<Personalstamm!$E$20,I22>=Personalstamm!$D$20),Personalstamm!$E$20-J22,IF(AND(I22<>\"\",J22<Personalstamm!E$19,I22>=Personalstamm!$D$19),Personalstamm!$E$19-J22,0)))))","v":""},"","",{"$f":"IF(OR(M22=\"\",M22=\"Bitte auswählen\"),\"\",IF(M22=\"Feiertag\",T22*U22,IF(M22=\"Gleittag\",0,VLOOKUP(B22,Personalstamm!$D$8:$F$14,3,FALSE))))","v":""},{"$f":"VLOOKUP(B22,Personalstamm!$D$8:$E$14,2,FALSE)","v":{"v":8,"d":"8.00"}},"",{"v":0,"d":"0.00"},null,{"$f":"IF(COUNTIF(Allgemein!$H$8:$H$45,A22)>0,\"Feiertag\",\"\")","v":""},{"$f":"IFERROR(VLOOKUP(A22,Allgemein!$H$8:$I$45,2,FALSE),\"\")","v":""},{"$f":"VLOOKUP(B22,Personalstamm!$D$8:$F$14,3,FALSE)","v":{"v":8,"d":"8.00"}},"",""]
["2026-01-14","Mittwoch","Bitte auswählen",{"$nulls":5},"","",{"$f":"IF(I23=\"\",\"\",IF(AND(I23<>\"\",J23=\"\",I23>=Personalstamm!$D$20),Personalstamm!$E$20,IF(AND(I23<>\"\",J23=\"\",I23>=Personalstamm!$D$19),Personalstamm!$E$19,IF(AND(I23<>\"\",J23<Personalstamm!$E$20,I23>=Personalstamm!$D$20),Personalstamm!$E$20-J23,IF(AND(I23<>\"\",J23<Personalstamm!E$19,I23>=Personalstamm!$D$19),Personalstamm!$E$19-J23,0)))))","v":""},"","",{"$f":"IF(OR(M23=\"\",M23=\"Bitte auswählen\"),\"\",IF(M23=\"Feiertag\",T23*U23,IF(M23=\"Gleittag\",0,VLOOKUP(B23,Personalstamm!$D$8:$F$14,3,FALSE))))","v":""},{"$f":"VLOOKUP(B23,Personalstamm!$D$8:$E$14,2,FALSE)","v":{"v":8,"d":"8.00"}},"",{"v":0,"d":"0.00"},null,{"$f":"IF(COUNTIF(Allgemein!$H$8:$H$45,A23)>0,\"Feiertag\",\"\")","v":""},{"$f":"IFERROR(VLOOKUP(A23,Allgemein!$H$8:$I$45,2,FALSE),\"\")","v":""},{"$f":"VLOOKUP(B23,Personalstamm!$D$8:$F$14,3,FALSE)","v":{"v":8,"d":"8.00"}},"",""]
["2026-01-15","Donnerstag","Bitte auswählen",{"$nulls":5},"","",{"$f":"IF(I24=\"\",\"\",IF(AND(I24<>\"\",J24=\"\",I24>=Personalstamm!$D$20),Personalstamm!$E$20,IF(AND(I24<>\"\",J24=\"\",I24>=Personalstamm!$D$19),Personalstamm!$E$19,IF(AND(I24<>\"\",J24<Personalstamm!$E$20,I24>=Personalstamm!$D$20),Personalstamm!$E$20-J24,IF(AND(I24<>\"\",J24<Personalstamm!E$19,I24>=Personalstamm!$D$19),Personalstamm!$E$19-J24,0)))))","v":""},"","",{"$f":"IF(OR(M24=\"\",M24=\"Bitte auswählen\"),\"\",IF(M24=\"Feiertag\",T24*U24,IF(M24=\"Gleittag\",0,VLOOKUP(B24,Personalstamm!$D$8:$F$14,3,FALSE))))","v":""},{"$f":"VLOOKUP(B24,Personalstamm!$D$8:$E$14,2,FALSE)","v":{"v":8,"d":"8.00"}},"",{"v":0,"d":"0.00"},null,{"$f":"IF(COUNTIF(Allgemein!$H$8:$H$45,A24)>0,\"Feiertag\",\"\")","v":""},{"$f":"IFERROR(VLOOKUP(A24,Allgemein!$H$8:$I$45,2,FALSE),\"\")","v":""},{"$f":"VLOOKUP(B24,Personalstamm!$D$8:$F$14,3,FALSE)","v":{"v":8,"d":"8.00"}},"",""]
["2026-01-16","Freitag","Bitte auswählen",{"$nulls":5},"","",{"$f":"IF(I25=\"\",\"\",IF(AND(I25<>\"\",J25=\"\",I25>=Personalstamm!$D$20),Personalstamm!$E$20,IF(AND(I25<>\"\",J25=\"\",I25>=Personalstamm!$D$19),Personalstamm!$E$19,IF(AND(I25<>\"\",J25<Personalstamm!$E$20,I25>=Personalstamm!$D$20),Personalstamm!$E$20-J25,IF(AND(I25<>\"\",J25<Personalstamm!E$19,I25>=Personalstamm!$D$19),Personalstamm!$E$19-J25,0)))))","v":""},"","",{"$f":"IF(OR(M25=\"\",M25=\"Bitte auswählen\"),\"\",IF(M25=\"Feiertag\",T25*U25,IF(M25=\"Gleittag\",0,VLOOKUP(B25,Personalstamm!$D$8:$F$14,3,FALSE))))","v":""},{"$f":"VLOOKUP(B25,Personalstamm!$D$8:$E$14,2,FALSE)","v":{"v":8,"d":"8.00"}},"",{"v":0,"d":"0.00"},null,{"$f":"IF(COUNTIF(Allgemein!$H$8:$H$45,A25)>0,\"Feiertag\",\"\")","v":""},{"$f":"IFERROR(VLOOKUP(A25,Allgemein!$H$8:$I$45,2,FALSE),\"\")","v":""},{"$f":"VLOOKUP(B25,Personalstamm!$D$8:$F$14,3,FALSE)","v":{"v":8,"d":"8.00"}},"",""]
["2026-01-17","Samstag","Wochenende",{"$nulls":5},"","",{"$f":"IF(I26=\"\",\"\",IF(AND(I26<>\"\",J26=\"\",I26>=Personalstamm!$D$20),Personalstamm!$E$20,IF(AND(I26<>\"\",J26=\"\",I26>=Personalstamm!$D$19),Personalstamm!$E$19,IF(AND(I26<>\"\",J26<Personalstamm!$E$20,I26>=Personalstamm!$D$20),Personalstamm!$E$20-J26,IF(AND(I26<>\"\",J26<Personalstamm!E$19,I26>=Personalstamm!$D$19),Personalstamm!$E$19-J26,0)))))","v":""},"","",{"$f":"IF(OR(M26=\"\",M26=\"Bitte auswählen\"),\"\",IF(M26=\"Feiertag\",T26*U26,IF(M26=\"Gleittag\",0,VLOOKUP(B26,Personalstamm!$D$8:$F$14,3,FALSE))))","v":""},{"$f":"VLOOKUP(B26,Personalstamm!$D$8:$E$14,2,FALSE)","v":{"v":0,"d":"0.00"}},"",{"v":0,"d":"0.00"},null,{"$f":"IF(COUNTIF(Allgemein!$H$8:$H$45,A26)>0,\"Feiertag\",\"\")","v":""},{"$f":"IFERROR(VLOOKUP(A26,Allgemein!$H$8:$I$45,2,FALSE),\"\")","v":""},{"$f":"VLOOKUP(B26,Personalstamm!$D$8:$F$14,3,FALSE)","v":{"v":0,"d":"0.00"}},"",""]
["2026-01-18","Sonntag","Wochenende",{"$nulls":5},"","",{"$f":"IF(I27=\"\",\"\",IF(AND(I27<>\"\",J27=\"\",I27>=Personalstamm!$D$20),Personalstamm!$E$20,IF(AND(I27<>\"\",J27=\"\",I27>=Personalstamm!$D$19),Personalstamm!$E$19,IF(AND(I27<>\"\",J27<Personalstamm!$E$20,I27>=Personalstamm!$D$20),Personalstamm!$E$20-J27,IF(AND(I27<>\"\",J27<Personalstamm!E$19,I27>=Personalstamm!$D$19),Personalstamm!$E$19-J27,0)))))","v":""},"","",{"$f":"IF(OR(M27=\"\",M27=\"Bitte auswählen\"),\"\",IF(M27=\"Feiertag\",T27*U27,IF(M27=\"Gleittag\",0,VLOOKUP(B27,Personalstamm!$D$8:$F$14,3,FALSE))))","v":""},{"$f":"VLOOKUP(B27,Personalstamm!$D$8:$E$14,2,FALSE)","v":{"v":0,"d":"0.00"}},"",{"v":0,"d":"0.00"},null,{"$f":"IF(COUNTIF(Allgemein!$H$8:$H$45,A27)>0,\"Feiertag\",\"\")","v":""},{"$f":"IFERROR(VLOOKUP(A27,Allgemein!$H$8:$I$45,2,FALSE),\"\")","v":""},{"$f":"VLOOKUP(B27,Personalstamm!$D$8:$F$14,3,FALSE)","v":{"v":0,"d":"0.00"}},"",""]
["2026-01-19","Montag","Bitte auswählen",{"$nulls":5},"","",{"$f":"IF(I28=\"\",\"\",IF(AND(I28<>\"\",J28=\"\",I28>=Personalstamm!$D$20),Personalstamm!$E$20,IF(AND(I28<>\"\",J28=\"\",I28>=Personalstamm!$D$19),Personalstamm!$E$19,IF(AND(I28<>\"\",J28<Personalstamm!$E$20,I28>=Personalstamm!$D$20),Personalstamm!$E$20-J28,IF(AND(I28<>\"\",J28<Personalstamm!E$19,I28>=Personalstamm!$D$19),Personalstamm!$E$19-J28,0)))))","v":""},"","",{"$f":"IF(OR(M28=\"\",M28=\"Bitte auswählen\"),\"\",IF(M28=\"Feiertag\",T28*U28,IF(M28=\"Gleittag\",0,VLOOKUP(B28,Personalstamm!$D$8:$F$14,3,FALSE))))","v":""},{"$f":"VLOOKUP(B28,Personalstamm!$D$8:$E$14,2,FALSE)","v":{"v":8,"d":"8.00"}},"",{"v":0,"d":"0.00"},null,{"$f":"IF(COUNTIF(Allgemein!$H$8:$H$45,A28)>0,\"Feiertag\",\"\")","v":""},{"$f":"IFERROR(VLOOKUP(A28,Allgemein!$H$8:$I$45,2,FALSE),\"\")","v":""},{"$f":"VLOOKUP(B28,Personalstamm!$D$8:$F$14,3,FALSE)","v":{"v":8,"d":"8.00"}},"",""]
["2026-01-20","Dienstag","Bitte auswählen",{"$nulls":5},"","",{"$f":"IF(I29=\"\",\"\",IF(AND(I29<>\"\",J29=\"\",I29>=Personalstamm!$D$20),Personalstamm!$E$20,IF(AND(I29<>\"\",J29=\"\",I29>=Personalstamm!$D$19),Personalstamm!$E$19,IF(AND(I29<>\"\",J29<Personalstamm!$E$20,I29>=Personalstamm!$D$20),Personalstamm!$E$20-J29,IF(AND(I29<>\"\",J29<Personalstamm!E$19,I29>=Personalstamm!$D$19),Personalstamm!$E$19-J29,0)))))","v":""},"","",{"$f":"IF(OR(M29=\"\",M29=\"Bitte auswählen\"),\"\",IF(M29=\"Feiertag\",T29*U29,IF(M29=\"Gleittag\",0,VLOOKUP(B29,Personalstamm!$D$8:$F$14,3,FALSE))))","v":""},{"$f":"VLOOKUP(B29,Personalstamm!$D$8:$E$14,2,FALSE)","v":{"v":8,"d":"8.00"}},"",{"v":0,"d":"0.00"},null,{"$f":"IF(COUNTIF(Allgemein!$H$8:$H$45,A29)>0,\"Feiertag\",\"\")","v":""},{"$f":"IFERROR(VLOOKUP(A29,Allgemein!$H$8:$I$45,2,FALSE),\"\")","v":""},{"$f":"VLOOKUP(B29,Personalstamm!$D$8:$F$14,3,FALSE)","v":{"v":8,"d":"8.00"}},"",""]
["2026-01-21","Mittwoch","Bitte auswählen",{"$nulls":5},"","",{"$f":"IF(I30=\"\",\"\",IF(AND(I30<>\"\",J30=\"\",I30>=Personalstamm!$D$20),Personalstamm!$E$20,IF(AND(I30<>\"\",J30=\"\",I30>=Personalstamm!$D$19),Personalstamm!$E$19,IF(AND(I30<>\"\",J30<Personalstamm!$E$20,I30>=Personalstamm!$D$20),Personalstamm!$E$20-J30,IF(AND(I30<>\"\",J30<Personalstamm!E$19,I30>=Personalstamm!$D$19),Personalstamm!$E$19-J30,0)))))","v":""},"","",{"$f":"IF(OR(M30=\"\",M30=\"Bitte auswählen\"),\"\",IF(M30=\"Feiertag\",T30*U30,IF(M30=\"Gleittag\",0,VLOOKUP(B30,Personalstamm!$D$8:$F$14,3,FALSE))))","v":""},{"$f":"VLOOKUP(B30,Personalstamm!$D$8:$E$14,2,FALSE)","v":{"v":8,"d":"8.00"}},"",{"v":0,"d":"0.00"},null,{"$f":"IF(COUNTIF(Allgemein!$H$8:$H$45,A30)>0,\"Feiertag\",\"\")","v":""},{"$f":"IFERROR(VLOOKUP(A30,Allgemein!$H$8:$I$45,2,FALSE),\"\")","v":""},{"$f":"VLOOKUP(B30,Personalstamm!$D$8:$F$14,3,FALSE)","v":{"v":8,"d":"8.00"}},"",""]
["2026-01-22","Donnerstag","Bitte auswählen",{"$nulls":5},"","",{"$f":"IF(I31=\"\",\"\",IF(AND(I31<>\"\",J31=\"\",I31>=Personalstamm!$D$20),Personalstamm!$E$20,IF(AND(I31<>\"\",J31=\"\",I31>=Personalstamm!$D$19),Personalstamm!$E$19,IF(AND(I31<>\"\",J31<Personalstamm!$E$20,I31>=Personalstamm!$D$20),Personalstamm!$E$20-J31,IF(AND(I31<>\"\",J31<Personalstamm!E$19,I31>=Personalstamm!$D$19),Personalstamm!$E$19-J31,0)))))","v":""},"","",{"$f":"IF(OR(M31=\"\",M31=\"Bitte auswählen\"),\"\",IF(M31=\"Feiertag\",T31*U31,IF(M31=\"Gleittag\",0,VLOOKUP(B31,Personalstamm!$D$8:$F$14,3,FALSE))))","v":""},{"$f":"VLOOKUP(B31,Personalstamm!$D$8:$E$14,2,FALSE)","v":{"v":8,"d":"8.00"}},"",{"v":0,"d":"0.00"},null,{"$f":"IF(COUNTIF(Allgemein!$H$8:$H$45,A31)>0,\"Feiertag\",\"\")","v":""},{"$f":"IFERROR(VLOOKUP(A31,Allgemein!$H$8:$I$45,2,FALSE),\"\")","v":""},{"$f":"VLOOKUP(B31,Personalstamm!$D$8:$F$14,3,FALSE)","v":{"v":8,"d":"8.00"}},"",""]
["2026-01-23","Freitag","Bitte auswählen",{"$nulls":5},"","",{"$f":"IF(I32=\"\",\"\",IF(AND(I32<>\"\",J32=\"\",I32>=Personalstamm!$D$20),Personalstamm!$E$20,IF(AND(I32<>\"\",J32=\"\",I32>=Personalstamm!$D$19),Personalstamm!$E$19,IF(AND(I32<>\"\",J32<Personalstamm!$E$20,I32>=Personalstamm!$D$20),Personalstamm!$E$20-J32,IF(AND(I32<>\"\",J32<Personalstamm!E$19,I32>=Personalstamm!$D$19),Personalstamm!$E$19-J32,0)))))","v":""},"","",{"$f":"IF(OR(M32=\"\",M32=\"Bitte auswählen\"),\"\",IF(M32=\"Feiertag\",T32*U32,IF(M32=\"Gleittag\",0,VLOOKUP(B32,Personalstamm!$D$8:$F$14,3,FALSE))))","v":""},{"$f":"VLOOKUP(B32,Personalstamm!$D$8:$E$14,2,FALSE)","v":{"v":8,"d":"8.00"}},"",{"v":0,"d":"0.00"},null,{"$f":"IF(COUNTIF(Allgemein!$H$8:$H$45,A32)>0,\"Feiertag\",\"\")","v":""},{"$f":"IFERROR(VLOOKUP(A32,Allgemein!$H$8:$I$45,2,FALSE),\"\")","v":""},{"$f":"VLOOKUP(B32,Personalstamm!$D$8:$F$14,3,FALSE)","v":{"v":8,"d":"8.00"}},"",""]
["2026-01-24","Samstag","Wochenende",{"$nulls":5},"","",{"$f":"IF(I33=\"\",\"\",IF(AND(I33<>\"\",J33=\"\",I33>=Personalstamm!$D$20),Personalstamm!$E$20,IF(AND(I33<>\"\",J33=\"\",I33>=Personalstamm!$D$19),Personalstamm!$E$19,IF(AND(I33<>\"\",J33<Personalstamm!$E$20,I33>=Personalstamm!$D$20),Personalstamm!$E$20-J33,IF(AND(I33<>\"\",J33<Personalstamm!E$19,I33>=Personalstamm!$D$19),Personalstamm!$E$19-J33,0)))))","v":""},"","",{"$f":"IF(OR(M33=\"\",M33=\"Bitte auswählen\"),\"\",IF(M33=\"Feiertag\",T33*U33,IF(M33=\"Gleittag\",0,VLOOKUP(B33,Personalstamm!$D$8:$F$14,3,FALSE))))","v":""},{"$f":"VLOOKUP(B33,Personalstamm!$D$8:$E$14,2,FALSE)","v":{"v":0,"d":"0.00"}},"",{"v":0,"d":"0.00"},null,{"$f":"IF(COUNTIF(Allgemein!$H$8:$H$45,A33)>0,\"Feiertag\",\"\")","v":""},{"$f":"IFERROR(VLOOKUP(A33,Allgemein!$H$8:$I$45,2,FALSE),\"\")","v":""},{"$f":"VLOOKUP(B33,Personalstamm!$D$8:$F$14,3,FALSE)","v":{"v":0,"d":"0.00"}},"",""]
["2026-01-25","Sonntag","Wochenende",{"$nulls":5},"","",{"$f":"IF(I34=\"\",\"\",IF(AND(I34<>\"\",J34=\"\",I34>=Personalstamm!$D$20),Personalstamm!$E$20,IF(AND(I34<>\"\",J34=\"\",I34>=Personalstamm!$D$19),Personalstamm!$E$19,IF(AND(I34<>\"\",J34<Personalstamm!$E$20,I34>=Personalstamm!$D$20),Personalstamm!$E$20-J34,IF(AND(I34<>\"\",J34<Personalstamm!E$19,I34>=Personalstamm!$D$19),Personalstamm!$E$19-J34,0)))))","v":""},"","",{"$f":"IF(OR(M34=\"\",M34=\"Bitte auswählen\"),\"\",IF(M34=\"Feiertag\",T34*U34,IF(M34=\"Gleittag\",0,VLOOKUP(B34,Personalstamm!$D$8:$F$14,3,FALSE))))","v":""},{"$f":"VLOOKUP(B34,Personalstamm!$D$8:$E$14,2,FALSE)","v":{"v":0,"d":"0.00"}},"",{"v":0,"d":"0.00"},null,{"$f":"IF(COUNTIF(Allgemein!$H$8:$H$45,A34)>0,\"Feiertag\",\"\")","v":""},{"$f":"IFERROR(VLOOKUP(A34,Allgemein!$H$8:$I$45,2,FALSE),\"\")","v":""},{"$f":"VLOOKUP(B34,Personalstamm!$D$8:$F$14,3,FALSE)","v":{"v":0,"d":"0.00"}},"",""]
["2026-01-26","Montag","Bitte auswählen",{"$nulls":5},"","",{"$f":"IF(I35=\"\",\"\",IF(AND(I35<>\"\",J35=\"\",I35>=Personalstamm!$D$20),Personalstamm!$E$20,IF(AND(I35<>\"\",J35=\"\",I35>=Personalstamm!$D$19),Personalstamm!$E$19,IF(AND(I35<>\"\",J35<Personalstamm!$E$20,I35>=Personalstamm!$D$20),Personalstamm!$E$20-J35,IF(AND(I35<>\"\",J35<Personalstamm!E$19,I35>=Personalstamm!$D$19),Personalstamm!$E$19-J35,0)))))","v":""},"","",{"$f":"IF(OR(M35=\"\",M35=\"Bitte auswählen\"),\"\",IF(M35=\"Feiertag\",T35*U35,IF(M35=\"Gleittag\",0,VLOOKUP(B35,Personalstamm!$D$8:$F$14,3,FALSE))))","v":""},{"$f":"VLOOKUP(B35,Personalstamm!$D$8:$E$14,2,FALSE)","v":{"v":8,"d":"8.00"}},"",{"v":0,"d":"0.00"},null,{"$f":"IF(COUNTIF(Allgemein!$H$8:$H$45,A35)>0,\"Feiertag\",\"\")","v":""},{"$f":"IFERROR(VLOOKUP(A35,Allgemein!$H$8:$I$45,2,FALSE),\"\")","v":""},{"$f":"VLOOKUP(B35,Personalstamm!$D$8:$F$14,3,FALSE)","v":{"v":8,"d":"8.00"}},"",""]
["2026-01-27","Dienstag","Bitte auswählen",{"$nulls":5},"","",{"$f":"IF(I36=\"\",\"\",IF(AND(I36<>\"\",J36=\"\",I36>=Personalstamm!$D$20),Personalstamm!$E$20,IF(AND(I36<>\"\",J36=\"\",I36>=Personalstamm!$D$19),Personalstamm!$E$19,IF(AND(I36<>\"\",J36<Personalstamm!$E$20,I36>=Personalstamm!$D$20),Personalstamm!$E$20-J36,IF(AND(I36<>\"\",J36<Personalstamm!E$19,I36>=Personalstamm!$D$19),Personalstamm!$E$19-J36,0)))))","v":""},"","",{"$f":"IF(OR(M36=\"\",M36=\"Bitte auswählen\"),\"\",IF(M36=\"Feiertag\",T36*U36,IF(M36=\"Gleittag\",0,VLOOKUP(B36,Personalstamm!$D$8:$F$14,3,FALSE))))","v":""},{"$f":"VLOOKUP(B36,Personalstamm!$D$8:$E$14,2,FALSE)","v":{"v":8,"d":"8.00"}},"",{"v":0,"d":"0.00"},null,{"$f":"IF(COUNTIF(Allgemein!$H$8:$H$45,A36)>0,\"Feiertag\",\"\")","v":""},{"$f":"IFERROR(VLOOKUP(A36,Allgemein!$H$8:$I$45,2,FALSE),\"\")","v":""},{"$f":"VLOOKUP(B36,Personalstamm!$D$8:$F$14,3,FALSE)","v":{"v":8,"d":"8.00"}},"",""]
["2026-01-28","Mittwoch","Bitte auswählen",{"$nulls":5},"","",{"$f":"IF(I37=\"\",\"\",IF(AND(I37<>\"\",J37=\"\",I37>=Personalstamm!$D$20),Personalstamm!$E$20,IF(AND(I37<>\"\",J37=\"\",I37>=Personalstamm!$D$19),Personalstamm!$E$19,IF(AND(I37<>\"\",J37<Personalstamm!$E$20,I37>=Personalstamm!$D$20),Personalstamm!$E$20-J37,IF(AND(I37<>\"\",J37<Personalstamm!E$19,I37>=Personalstamm!$D$19),Personalstamm!$E$19-J37,0)))))","v":""},"","",{"$f":"IF(OR(M37=\"\",M37=\"Bitte auswählen\"),\"\",IF(M37=\"Feiertag\",T37*U37,IF(M37=\"Gleittag\",0,VLOOKUP(B37,Personalstamm!$D$8:$F$14,3,FALSE))))","v":""},{"$f":"VLOOKUP(B37,Personalstamm!$D$8:$E$14,2,FALSE)","v":{"v":8,"d":"8.00"}},"",{"v":0,"d":"0.00"},null,{"$f":"IF(COUNTIF(Allgemein!$H$8:$H$45,A37)>0,\"Feiertag\",\"\")","v":""},{"$f":"IFERROR(VLOOKUP(A37,Allgemein!$H$8:$I$45,2,FALSE),\"\")","v":""},{"$f":"VLOOKUP(B37,Personalstamm!$D$8:$F$14,3,FALSE)","v":{"v":8,"d":"8.00"}},"",""]
["2026-01-29","Donnerstag","Bitte auswählen",{"$nulls":5},"","",{"$f":"IF(I38=\"\",\"\",IF(AND(I38<>\"\",J38=\"\",I38>=Personalstamm!$D$20),Personalstamm!$E$20,IF(AND(I38<>\"\",J38=\"\",I38>=Personalstamm!$D$19),Personalstamm!$E$19,IF(AND(I38<>\"\",J38<Personalstamm!$E$20,I38>=Personalstamm!$D$20),Personalstamm!$E$20-J38,IF(AND(I38<>\"\",J38<Personalstamm!E$19,I38>=Personalstamm!$D$19),Personalstamm!$E$19-J38,0)))))","v":""},"","",{"$f":"IF(OR(M38=\"\",M38=\"Bitte auswählen\"),\"\",IF(M38=\"Feiertag\",T38*U38,IF(M38=\"Gleittag\",0,VLOOKUP(B38,Personalstamm!$D$8:$F$14,3,FALSE))))","v":""},{"$f":"VLOOKUP(B38,Personalstamm!$D$8:$E$14,2,FALSE)","v":{"v":8,"d":"8.00"}},"",{"v":0,"d":"0.00"},null,{"$f":"IF(COUNTIF(Allgemein!$H$8:$H$45,A38)>0,\"Feiertag\",\"\")","v":""},{"$f":"IFERROR(VLOOKUP(A38,Allgemein!$H$8:$I$45,2,FALSE),\"\")","v":""},{"$f":"VLOOKUP(B38,Personalstamm!$D$8:$F$14,3,FALSE)","v":{"v":8,"d":"8.00"}},"",""]
["2026-01-30","Freitag","Bitte auswählen",{"$nulls":5},"","",{"$f":"IF(I39=\"\",\"\",IF(AND(I39<>\"\",J39=\"\",I39>=Personalstamm!$D$20),Personalstamm!$E$20,IF(AND(I39<>\"\",J39=\"\",I39>=Personalstamm!$D$19),Personalstamm!$E$19,IF(AND(I39<>\"\",J39<Personalstamm!$E$20,I39>=Personalstamm!$D$20),Personalstamm!$E$20-J39,IF(AND(I39<>\"\",J39<Personalstamm!E$19,I39>=Personalstamm!$D$19),Personalstamm!$E$19-J39,0)))))","v":""},"","",{"$f":"IF(OR(M39=\"\",M39=\"Bitte auswählen\"),\"\",IF(M39=\"Feiertag\",T39*U39,IF(M39=\"Gleittag\",0,VLOOKUP(B39,Personalstamm!$D$8:$F$14,3,FALSE))))","v":""},{"$f":"VLOOKUP(B39,Personalstamm!$D$8:$E$14,2,FALSE)","v":{"v":8,"d":"8.00"}},"",{"v":0,"d":"0.00"},null,{"$f":"IF(COUNTIF(Allgemein!$H$8:$H$45,A39)>0,\"Feiertag\",\"\")","v":""},{"$f":"IFERROR(VLOOKUP(A39,Allgemein!$H$8:$I$45,2,FALSE),\"\")","v":""},{"$f":"VLOOKUP(B39,Personalstamm!$D$8:$F$14,3,FALSE)","v":{"v":8,"d":"8.00"}},"",""]
["2026-01-31","Samstag","Wochenende",{"$nulls":5},"","",{"$f":"IF(I40=\"\",\"\",IF(AND(I40<>\"\",J40=\"\",I40>=Personalstamm!$D$20),Personalstamm!$E$20,IF(AND(I40<>\"\",J40=\"\",I40>=Personalstamm!$D$19),Personalstamm!$E$19,IF(AND(I40<>\"\",J40<Personalstamm!$E$20,I40>=Personalstamm!$D$20),Personalstamm!$E$20-J40,IF(AND(I40<>\"\",J40<Personalstamm!E$19,I40>=Personalstamm!$D$19),Personalstamm!$E$19-J40,0)))))","v":""},"","",{"$f":"IF(OR(M40=\"\",M40=\"Bitte auswählen\"),\"\",IF(M40=\"Feiertag\",T40*U40,IF(M40=\"Gleittag\",0,VLOOKUP(B40,Personalstamm!$D$8:$F$14,3,FALSE))))","v":""},{"$f":"VLOOKUP(B40,Personalstamm!$D$8:$E$14,2,FALSE)","v":{"v":0,"d":"0.00"}},"",{"v":0,"d":"0.00"},null,{"$f":"IF(COUNTIF(Allgemein!$H$8:$H$45,A40)>0,\"Feiertag\",\"\")","v":""},{"$f":"IFERROR(VLOOKUP(A40,Allgemein!$H$8:$I$45,2,FALSE),\"\")","v":""},{"$f":"VLOOKUP(B40,Personalstamm!$D$8:$F$14,3,FALSE)","v":{"v":0,"d":"0.00"}},"",""]
["Summe",{"$nulls":7},{"$f":"SUM(I10:I40)","v":{"v":0,"d":"0.00"}},{"$f":"SUM(J10:J40)","v":{"v":0,"d":"0.00"}},{"$f":"SUM(K10:K40)","v":{"v":0,"d":"0.00"}},{"$f":"SUM(L10:L40)","v":{"v":0,"d":"0.00"}},null,{"$f":"SUM(N10:N40)","v":{"v":16,"d":"16.00"}},{"$f":"SUM(O10:O40)","v":{"v":176,"d":"176.00"}},{"$f":"SUM(P10:P40)","v":{"v":0,"d":"0.00"}}]
[]
["Art","Anzahl Tage",null,"Fehlzeitenart","Anzahl Tage","Anzahl Stunden",null,"Urlaub genommen","Urlaub geplant"]
["Monat",{"$f":"COUNTIF($C$10:$C$40,\"*\")","v":{"v":31,"d":"31.00"}},null,"Urlaub",{"$f":"COUNTIF($M$10:$M$40,Allgemein!$I$50)","v":{"v":0,"d":"0.00"}},{"$f":"SUMIF($M$10:$M$40,Allgemein!$I$50,$N$10:$N$40)","v":{"v":0,"d":"0.00"}},null,{"$f":"COUNTIFS($A$10:$A$40,\"<\"&TODAY(),$M$10:$M$40,\"Urlaub\")","v":{"v":0,"d":"0.00"}},{"$f":"COUNTIFS($A$10:$A$40,\">=\"&TODAY(),$M$10:$M$40,\"Urlaub\")","v":{"v":0,"d":"0.00"}}]
["Anwesenheit",{"$f":"COUNTIF($C$10:$C$40,Allgemein!$G$50)","v":{"v":0,"d":"0.00"}},null,"Krankheit",{"$f":"COUNTIF($M$10:$M$40,Allgemein!$I$51)","v":{"v":0,"d":"0.00"}},{"$f":"SUMIF($M$10:$M$40,Allgemein!$I$51,$N$10:$N$40)","v":{"v":0,"d":"0.00"}}]
["Fehlzeit",{"$f":"COUNTIF($C$10:$C$40,Allgemein!$G$51)","v":{"v":2,"d":"2.00"}},null,"Kurzarbeit",{"$f":"COUNTIF($M$10:$M$40,Allgemein!$I$52)","v":{"v":0,"d":"0.00"}},{"$f":"SUMIF($M$10:$M$40,Allgemein!$I$52,$N$10:$N$40)","v":{"v":0,"d":"0.00"}}]
["Wochenende",{"$f":"COUNTIF($C$10:$C$40,Allgemein!$G$52)","v":{"v":9,"d":"9.00"}},null,"Mutterschutz",{"$f":"COUNTIF($M$10:$M$40,Allgemein!$I$53)","v":{"v":0,"d":"0.00"}},{"$f":"SUMIF($M$10:$M$40,Allgemein!$I$53,$N$10:$N$40)","v":{"v":0,"d":"0.00"}}]
["Undefiniert",{"$f":"COUNTIF($C$10:$C$40,Allgemein!$G$49)","v":{"v":20,"d":"20.00"}},null,"Fortbildung",{"$f":"COUNTIF($M$10:$M$40,Allgemein!$I$54)","v":{"v":0,"d":"0.00"}},{"$f":"SUMIF($M$10:$M$40,Allgemein!$I$54,$N$10:$N$40)","v":{"v":0,"d":"0.00"}}]
[{"$nulls":3},"Elternzeit",{"$f":"COUNTIF($M$10:$M$40,Allgemein!$I$55)","v":{"v":0,"d":"0.00"}},{"$f":"SUMIF($M$10:$M$40,Allgemein!$I$55,$N$10:$N$40)","v":{"v":0,"d":"0.00"}}]
[{"$nulls":3},"Gleittag",{"$f":"COUNTIF($M$10:$M$40,Allgemein!$I$56)","v":{"v":0,"d":"0.00"}},{"$f":"SUMIF($M$10:$M$40,Allgemein!$I$56,$V$10:$V$40)","v":{"v":0,"d":"0.00"}}]
[{"$nulls":3},"Schule",{"$f":"COUNTIF($M$10:$M$40,Allgemein!$I$57)","v":{"v":0,"d":"0.00"}},{"$f":"SUMIF($M$10:$M$40,Allgemein!$I$57,$N$10:$N$40)","v":{"v":0,"d":"0.00"}}]
[{"$nulls":3},"Feiertag",{"$f":"COUNTIF($M$10:$M$40,Allgemein!$I$58)","v":{"v":2,"d":"2.00"}},{"$f":"SUMIF($M$10:$M$40,Allgemein!$I$58,$N$10:$N$40)","v":{"v":16,"d":"16.00"}}]
[{"$nulls":3},"Undefiniert",{"$f":"COUNTIF($M$10:$M$40,Allgemein!$I$49)","v":{"v":0,"d":"0.00"}},{"$f":"SUMIF($M$10:$M$40,Allgemein!$I$49,$N$10:$N$40)","v":{"v":0,"d":"0.00"}}]

{"sheet":"Feb.","index":6,"n_rows":50,"n_cols":23,"rows_kept":50}
[]
[]
[]
[]
[]
["Urlaubsvortrag",{"$f":"Jan.!$F$6","v":{"v":30,"d":"30.00"}},"Urlaub genommen",{"$f":"$H$41","v":{"v":0,"d":"0.00"}},"Resturlaub",{"$f":"$B$6-$D$6","v":{"v":30,"d":"30.00"}}]
["Saldovortrag",{"$f":"Jan.!$F$7","v":{"v":0,"d":"0.00"}},"Saldoänderung",{"$f":"$P$38","v":{"v":0,"d":"0.00"}},"Kumulierter Saldo",{"$f":"$B$7+$D$7","v":{"v":0,"d":"0.00"}}]
[]
["Datum","Wochentag","Art","Arbeitsort","Von Uhrzeit","Bis Uhrzeit","Von Uhrzeit","Bis Uhrzeit","Bruttoarbeitszeit","Geb. Pause","Mindestpause","Nettoarbeitszeit","Fehlzeitenart","Fehlstunden","Sollstunden","Tagessaldo","Kumulierter Saldo",null,"Feiertag","Feiertag Anteil Tag","FZ-Gutschrift","Gleittag","Ausgewertet"]
["2026-02-01",{"$f":"TEXT(A10,\"tttt\")","v":"Sonntag"},{"$f":"IF(AND(S10=\"Feiertag\",T10>0),\"Fehlzeit\",IF(OR(B10=\"Samstag\",B10=\"Sonntag\"),\"Wochenende\",\"Bitte auswählen\"))","v":"Wochenende"},{"$nulls":5},{"$f":"IF(AND(OR(C10=\"Anwesenheit\",C10=\"Wochenende\"),E10<>\"\",F10<>\"\",W10=\"Ja\"),((F10-E10)+(H10-G10))*24,\"\")","v":""},{"$f":"IF(I10=\"\",\"\",IF(AND(G10<>\"\",H10<>\"\"),(G10-F10)*24,0))","v":""},{"$f":"IF(I10=\"\",\"\",IF(AND(I10<>\"\",J10=\"\",I10>=Personalstamm!$D$20),Personalstamm!$E$20,IF(AND(I10<>\"\",J10=\"\",I10>=Personalstamm!$D$19),Personalstamm!$E$19,IF(AND(I10<>\"\",J10<Personalstamm!$E$20,I10>=Personalstamm!$D$20),Personalstamm!$E$20-J10,IF(AND(I10<>\"\",J10<Personalstamm!E$19,I10>=Personalstamm!$D$19),Personalstamm!$E$19-J10,0)))))","v":""},{"$f":"IF(I10<>\"\",I10-K10,\"\")","v":""},{"$f":"IF(AND(S10=\"Feiertag\",T10>0),\"Feiertag\",IF(C10=\"Fehlzeit\",\"Bitte auswählen\",\"\"))","v":""},{"$f":"IF(OR(M10=\"\",M10=\"Bitte auswählen\"),\"\",IF(M10=\"Feiertag\",T10*U10,IF(M10=\"Gleittag\",0,VLOOKUP(B10,Personalstamm!$D$8:$F$14,3,FALSE))))","v":""},{"$f":"VLOOKUP(B10,Personalstamm!$D$8:$E$14,2,FALSE)","v":{"v":0,"d":"0.00"}},{"$f":"IF(AND(OR(C10=\"Anwesenheit\",C10=\"Wochenende\"),L10<>\"\"),L10-O10,IF(AND(C10=\"Fehlzeit\",N10<>\"\",W10=\"Ja\"),N10-O10,IF(W10=\"Ja\",-O10,\"\")))","v":""},{"$f":"IF(P10=\"\",B7,B7+P10)","v":{"v":0,"d":"0.00"}},null,{"$f":"IF(COUNTIF(Allgemein!$H$8:$H$45,A10)>0,\"Feiertag\",\"\")","v":""},{"$f":"IFERROR(VLOOKUP(A10,Allgemein!$H$8:$I$45,2,FALSE),\"\")","v":""},{"$f":"VLOOKUP(B10,Personalstamm!$D$8:$F$14,3,FALSE)","v":{"v":0,"d":"0.00"}},{"$f":"IF(M10=\"Gleittag\",ABS(P10),\"\")","v":""},{"$f":"IF(A10<=TODAY(),\"Ja\",\"\")","v":""}]
["2026-02-02",{"$f":"TEXT(A11,\"tttt\")","v":"Montag"},"Bitte auswählen",{"$nulls":5},"",{"$f":"IF(I11=\"\",\"\",IF(AND(G11<>\"\",H11<>\"\"),(G11-F11)*24,0))","v":""},{"$f":"IF(I11=\"\",\"\",IF(AND(I11<>\"\",J11=\"\",I11>=Personalstamm!$D$20),Personalstamm!$E$20,IF(AND(I11<>\"\",J11=\"\",I11>=Personalstamm!$D$19),Personalstamm!$E$19,IF(AND(I11<>\"\",J11<Personalstamm!$E$20,I11>=Personalstamm!$D$20),Personalstamm!$E$20-J11,IF(AND(I11<>\"\",J11<Personalstamm!E$19,I11>=Personalstamm!$D$19),Personalstamm!$E$19-J11,0)))))","v":""},{"$f":"IF(I11<>\"\",I11-K11,\"\")","v":""},"",{"$f":"IF(OR(M11=\"\",M11=\"Bitte auswählen\"),\"\",IF(M11=\"Feiertag\",T11*U11,IF(M11=\"Gleittag\",0,VLOOKUP(B11,Personalstamm!$D$8:$F$14,3,FALSE))))","v":""},{"$f":"VLOOKUP(B11,Personalstamm!$D$8:$E$14,2,FALSE)","v":{"v":8,"d":"8.00"}},"",{"$f":"IF(P11=\"\",Q10,Q10+P11)","v":{"v":0,"d":"0.00"}},null,{"$f":"IF(COUNTIF(Allgemein!$H$8:$H$45,A11)>0,\"Feiertag\",\"\")","v":""},{"$f":"IFERROR(VLOOKUP(A11,Allgemein!$H$8:$I$45,2,FALSE),\"\")","v":""},{"$f":"VLOOKUP(B11,Personalstamm!$D$8:$F$14,3,FALSE)","v":{"v":8,"d":"8.00"}},{"$f":"IF(M11=\"Gleittag\",ABS(P11),\"\")","v":""},""]
["2026-02-03","Dienstag","Bitte auswählen",{"$nulls":5},"","",{"$f":"IF(I12=\"\",\"\",IF(AND(I12<>\"\",J12=\"\",I12>=Personalstamm!$D$20),Personalstamm!$E$20,IF(AND(I12<>\"\",J12=\"\",I12>=Personalstamm!$D$19),Personalstamm!$E$19,IF(AND(I12<>\"\",J12<Personalstamm!$E$20,I12>=Personalstamm!$D$20),Personalstamm!$E$20-J12,IF(AND(I12<>\"\",J12<Personalstamm!E$19,I12>=Personalstamm!$D$19),Personalstamm!$E$19-J12,0)))))","v":""},"","",{"$f":"IF(OR(M12=\"\",M12=\"Bitte auswählen\"),\"\",IF(M12=\"Feiertag\",T12*U12,IF(M12=\"Gleittag\",0,VLOOKUP(B12,Personalstamm!$D$8:$F$14,3,FALSE))))","v":""},{"$f":"VLOOKUP(B12,Personalstamm!$D$8:$E$14,2,FALSE)","v":{"v":8,"d":"8.00"}},"",{"$f":"IF(P12=\"\",Q11,Q11+P12)","v":{"v":0,"d":"0.00"}},null,{"$f":"IF(COUNTIF(Allgemein!$H$8:$H$45,A12)>0,\"Feiertag\",\"\")","v":""},{"$f":"IFERROR(VLOOKUP(A12,Allgemein!$H$8:$I$45,2,FALSE),\"\")","v":""},{"$f":"VLOOKUP(B12,Personalstamm!$D$8:$F$14,3,FALSE)","v":{"v":8,"d":"8.00"}},"",""]
["2026-02-04","Mittwoch","Bitte auswählen",{"$nulls":5},"","",{"$f":"IF(I13=\"\",\"\",IF(AND(I13<>\"\",J13=\"\",I13>=Personalstamm!$D$20),Personalstamm!$E$20,IF(AND(I13<>\"\",J13=\"\",I13>=Personalstamm!$D$19),Personalstamm!$E$19,IF(AND(I13<>\"\",J13<Personalstamm!$E$20,I13>=Personalstamm!$D$20),Personalstamm!$E$20-J13,IF(AND(I13<>\"\",J13<Personalstamm!E$19,I13>=Personalstamm!$D$19),Personalstamm!$E$19-J13,0)))))","v":""},"","",{"$f":"IF(OR(M13=\"\",M13=\"Bitte auswählen\"),\"\",IF(M13=\"Feiertag\",T13*U13,IF(M13=\"Gleittag\",0,VLOOKUP(B13,Personalstamm!$D$8:$F$14,3,FALSE))))","v":""},{"$f":"VLOOKUP(B13,Personalstamm!$D$8:$E$14,2,FALSE)","v":{"v":8,"d":"8.00"}},"",{"v":0,"d":"0.00"},null,{"$f":"IF(COUNTIF(Allgemein!$H$8:$H$45,A13)>0,\"Feiertag\",\"\")","v":""},{"$f":"IFERROR(VLOOKUP(A13,Allgemein!$H$8:$I$45,2,FALSE),\"\")","v":""},{"$f":"VLOOKUP(B13,Personalstamm!$D$8:$F$14,3,FALSE)","v":{"v":8,"d":"8.00"}},"",""]
["2026-02-05","Donnerstag","Bitte auswählen",{"$nulls":5},"","",{"$f":"IF(I14=\"\",\"\",IF(AND(I14<>\"\",J14=\"\",I14>=Personalstamm!$D$20),Personalstamm!$E$20,IF(AND(I14<>\"\",J14=\"\",I14>=Personalstamm!$D$19),Personalstamm!$E$19,IF(AND(I14<>\"\",J14<Personalstamm!$E$20,I14>=Personalstamm!$D$20),Personalstamm!$E$20-J14,IF(AND(I14<>\"\",J14<Personalstamm!E$19,I14>=Personalstamm!$D$19),Personalstamm!$E$19-J14,0)))))","v":""},"","",{"$f":"IF(OR(M14=\"\",M14=\"Bitte auswählen\"),\"\",IF(M14=\"Feiertag\",T14*U14,IF(M14=\"Gleittag\",0,VLOOKUP(B14,Personalstamm!$D$8:$F$14,3,FALSE))))","v":""},{"$f":"VLOOKUP(B14,Personalstamm!$D$8:$E$14,2,FALSE)","v":{"v":8,"d":"8.00"}},"",{"v":0,"d":"0.00"},null,{"$f":"IF(COUNTIF(Allgemein!$H$8:$H$45,A14)>0,\"Feiertag\",\"\")","v":""},{"$f":"IFERROR(VLOOKUP(A14,Allgemein!$H$8:$I$45,2,FALSE),\"\")","v":""},{"$f":"VLOOKUP(B14,Personalstamm!$D$8:$F$14,3,FALSE)","v":{"v":8,"d":"8.00"}},"",""]
["2026-02-06","Freitag","Bitte auswählen",{"$nulls":5},"","",{"$f":"IF(I15=\"\",\"\",IF(AND(I15<>\"\",J15=\"\",I15>=Personalstamm!$D$20),Personalstamm!$E$20,IF(AND(I15<>\"\",J15=\"\",I15>=Personalstamm!$D$19),Personalstamm!$E$19,IF(AND(I15<>\"\",J15<Personalstamm!$E$20,I15>=Personalstamm!$D$20),Personalstamm!$E$20-J15,IF(AND(I15<>\"\",J15<Personalstamm!E$19,I15>=Personalstamm!$D$19),Personalstamm!$E$19-J15,0)))))","v":""},"","",{"$f":"IF(OR(M15=\"\",M15=\"Bitte auswählen\"),\"\",IF(M15=\"Feiertag\",T15*U15,IF(M15=\"Gleittag\",0,VLOOKUP(B15,Personalstamm!$D$8:$F$14,3,FALSE))))","v":""},{"$f":"VLOOKUP(B15,Personalstamm!$D$8:$E$14,2,FALSE)","v":{"v":8,"d":"8.00"}},"",{"v":0,"d":"0.00"},null,{"$f":"IF(COUNTIF(Allgemein!$H$8:$H$45,A15)>0,\"Feiertag\",\"\")","v":""},{"$f":"IFERROR(VLOOKUP(A15,Allgemein!$H$8:$I$45,2,FALSE),\"\")","v":""},{"$f":"VLOOKUP(B15,Personalstamm!$D$8:$F$14,3,FALSE)","v":{"v":8,"d":"8.00"}},"",""]
["2026-02-07","Samstag","Wochenende",{"$nulls":5},"","",{"$f":"IF(I16=\"\",\"\",IF(AND(I16<>\"\",J16=\"\",I16>=Personalstamm!$D$20),Personalstamm!$E$20,IF(AND(I16<>\"\",J16=\"\",I16>=Personalstamm!$D$19),Personalstamm!$E$19,IF(AND(I16<>\"\",J16<Personalstamm!$E$20,I16>=Personalstamm!$D$20),Personalstamm!$E$20-J16,IF(AND(I16<>\"\",J16<Personalstamm!E$19,I16>=Personalstamm!$D$19),Personalstamm!$E$19-J16,0)))))","v":""},"","",{"$f":"IF(OR(M16=\"\",M16=\"Bitte auswählen\"),\"\",IF(M16=\"Feiertag\",T16*U16,IF(M16=\"Gleittag\",0,VLOOKUP(B16,Personalstamm!$D$8:$F$14,3,FALSE))))","v":""},{"$f":"VLOOKUP(B16,Personalstamm!$D$8:$E$14,2,FALSE)","v":{"v":0,"d":"0.00"}},"",{"v":0,"d":"0.00"},null,{"$f":"IF(COUNTIF(Allgemein!$H$8:$H$45,A16)>0,\"Feiertag\",\"\")","v":""},{"$f":"IFERROR(VLOOKUP(A16,Allgemein!$H$8:$I$45,2,FALSE),\"\")","v":""},{"$f":"VLOOKUP(B16,Personalstamm!$D$8:$F$14,3,FALSE)","v":{"v":0,"d":"0.00"}},"",""]
["2026-02-08","Sonntag","Wochenende",{"$nulls":5},"","",{"$f":"IF(I17=\"\",\"\",IF(AND(I17<>\"\",J17=\"\",I17>=Personalstamm!$D$20),Personalstamm!$E$20,IF(AND(I17<>\"\",J17=\"\",I17>=Personalstamm!$D$19),Personalstamm!$E$19,IF(AND(I17<>\"\",J17<Personalstamm!$E$20,I17>=Personalstamm!$D$20),Personalstamm!$E$20-J17,IF(AND(I17<>\"\",J17<Personalstamm!E$19,I17>=Personalstamm!$D$19),Personalstamm!$E$19-J17,0)))))","v":""},"","",{"$f":"IF(OR(M17=\"\",M17=\"Bitte auswählen\"),\"\",IF(M17=\"Feiertag\",T17*U17,IF(M17=\"Gleittag\",0,VLOOKUP(B17,Personalstamm!$D$8:$F$14,3,FALSE))))","v":""},{"$f":"VLOOKUP(B17,Personalstamm!$D$8:$E$14,2,FALSE)","v":{"v":0,"d":"0.00"}},"",{"v":0,"d":"0.00"},null,{"$f":"IF(COUNTIF(Allgemein!$H$8:$H$45,A17)>0,\"Feiertag\",\"\")","v":""},{"$f":"IFERROR(VLOOKUP(A17,Allgemein!$H$8:$I$45,2,FALSE),\"\")","v":""},{"$f":"VLOOKUP(B17,Personalstamm!$D$8:$F$14,3,FALSE)","v":{"v":0,"d":"0.00"}},"",""]
["2026-02-09","Montag","Bitte auswählen",{"$nulls":5},"","",{"$f":"IF(I18=\"\",\"\",IF(AND(I18<>\"\",J18=\"\",I18>=Personalstamm!$D$20),Personalstamm!$E$20,IF(AND(I18<>\"\",J18=\"\",I18>=Personalstamm!$D$19),Personalstamm!$E$19,IF(AND(I18<>\"\",J18<Personalstamm!$E$20,I18>=Personalstamm!$D$20),Personalstamm!$E$20-J18,IF(AND(I18<>\"\",J18<Personalstamm!E$19,I18>=Personalstamm!$D$19),Personalstamm!$E$19-J18,0)))))","v":""},"","",{"$f":"IF(OR(M18=\"\",M18=\"Bitte auswählen\"),\"\",IF(M18=\"Feiertag\",T18*U18,IF(M18=\"Gleittag\",0,VLOOKUP(B18,Personalstamm!$D$8:$F$14,3,FALSE))))","v":""},{"$f":"VLOOKUP(B18,Personalstamm!$D$8:$E$14,2,FALSE)","v":{"v":8,"d":"8.00"}},"",{"v":0,"d":"0.00"},null,{"$f":"IF(COUNTIF(Allgemein!$H$8:$H$45,A18)>0,\"Feiertag\",\"\")","v":""},{"$f":"IFERROR(VLOOKUP(A18,Allgemein!$H$8:$I$45,2,FALSE),\"\")","v":""},{"$f":"VLOOKUP(B18,Personalstamm!$D$8:$F$14,3,FALSE)","v":{"v":8,"d":"8.00"}},"",""]
["2026-02-10","Dienstag","Bitte auswählen",{"$nulls":5},"","",{"$f":"IF(I19=\"\",\"\",IF(AND(I19<>\"\",J19=\"\",I19>=Personalstamm!$D$20),Personalstamm!$E$20,IF(AND(I19<>\"\",J19=\"\",I19>=Personalstamm!$D$19),Personalstamm!$E$19,IF(AND(I19<>\"\",J19<Personalstamm!$E$20,I19>=Personalstamm!$D$20),Personalstamm!$E$20-J19,IF(AND(I19<>\"\",J19<Personalstamm!E$19,I19>=Personalstamm!$D$19),Personalstamm!$E$19-J19,0)))))","v":""},"","",{"$f":"IF(OR(M19=\"\",M19=\"Bitte auswählen\"),\"\",IF(M19=\"Feiertag\",T19*U19,IF(M19=\"Gleittag\",0,VLOOKUP(B19,Personalstamm!$D$8:$F$14,3,FALSE))))","v":""},{"$f":"VLOOKUP(B19,Personalstamm!$D$8:$E$14,2,FALSE)","v":{"v":8,"d":"8.00"}},"",{"v":0,"d":"0.00"},null,{"$f":"IF(COUNTIF(Allgemein!$H$8:$H$45,A19)>0,\"Feiertag\",\"\")","v":""},{"$f":"IFERROR(VLOOKUP(A19,Allgemein!$H$8:$I$45,2,FALSE),\"\")","v":""},{"$f":"VLOOKUP(B19,Personalstamm!$D$8:$F$14,3,FALSE)","v":{"v":8,"d":"8.00"}},"",""]
["2026-02-11","Mittwoch","Bitte auswählen",{"$nulls":5},"","",{"$f":"IF(I20=\"\",\"\",IF(AND(I20<>\"\",J20=\"\",I20>=Personalstamm!$D$20),Personalstamm!$E$20,IF(AND(I20<>\"\",J20=\"\",I20>=Personalstamm!$D$19),Personalstamm!$E$19,IF(AND(I20<>\"\",J20<Personalstamm!$E$20,I20>=Personalstamm!$D$20),Personalstamm!$E$20-J20,IF(AND(I20<>\"\",J20<Personalstamm!E$19,I20>=Personalstamm!$D$19),Personalstamm!$E$19-J20,0)))))","v":""},"","",{"$f":"IF(OR(M20=\"\",M20=\"Bitte auswählen\"),\"\",IF(M20=\"Feiertag\",T20*U20,IF(M20=\"Gleittag\",0,VLOOKUP(B20,Personalstamm!$D$8:$F$14,3,FALSE))))","v":""},{"$f":"VLOOKUP(B20,Personalstamm!$D$8:$E$14,2,FALSE)","v":{"v":8,"d":"8.00"}},"",{"v":0,"d":"0.00"},null,{"$f":"IF(COUNTIF(Allgemein!$H$8:$H$45,A20)>0,\"Feiertag\",\"\")","v":""},{"$f":"IFERROR(VLOOKUP(A20,Allgemein!$H$8:$I$45,2,FALSE),\"\")","v":""},{"$f":"VLOOKUP(B20,Personalstamm!$D$8:$F$14,3,FALSE)","v":{"v":8,"d":"8.00"}},"",""]
["2026-02-12","Donnerstag","Bitte auswählen",{"$nulls":5},"","",{"$f":"IF(I21=\"\",\"\",IF(AND(I21<>\"\",J21=\"\",I21>=Personalstamm!$D$20),Personalstamm!$E$20,IF(AND(I21<>\"\",J21=\"\",I21>=Personalstamm!$D$19),Personalstamm!$E$19,IF(AND(I21<>\"\",J21<Personalstamm!$E$20,I21>=Personalstamm!$D$20),Personalstamm!$E$20-J21,IF(AND(I21<>\"\",J21<Personalstamm!E$19,I21>=Personalstamm!$D$19),Personalstamm!$E$19-J21,0)))))","v":""},"","",{"$f":"IF(OR(M21=\"\",M21=\"Bitte auswählen\"),\"\",IF(M21=\"Feiertag\",T21*U21,IF(M21=\"Gleittag\",0,VLOOKUP(B21,Personalstamm!$D$8:$F$14,3,FALSE))))","v":""},{"$f":"VLOOKUP(B21,Personalstamm!$D$8:$E$14,2,FALSE)","v":{"v":8,"d":"8.00"}},"",{"v":0,"d":"0.00"},null,{"$f":"IF(COUNTIF(Allgemein!$H$8:$H$45,A21)>0,\"Feiertag\",\"\")","v":"Feiertag"},{"$f":"IFERROR(VLOOKUP(A21,Allgemein!$H$8:$I$45,2,FALSE),\"\")","v":{"v":0,"d":"0.00"}},{"$f":"VLOOKUP(B21,Personalstamm!$D$8:$F$14,3,FALSE)","v":{"v":8,"d":"8.00"}},"",""]
["2026-02-13","Freitag","Bitte auswählen",{"$nulls":5},"","",{"$f":"IF(I22=\"\",\"\",IF(AND(I22<>\"\",J22=\"\",I22>=Personalstamm!$D$20),Personalstamm!$E$20,IF(AND(I22<>\"\",J22=\"\",I22>=Personalstamm!$D$19),Personalstamm!$E$19,IF(AND(I22<>\"\",J22<Personalstamm!$E$20,I22>=Personalstamm!$D$20),Personalstamm!$E$20-J22,IF(AND(I22<>\"\",J22<Personalstamm!E$19,I22>=Personalstamm!$D$19),Personalstamm!$E$19-J22,0)))))","v":""},"","",{"$f":"IF(OR(M22=\"\",M22=\"Bitte auswählen\"),\"\",IF(M22=\"Feiertag\",T22*U22,IF(M22=\"Gleittag\",0,VLOOKUP(B22,Personalstamm!$D$8:$F$14,3,FALSE))))","v":""},{"$f":"VLOOKUP(B22,Personalstamm!$D$8:$E$14,2,FALSE)","v":{"v":8,"d":"8.00"}},"",{"v":0,"d":"0.00"},null,{"$f":"IF(COUNTIF(Allgemein!$H$8:$H$45,A22)>0,\"Feiertag\",\"\")","v":""},{"$f":"IFERROR(VLOOKUP(A22,Allgemein!$H$8:$I$45,2,FALSE),\"\")","v":""},{"$f":"VLOOKUP(B22,Personalstamm!$D$8:$F$14,3,FALSE)","v":{"v":8,"d":"8.00"}},"",""]
["2026-02-14","Samstag","Wochenende",{"$nulls":5},"","",{"$f":"IF(I23=\"\",\"\",IF(AND(I23<>\"\",J23=\"\",I23>=Personalstamm!$D$20),Personalstamm!$E$20,IF(AND(I23<>\"\",J23=\"\",I23>=Personalstamm!$D$19),Personalstamm!$E$19,IF(AND(I23<>\"\",J23<Personalstamm!$E$20,I23>=Personalstamm!$D$20),Personalstamm!$E$20-J23,IF(AND(I23<>\"\",J23<Personalstamm!E$19,I23>=Personalstamm!$D$19),Personalstamm!$E$19-J23,0)))))","v":""},"","",{"$f":"IF(OR(M23=\"\",M23=\"Bitte auswählen\"),\"\",IF(M23=\"Feiertag\",T23*U23,IF(M23=\"Gleittag\",0,VLOOKUP(B23,Personalstamm!$D$8:$F$14,3,FALSE))))","v":""},{"$f":"VLOOKUP(B23,Personalstamm!$D$8:$E$14,2,FALSE)","v":{"v":0,"d":"0.00"}},"",{"v":0,"d":"0.00"},null,{"$f":"IF(COUNTIF(Allgemein!$H$8:$H$45,A23)>0,\"Feiertag\",\"\")","v":"Feiertag"},{"$f":"IFERROR(VLOOKUP(A23,Allgemein!$H$8:$I$45,2,FALSE),\"\")","v":{"v":0,"d":"0.00"}},{"$f":"VLOOKUP(B23,Personalstamm!$D$8:$F$14,3,FALSE)","v":{"v":0,"d":"0.00"}},"",""]
["2026-02-15","Sonntag","Wochenende",{"$nulls":5},"","",{"$f":"IF(I24=\"\",\"\",IF(AND(I24<>\"\",J24=\"\",I24>=Personalstamm!$D$20),Personalstamm!$E$20,IF(AND(I24<>\"\",J24=\"\",I24>=Personalstamm!$D$19),Personalstamm!$E$19,IF(AND(I24<>\"\",J24<Personalstamm!$E$20,I24>=Personalstamm!$D$20),Personalstamm!$E$20-J24,IF(AND(I24<>\"\",J24<Personalstamm!E$19,I24>=Personalstamm!$D$19),Personalstamm!$E$19-J24,0)))))","v":""},"","",{"$f":"IF(OR(M24=\"\",M24=\"Bitte auswählen\"),\"\",IF(M24=\"Feiertag\",T24*U24,IF(M24=\"Gleittag\",0,VLOOKUP(B24,Personalstamm!$D$8:$F$14,3,FALSE))))","v":""},{"$f":"VLOOKUP(B24,Personalstamm!$D$8:$E$14,2,FALSE)","v":{"v":0,"d":"0.00"}},"",{"v":0,"d":"0.00"},null,{"$f":"IF(COUNTIF(Allgemein!$H$8:$H$45,A24)>0,\"Feiertag\",\"\")","v":"Feiertag"},{"$f":"IFERROR(VLOOKUP(A24,Allgemein!$H$8:$I$45,2,FALSE),\"\")","v":{"v":0,"d":"0.00"}},{"$f":"VLOOKUP(B24,Personalstamm!$D$8:$F$14,3,FALSE)","v":{"v":0,"d":"0.00"}},"",""]
["2026-02-16","Montag","Bitte auswählen",{"$nulls":5},"","",{"$f":"IF(I25=\"\",\"\",IF(AND(I25<>\"\",J25=\"\",I25>=Personalstamm!$D$20),Personalstamm!$E$20,IF(AND(I25<>\"\",J25=\"\",I25>=Personalstamm!$D$19),Personalstamm!$E$19,IF(AND(I25<>\"\",J25<Personalstamm!$E$20,I25>=Personalstamm!$D$20),Personalstamm!$E$20-J25,IF(AND(I25<>\"\",J25<Personalstamm!E$19,I25>=Personalstamm!$D$19),Personalstamm!$E$19-J25,0)))))","v":""},"","",{"$f":"IF(OR(M25=\"\",M25=\"Bitte auswählen\"),\"\",IF(M25=\"Feiertag\",T25*U25,IF(M25=\"Gleittag\",0,VLOOKUP(B25,Personalstamm!$D$8:$F$14,3,FALSE))))","v":""},{"$f":"VLOOKUP(B25,Personalstamm!$D$8:$E$14,2,FALSE)","v":{"v":8,"d":"8.00"}},"",{"v":0,"d":"0.00"},null,{"$f":"IF(COUNTIF(Allgemein!$H$8:$H$45,A25)>0,\"Feiertag\",\"\")","v":"Feiertag"},{"$f":"IFERROR(VLOOKUP(A25,Allgemein!$H$8:$I$45,2,FALSE),\"\")","v":{"v":0,"d":"0.00"}},{"$f":"VLOOKUP(B25,Personalstamm!$D$8:$F$14,3,FALSE)","v":{"v":8,"d":"8.00"}},"",""]
["2026-02-17","Dienstag","Bitte auswählen",{"$nulls":5},"","",{"$f":"IF(I26=\"\",\"\",IF(AND(I26<>\"\",J26=\"\",I26>=Personalstamm!$D$20),Personalstamm!$E$20,IF(AND(I26<>\"\",J26=\"\",I26>=Personalstamm!$D$19),Personalstamm!$E$19,IF(AND(I26<>\"\",J26<Personalstamm!$E$20,I26>=Personalstamm!$D$20),Personalstamm!$E$20-J26,IF(AND(I26<>\"\",J26<Personalstamm!E$19,I26>=Personalstamm!$D$19),Personalstamm!$E$19-J26,0)))))","v":""},"","",{"$f":"IF(OR(M26=\"\",M26=\"Bitte auswählen\"),\"\",IF(M26=\"Feiertag\",T26*U26,IF(M26=\"Gleittag\",0,VLOOKUP(B26,Personalstamm!$D$8:$F$14,3,FALSE))))","v":""},{"$f":"VLOOKUP(B26,Personalstamm!$D$8:$E$14,2,FALSE)","v":{"v":8,"d":"8.00"}},"",{"v":0,"d":"0.00"},null,{"$f":"IF(COUNTIF(Allgemein!$H$8:$H$45,A26)>0,\"Feiertag\",\"\")","v":"Feiertag"},{"$f":"IFERROR(VLOOKUP(A26,Allgemein!$H$8:$I$45,2,FALSE),\"\")","v":{"v":0,"d":"0.00"}},{"$f":"VLOOKUP(B26,Personalstamm!$D$8:$F$14,3,FALSE)","v":{"v":8,"d":"8.00"}},"",""]
["2026-02-18","Mittwoch","Bitte auswählen",{"$nulls":5},"","",{"$f":"IF(I27=\"\",\"\",IF(AND(I27<>\"\",J27=\"\",I27>=Personalstamm!$D$20),Personalstamm!$E$20,IF(AND(I27<>\"\",J27=\"\",I27>=Personalstamm!$D$19),Personalstamm!$E$19,IF(AND(I27<>\"\",J27<Personalstamm!$E$20,I27>=Personalstamm!$D$20),Personalstamm!$E$20-J27,IF(AND(I27<>\"\",J27<Personalstamm!E$19,I27>=Personalstamm!$D$19),Personalstamm!$E$19-J27,0)))))","v":""},"","",{"$f":"IF(OR(M27=\"\",M27=\"Bitte auswählen\"),\"\",IF(M27=\"Feiertag\",T27*U27,IF(M27=\"Gleittag\",0,VLOOKUP(B27,Personalstamm!$D$8:$F$14,3,FALSE))))","v":""},{"$f":"VLOOKUP(B27,Personalstamm!$D$8:$E$14,2,FALSE)","v":{"v":8,"d":"8.00"}},"",{"v":0,"d":"0.00"},null,{"$f":"IF(COUNTIF(Allgemein!$H$8:$H$45,A27)>0,\"Feiertag\",\"\")","v":"Feiertag"},{"$f":"IFERROR(VLOOKUP(A27,Allgemein!$H$8:$I$45,2,FALSE),\"\")","v":{"v":0,"d":"0.00"}},{"$f":"VLOOKUP(B27,Personalstamm!$D$8:$F$14,3,FALSE)","v":{"v":8,"d":"8.00"}},"",""]
["2026-02-19","Donnerstag","Bitte auswählen",{"$nulls":5},"","",{"$f":"IF(I28=\"\",\"\",IF(AND(I28<>\"\",J28=\"\",I28>=Personalstamm!$D$20),Personalstamm!$E$20,IF(AND(I28<>\"\",J28=\"\",I28>=Personalstamm!$D$19),Personalstamm!$E$19,IF(AND(I28<>\"\",J28<Personalstamm!$E$20,I28>=Personalstamm!$D$20),Personalstamm!$E$20-J28,IF(AND(I28<>\"\",J28<Personalstamm!E$19,I28>=Personalstamm!$D$19),Personalstamm!$E$19-J28,0)))))","v":""},"","",{"$f":"IF(OR(M28=\"\",M28=\"Bitte auswählen\"),\"\",IF(M28=\"Feiertag\",T28*U28,IF(M28=\"Gleittag\",0,VLOOKUP(B28,Personalstamm!$D$8:$F$14,3,FALSE))))","v":""},{"$f":"VLOOKUP(B28,Personalstamm!$D$8:$E$14,2,FALSE)","v":{"v":8,"d":"8.00"}},"",{"v":0,"d":"0.00"},null,{"$f":"IF(COUNTIF(Allgemein!$H$8:$H$45,A28)>0,\"Feiertag\",\"\")","v":""},{"$f":"IFERROR(VLOOKUP(A28,Allgemein!$H$8:$I$45,2,FALSE),\"\")","v":""},{"$f":"VLOOKUP(B28,Personalstamm!$D$8:$F$14,3,FALSE)","v":{"v":8,"d":"8.00"}},"",""]
["2026-02-20","Freitag","Bitte auswählen",{"$nulls":5},"","",{"$f":"IF(I29=\"\",\"\",IF(AND(I29<>\"\",J29=\"\",I29>=Personalstamm!$D$20),Personalstamm!$E$20,IF(AND(I29<>\"\",J29=\"\",I29>=Personalstamm!$D$19),Personalstamm!$E$19,IF(AND(I29<>\"\",J29<Personalstamm!$E$20,I29>=Personalstamm!$D$20),Personalstamm!$E$20-J29,IF(AND(I29<>\"\",J29<Personalstamm!E$19,I29>=Personalstamm!$D$19),Personalstamm!$E$19-J29,0)))))","v":""},"","",{"$f":"IF(OR(M29=\"\",M29=\"Bitte auswählen\"),\"\",IF(M29=\"Feiertag\",T29*U29,IF(M29=\"Gleittag\",0,VLOOKUP(B29,Personalstamm!$D$8:$F$14,3,FALSE))))","v":""},{"$f":"VLOOKUP(B29,Personalstamm!$D$8:$E$14,2,FALSE)","v":{"v":8,"d":"8.00"}},"",{"v":0,"d":"0.00"},null,{"$f":"IF(COUNTIF(Allgemein!$H$8:$H$45,A29)>0,\"Feiertag\",\"\")","v":""},{"$f":"IFERROR(VLOOKUP(A29,Allgemein!$H$8:$I$45,2,FALSE),\"\")","v":""},{"$f":"VLOOKUP(B29,Personalstamm!$D$8:$F$14,3,FALSE)","v":{"v":8,"d":"8.00"}},"",""]
["2026-02-21","Samstag","Wochenende",{"$nulls":5},"","",{"$f":"IF(I30=\"\",\"\",IF(AND(I30<>\"\",J30=\"\",I30>=Personalstamm!$D$20),Personalstamm!$E$20,IF(AND(I30<>\"\",J30=\"\",I30>=Personalstamm!$D$19),Personalstamm!$E$19,IF(AND(I30<>\"\",J30<Personalstamm!$E$20,I30>=Personalstamm!$D$20),Personalstamm!$E$20-J30,IF(AND(I30<>\"\",J30<Personalstamm!E$19,I30>=Personalstamm!$D$19),Personalstamm!$E$19-J30,0)))))","v":""},"","",{"$f":"IF(OR(M30=\"\",M30=\"Bitte auswählen\"),\"\",IF(M30=\"Feiertag\",T30*U30,IF(M30=\"Gleittag\",0,VLOOKUP(B30,Personalstamm!$D$8:$F$14,3,FALSE))))","v":""},{"$f":"VLOOKUP(B30,Personalstamm!$D$8:$E$14,2,FALSE)","v":{"v":0,"d":"0.00"}},"",{"v":0,"d":"0.00"},null,{"$f":"IF(COUNTIF(Allgemein!$H$8:$H$45,A30)>0,\"Feiertag\",\"\")","v":""},{"$f":"IFERROR(VLOOKUP(A30,Allgemein!$H$8:$I$45,2,FALSE),\"\")","v":""},{"$f":"VLOOKUP(B30,Personalstamm!$D$8:$F$14,3,FALSE)","v":{"v":0,"d":"0.00"}},"",""]
["2026-02-22","Sonntag","Wochenende",{"$nulls":5},"","",{"$f":"IF(I31=\"\",\"\",IF(AND(I31<>\"\",J31=\"\",I31>=Personalstamm!$D$20),Personalstamm!$E$20,IF(AND(I31<>\"\",J31=\"\",I31>=Personalstamm!$D$19),Personalstamm!$E$19,IF(AND(I31<>\"\",J31<Personalstamm!$E$20,I31>=Personalstamm!$D$20),Personalstamm!$E$20-J31,IF(AND(I31<>\"\",J31<Personalstamm!E$19,I31>=Personalstamm!$D$19),Personalstamm!$E$19-J31,0)))))","v":""},"","",{"$f":"IF(OR(M31=\"\",M31=\"Bitte auswählen\"),\"\",IF(M31=\"Feiertag\",T31*U31,IF(M31=\"Gleittag\",0,VLOOKUP(B31,Personalstamm!$D$8:$F$14,3,FALSE))))","v":""},{"$f":"VLOOKUP(B31,Personalstamm!$D$8:$E$14,2,FALSE)","v":{"v":0,"d":"0.00"}},"",{"v":0,"d":"0.00"},null,{"$f":"IF(COUNTIF(Allgemein!$H$8:$H$45,A31)>0,\"Feiertag\",\"\")","v":""},{"$f":"IFERROR(VLOOKUP(A31,Allgemein!$H$8:$I$45,2,FALSE),\"\")","v":""},{"$f":"VLOOKUP(B31,Personalstamm!$D$8:$F$14,3,FALSE)","v":{"v":0,"d":"0.00"}},"",""]
["2026-02-23","Montag","Bitte auswählen",{"$nulls":5},"","",{"$f":"IF(I32=\"\",\"\",IF(AND(I32<>\"\",J32=\"\",I32>=Personalstamm!$D$20),Personalstamm!$E$20,IF(AND(I32<>\"\",J32=\"\",I32>=Personalstamm!$D$19),Personalstamm!$E$19,IF(AND(I32<>\"\",J32<Personalstamm!$E$20,I32>=Personalstamm!$D$20),Personalstamm!$E$20-J32,IF(AND(I32<>\"\",J32<Personalstamm!E$19,I32>=Personalstamm!$D$19),Personalstamm!$E$19-J32,0)))))","v":""},"","",{"$f":"IF(OR(M32=\"\",M32=\"Bitte auswählen\"),\"\",IF(M32=\"Feiertag\",T32*U32,IF(M32=\"Gleittag\",0,VLOOKUP(B32,Personalstamm!$D$8:$F$14,3,FALSE))))","v":""},{"$f":"VLOOKUP(B32,Personalstamm!$D$8:$E$14,2,FALSE)","v":{"v":8,"d":"8.00"}},"",{"v":0,"d":"0.00"},null,{"$f":"IF(COUNTIF(Allgemein!$H$8:$H$45,A32)>0,\"Feiertag\",\"\")","v":""},{"$f":"IFERROR(VLOOKUP(A32,Allgemein!$H$8:$I$45,2,FALSE),\"\")","v":""},{"$f":"VLOOKUP(B32,Personalstamm!$D$8:$F$14,3,FALSE)","v":{"v":8,"d":"8.00"}},"",""]
["2026-02-24","Dienstag","Bitte auswählen",{"$nulls":5},"","",{"$f":"IF(I33=\"\",\"\",IF(AND(I33<>\"\",J33=\"\",I33>=Personalstamm!$D$20),Personalstamm!$E$20,IF(AND(I33<>\"\",J33=\"\",I33>=Personalstamm!$D$19),Personalstamm!$E$19,IF(AND(I33<>\"\",J33<Personalstamm!$E$20,I33>=Personalstamm!$D$20),Personalstamm!$E$20-J33,IF(AND(I33<>\"\",J33<Personalstamm!E$19,I33>=Personalstamm!$D$19),Personalstamm!$E$19-J33,0)))))","v":""},"","",{"$f":"IF(OR(M33=\"\",M33=\"Bitte auswählen\"),\"\",IF(M33=\"Feiertag\",T33*U33,IF(M33=\"Gleittag\",0,VLOOKUP(B33,Personalstamm!$D$8:$F$14,3,FALSE))))","v":""},{"$f":"VLOOKUP(B33,Personalstamm!$D$8:$E$14,2,FALSE)","v":{"v":8,"d":"8.00"}},"",{"v":0,"d":"0.00"},null,{"$f":"IF(COUNTIF(Allgemein!$H$8:$H$45,A33)>0,\"Feiertag\",\"\")","v":""},{"$f":"IFERROR(VLOOKUP(A33,Allgemein!$H$8:$I$45,2,FALSE),\"\")","v":""},{"$f":"VLOOKUP(B33,Personalstamm!$D$8:$F$14,3,FALSE)","v":{"v":8,"d":"8.00"}},"",""]
["2026-02-25","Mittwoch","Bitte auswählen",{"$nulls":5},"","",{"$f":"IF(I34=\"\",\"\",IF(AND(I34<>\"\",J34=\"\",I34>=Personalstamm!$D$20),Personalstamm!$E$20,IF(AND(I34<>\"\",J34=\"\",I34>=Personalstamm!$D$19),Personalstamm!$E$19,IF(AND(I34<>\"\",J34<Personalstamm!$E$20,I34>=Personalstamm!$D$20),Personalstamm!$E$20-J34,IF(AND(I34<>\"\",J34<Personalstamm!E$19,I34>=Personalstamm!$D$19),Personalstamm!$E$19-J34,0)))))","v":""},"","",{"$f":"IF(OR(M34=\"\",M34=\"Bitte auswählen\"),\"\",IF(M34=\"Feiertag\",T34*U34,IF(M34=\"Gleittag\",0,VLOOKUP(B34,Personalstamm!$D$8:$F$14,3,FALSE))))","v":""},{"$f":"VLOOKUP(B34,Personalstamm!$D$8:$E$14,2,FALSE)","v":{"v":8,"d":"8.00"}},"",{"v":0,"d":"0.00"},null,{"$f":"IF(COUNTIF(Allgemein!$H$8:$H$45,A34)>0,\"Feiertag\",\"\")","v":""},{"$f":"IFERROR(VLOOKUP(A34,Allgemein!$H$8:$I$45,2,FALSE),\"\")","v":""},{"$f":"VLOOKUP(B34,Personalstamm!$D$8:$F$14,3,FALSE)","v":{"v":8,"d":"8.00"}},"",""]
["2026-02-26","Donnerstag","Bitte auswählen",{"$nulls":5},"","",{"$f":"IF(I35=\"\",\"\",IF(AND(I35<>\"\",J35=\"\",I35>=Personalstamm!$D$20),Personalstamm!$E$20,IF(AND(I35<>\"\",J35=\"\",I35>=Personalstamm!$D$19),Personalstamm!$E$19,IF(AND(I35<>\"\",J35<Personalstamm!$E$20,I35>=Personalstamm!$D$20),Personalstamm!$E$20-J35,IF(AND(I35<>\"\",J35<Personalstamm!E$19,I35>=Personalstamm!$D$19),Personalstamm!$E$19-J35,0)))))","v":""},"","",{"$f":"IF(OR(M35=\"\",M35=\"Bitte auswählen\"),\"\",IF(M35=\"Feiertag\",T35*U35,IF(M35=\"Gleittag\",0,VLOOKUP(B35,Personalstamm!$D$8:$F$14,3,FALSE))))","v":""},{"$f":"VLOOKUP(B35,Personalstamm!$D$8:$E$14,2,FALSE)","v":{"v":8,"d":"8.00"}},"",{"v":0,"d":"0.00"},null,{"$f":"IF(COUNTIF(Allgemein!$H$8:$H$45,A35)>0,\"Feiertag\",\"\")","v":""},{"$f":"IFERROR(VLOOKUP(A35,Allgemein!$H$8:$I$45,2,FALSE),\"\")","v":""},{"$f":"VLOOKUP(B35,Personalstamm!$D$8:$F$14,3,FALSE)","v":{"v":8,"d":"8.00"}},"",""]
["2026-02-27","Freitag","Bitte auswählen",{"$nulls":5},"","",{"$f":"IF(I36=\"\",\"\",IF(AND(I36<>\"\",J36=\"\",I36>=Personalstamm!$D$20),Personalstamm!$E$20,IF(AND(I36<>\"\",J36=\"\",I36>=Personalstamm!$D$19),Personalstamm!$E$19,IF(AND(I36<>\"\",J36<Personalstamm!$E$20,I36>=Personalstamm!$D$20),Personalstamm!$E$20-J36,IF(AND(I36<>\"\",J36<Personalstamm!E$19,I36>=Personalstamm!$D$19),Personalstamm!$E$19-J36,0)))))","v":""},"","",{"$f":"IF(OR(M36=\"\",M36=\"Bitte auswählen\"),\"\",IF(M36=\"Feiertag\",T36*U36,IF(M36=\"Gleittag\",0,VLOOKUP(B36,Personalstamm!$D$8:$F$14,3,FALSE))))","v":""},{"$f":"VLOOKUP(B36,Personalstamm!$D$8:$E$14,2,FALSE)","v":{"v":8,"d":"8.00"}},"",{"v":0,"d":"0.00"},null,{"$f":"IF(COUNTIF(Allgemein!$H$8:$H$45,A36)>0,\"Feiertag\",\"\")","v":""},{"$f":"IFERROR(VLOOKUP(A36,Allgemein!$H$8:$I$45,2,FALSE),\"\")","v":""},{"$f":"VLOOKUP(B36,Personalstamm!$D$8:$F$14,3,FALSE)","v":{"v":8,"d":"8.00"}},"",""]
["2026-02-28","Samstag","Wochenende",{"$nulls":5},"","",{"$f":"IF(I37=\"\",\"\",IF(AND(I37<>\"\",J37=\"\",I37>=Personalstamm!$D$20),Personalstamm!$E$20,IF(AND(I37<>\"\",J37=\"\",I37>=Personalstamm!$D$19),Personalstamm!$E$19,IF(AND(I37<>\"\",J37<Personalstamm!$E$20,I37>=Personalstamm!$D$20),Personalstamm!$E$20-J37,IF(AND(I37<>\"\",J37<Personalstamm!E$19,I37>=Personalstamm!$D$19),Personalstamm!$E$19-J37,0)))))","v":""},"","",{"$f":"IF(OR(M37=\"\",M37=\"Bitte auswählen\"),\"\",IF(M37=\"Feiertag\",T37*U37,IF(M37=\"Gleittag\",0,VLOOKUP(B37,Personalstamm!$D$8:$F$14,3,FALSE))))","v":""},{"$f":"VLOOKUP(B37,Personalstamm!$D$8:$E$14,2,FALSE)","v":{"v":0,"d":"0.00"}},"",{"v":0,"d":"0.00"},null,{"$f":"IF(COUNTIF(Allgemein!$H$8:$H$45,A37)>0,\"Feiertag\",\"\")","v":""},{"$f":"IFERROR(VLOOKUP(A37,Allgemein!$H$8:$I$45,2,FALSE),\"\")","v":""},{"$f":"VLOOKUP(B37,Personalstamm!$D$8:$F$14,3,FALSE)","v":{"v":0,"d":"0.00"}},"",""]
["Summe",{"$nulls":7},{"$f":"SUM(I10:I37)","v":{"v":0,"d":"0.00"}},{"$f":"SUM(J10:J37)","v":{"v":0,"d":"0.00"}},{"$f":"SUM(K10:K37)","v":{"v":0,"d":"0.00"}},{"$f":"SUM(L10:L37)","v":{"v":0,"d":"0.00"}},null,{"$f":"SUM(N10:N37)","v":{"v":0,"d":"0.00"}},{"$f":"SUM(O10:O37)","v":{"v":160,"d":"160.00"}},{"$f":"SUM(P10:P37)","v":{"v":0,"d":"0.00"}}]
[]
["Art","Anzahl Tage",null,"Fehlzeitenart","Anzahl Tage","Anzahl Stunden",null,"Urlaub genommen","Urlaub geplant"]
["Monat",{"$f":"COUNTIF($C$10:$C$37,\"*\")","v":{"v":28,"d":"28.00"}},null,"Urlaub",{"$f":"COUNTIF($M$10:$M$37,Allgemein!$I$50)","v":{"v":0,"d":"0.00"}},{"$f":"SUMIF($M$10:$M$37,Allgemein!$I$50,$N$10:$N$37)","v":{"v":0,"d":"0.00"}},null,{"$f":"COUNTIFS($A$10:$A$37,\"<\"&TODAY(),$M$10:$M$37,\"Urlaub\")","v":{"v":0,"d":"0.00"}},{"$f":"COUNTIFS($A$10:$A$37,\">=\"&TODAY(),$M$10:$M$37,\"Urlaub\")","v":{"v":0,"d":"0.00"}}]
["Anwesenheit",{"$f":"COUNTIF($C$10:$C$37,Allgemein!$G$50)","v":{"v":0,"d":"0.00"}},null,"Krankheit",{"$f":"COUNTIF($M$10:$M$37,Allgemein!$I$51)","v":{"v":0,"d":"0.00"}},{"$f":"SUMIF($M$10:$M$37,Allgemein!$I$51,$N$10:$N$37)","v":{"v":0,"d":"0.00"}}]
["Fehlzeit",{"$f":"COUNTIF($C$10:$C$37,Allgemein!$G$51)","v":{"v":0,"d":"0.00"}},null,"Kurzarbeit",{"$f":"COUNTIF($M$10:$M$37,Allgemein!$I$52)","v":{"v":0,"d":"0.00"}},{"$f":"SUMIF($M$10:$M$37,Allgemein!$I$52,$N$10:$N$37)","v":{"v":0,"d":"0.00"}}]
["Wochenende",{"$f":"COUNTIF($C$10:$C$37,Allgemein!$G$52)","v":{"v":8,"d":"8.00"}},null,"Mutterschutz",{"$f":"COUNTIF($M$10:$M$37,Allgemein!$I$53)","v":{"v":0,"d":"0.00"}},{"$f":"SUMIF($M$10:$M$37,Allgemein!$I$53,$N$10:$N$37)","v":{"v":0,"d":"0.00"}}]
["Undefiniert",{"$f":"COUNTIF($C$10:$C$37,Allgemein!$G$49)","v":{"v":20,"d":"20.00"}},null,"Fortbildung",{"$f":"COUNTIF($M$10:$M$37,Allgemein!$I$54)","v":{"v":0,"d":"0.00"}},{"$f":"SUMIF($M$10:$M$37,Allgemein!$I$54,$N$10:$N$37)","v":{"v":0,"d":"0.00"}}]
[{"$nulls":3},"Elternzeit",{"$f":"COUNTIF($M$10:$M$37,Allgemein!$I$55)","v":{"v":0,"d":"0.00"}},{"$f":"SUMIF($M$10:$M$37,Allgemein!$I$55,$N$10:$N$37)","v":{"v":0,"d":"0.00"}}]
[{"$nulls":3},"Gleittag",{"$f":"COUNTIF($M$10:$M$37,Allgemein!$I$56)","v":{"v":0,"d":"0.00"}},{"$f":"SUMIF($M$10:$M$37,Allgemein!$I$56,$V$10:$V$37)","v":{"v":0,"d":"0.00"}}]
[{"$nulls":3},"Schule",{"$f":"COUNTIF($M$10:$M$37,Allgemein!$I$57)","v":{"v":0,"d":"0.00"}},{"$f":"SUMIF($M$10:$M$37,Allgemein!$I$57,$N$10:$N$37)","v":{"v":0,"d":"0.00"}}]
[{"$nulls":3},"Feiertag",{"$f":"COUNTIF($M$10:$M$37,Allgemein!$I$58)","v":{"v":0,"d":"0.00"}},{"$f":"SUMIF($M$10:$M$37,Allgemein!$I$58,$N$10:$N$37)","v":{"v":0,"d":"0.00"}}]
[{"$nulls":3},"Undefiniert",{"$f":"COUNTIF($M$10:$M$37,Allgemein!$I$49)","v":{"v":0,"d":"0.00"}},{"$f":"SUMIF($M$10:$M$37,Allgemein!$I$49,$N$10:$N$37)","v":{"v":0,"d":"0.00"}}]

{"sheet":"Mrz.","index":7,"n_rows":53,"n_cols":23,"rows_kept":53}
[]
[]
[]
[]
[]
["Urlaubsvortrag",{"$f":"Feb.!$F$6","v":{"v":30,"d":"30.00"}},"Urlaub genommen",{"$f":"$H$44","v":{"v":0,"d":"0.00"}},"Resturlaub",{"$f":"$B$6-$D$6","v":{"v":30,"d":"30.00"}}]
["Saldovortrag",{"$f":"Feb.!F7","v":{"v":0,"d":"0.00"}},"Saldoänderung",{"$f":"$P$41","v":{"v":0,"d":"0.00"}},"Kumulierter Saldo",{"$f":"$B$7+$D$7","v":{"v":0,"d":"0.00"}}]
[]
["Datum","Wochentag","Art","Arbeitsort","Von Uhrzeit","Bis Uhrzeit","Von Uhrzeit","Bis Uhrzeit","Bruttoarbeitszeit","Geb. Pause","Mindestpause","Nettoarbeitszeit","Fehlzeitenart","Fehlstunden","Sollstunden","Tagessaldo","Kumulierter Saldo",null,"Feiertag","Feiertag Anteil Tag","FZ-Gutschrift","Gleittag","Ausgewertet"]
["2026-03-01",{"$f":"TEXT(A10,\"tttt\")","v":"Sonntag"},{"$f":"IF(AND(S10=\"Feiertag\",T10>0),\"Fehlzeit\",IF(OR(B10=\"Samstag\",B10=\"Sonntag\"),\"Wochenende\",\"Bitte auswählen\"))","v":"Wochenende"},{"$nulls":5},{"$f":"IF(AND(OR(C10=\"Anwesenheit\",C10=\"Wochenende\"),E10<>\"\",F10<>\"\",W10=\"Ja\"),((F10-E10)+(H10-G10))*24,\"\")","v":""},{"$f":"IF(I10=\"\",\"\",IF(AND(G10<>\"\",H10<>\"\"),(G10-F10)*24,0))","v":""},{"$f":"IF(I10=\"\",\"\",IF(AND(I10<>\"\",J10=\"\",I10>=Personalstamm!$D$20),Personalstamm!$E$20,IF(AND(I10<>\"\",J10=\"\",I10>=Personalstamm!$D$19),Personalstamm!$E$19,IF(AND(I10<>\"\",J10<Personalstamm!$E$20,I10>=Personalstamm!$D$20),Personalstamm!$E$20-J10,IF(AND(I10<>\"\",J10<Personalstamm!E$19,I10>=Personalstamm!$D$19),Personalstamm!$E$19-J10,0)))))","v":""},{"$f":"IF(I10<>\"\",I10-K10,\"\")","v":""},{"$f":"IF(AND(S10=\"Feiertag\",T10>0),\"Feiertag\",IF(C10=\"Fehlzeit\",\"Bitte auswählen\",\"\"))","v":""},{"$f":"IF(OR(M10=\"\",M10=\"Bitte auswählen\"),\"\",IF(M10=\"Feiertag\",T10*U10,IF(M10=\"Gleittag\",0,VLOOKUP(B10,Personalstamm!$D$8:$F$14,3,FALSE))))","v":""},{"$f":"VLOOKUP(B10,Personalstamm!$D$8:$E$14,2,FALSE)","v":{"v":0,"d":"0.00"}},{"$f":"IF(AND(OR(C10=\"Anwesenheit\",C10=\"Wochenende\"),L10<>\"\"),L10-O10,IF(AND(C10=\"Fehlzeit\",N10<>\"\",W10=\"Ja\"),N10-O10,IF(W10=\"Ja\",-O10,\"\")))","v":""},{"$f":"IF(P10=\"\",B7,B7+P10)","v":{"v":0,"d":"0.00"}},null,{"$f":"IF(COUNTIF(Allgemein!$H$8:$H$45,A10)>0,\"Feiertag\",\"\")","v":""},{"$f":"IFERROR(VLOOKUP(A10,Allgemein!$H$8:$I$45,2,FALSE),\"\")","v":""},{"$f":"VLOOKUP(B10,Personalstamm!$D$8:$F$14,3,FALSE)","v":{"v":0,"d":"0.00"}},{"$f":"IF(M10=\"Gleittag\",ABS(P10),\"\")","v":""},{"$f":"IF(A10<=TODAY(),\"Ja\",\"\")","v":""}]
["2026-03-02",{"$f":"TEXT(A11,\"tttt\")","v":"Montag"},{"$f":"IF(AND(S11=\"Feiertag\",T11>0),\"Fehlzeit\",IF(OR(B11=\"Samstag\",B11=\"Sonntag\"),\"Wochenende\",\"Bitte auswählen\"))","v":"Bitte auswählen"},{"$nulls":5},{"$f":"IF(AND(OR(C11=\"Anwesenheit\",C11=\"Wochenende\"),E11<>\"\",F11<>\"\",W11=\"Ja\"),((F11-E11)+(H11-G11))*24,\"\")","v":""},{"$f":"IF(I11=\"\",\"\",IF(AND(G11<>\"\",H11<>\"\"),(G11-F11)*24,0))","v":""},{"$f":"IF(I11=\"\",\"\",IF(AND(I11<>\"\",J11=\"\",I11>=Personalstamm!$D$20),Personalstamm!$E$20,IF(AND(I11<>\"\",J11=\"\",I11>=Personalstamm!$D$19),Personalstamm!$E$19,IF(AND(I11<>\"\",J11<Personalstamm!$E$20,I11>=Personalstamm!$D$20),Personalstamm!$E$20-J11,IF(AND(I11<>\"\",J11<Personalstamm!E$19,I11>=Personalstamm!$D$19),Personalstamm!$E$19-J11,0)))))","v":""},{"$f":"IF(I11<>\"\",I11-K11,\"\")","v":""},{"$f":"IF(AND(S11=\"Feiertag\",T11>0),\"Feiertag\",IF(C11=\"Fehlzeit\",\"Bitte auswählen\",\"\"))","v":""},{"$f":"IF(OR(M11=\"\",M11=\"Bitte auswählen\"),\"\",IF(M11=\"Feiertag\",T11*U11,IF(M11=\"Gleittag\",0,VLOOKUP(B11,Personalstamm!$D$8:$F$14,3,FALSE))))","v":""},{"$f":"VLOOKUP(B11,Personalstamm!$D$8:$E$14,2,FALSE)","v":{"v":8,"d":"8.00"}},{"$f":"IF(AND(OR(C11=\"Anwesenheit\",C11=\"Wochenende\"),L11<>\"\"),L11-O11,IF(AND(C11=\"Fehlzeit\",N11<>\"\",W11=\"Ja\"),N11-O11,IF(W11=\"Ja\",-O11,\"\")))","v":""},{"$f":"IF(P11=\"\",Q10,Q10+P11)","v":{"v":0,"d":"0.00"}},null,{"$f":"IF(COUNTIF(Allgemein!$H$8:$H$45,A11)>0,\"Feiertag\",\"\")","v":""},{"$f":"IFERROR(VLOOKUP(A11,Allgemein!$H$8:$I$45,2,FALSE),\"\")","v":""},{"$f":"VLOOKUP(B11,Personalstamm!$D$8:$F$14,3,FALSE)","v":{"v":8,"d":"8.00"}},{"$f":"IF(M11=\"Gleittag\",ABS(P11),\"\")","v":""},{"$f":"IF(A11<=TODAY(),\"Ja\",\"\")","v":""}]
["2026-03-03","Dienstag","Bitte auswählen",{"$nulls":5},"","",{"$f":"IF(I12=\"\",\"\",IF(AND(I12<>\"\",J12=\"\",I12>=Personalstamm!$D$20),Personalstamm!$E$20,IF(AND(I12<>\"\",J12=\"\",I12>=Personalstamm!$D$19),Personalstamm!$E$19,IF(AND(I12<>\"\",J12<Personalstamm!$E$20,I12>=Personalstamm!$D$20),Personalstamm!$E$20-J12,IF(AND(I12<>\"\",J12<Personalstamm!E$19,I12>=Personalstamm!$D$19),Personalstamm!$E$19-J12,0)))))","v":""},"","",{"$f":"IF(OR(M12=\"\",M12=\"Bitte auswählen\"),\"\",IF(M12=\"Feiertag\",T12*U12,IF(M12=\"Gleittag\",0,VLOOKUP(B12,Personalstamm!$D$8:$F$14,3,FALSE))))","v":""},{"$f":"VLOOKUP(B12,Personalstamm!$D$8:$E$14,2,FALSE)","v":{"v":8,"d":"8.00"}},"",{"$f":"IF(P12=\"\",Q11,Q11+P12)","v":{"v":0,"d":"0.00"}},null,{"$f":"IF(COUNTIF(Allgemein!$H$8:$H$45,A12)>0,\"Feiertag\",\"\")","v":""},{"$f":"IFERROR(VLOOKUP(A12,Allgemein!$H$8:$I$45,2,FALSE),\"\")","v":""},{"$f":"VLOOKUP(B12,Personalstamm!$D$8:$F$14,3,FALSE)","v":{"v":8,"d":"8.00"}},"",""]
["2026-03-04","Mittwoch","Bitte auswählen",{"$nulls":5},"","",{"$f":"IF(I13=\"\",\"\",IF(AND(I13<>\"\",J13=\"\",I13>=Personalstamm!$D$20),Personalstamm!$E$20,IF(AND(I13<>\"\",J13=\"\",I13>=Personalstamm!$D$19),Personalstamm!$E$19,IF(AND(I13<>\"\",J13<Personalstamm!$E$20,I13>=Personalstamm!$D$20),Personalstamm!$E$20-J13,IF(AND(I13<>\"\",J13<Personalstamm!E$19,I13>=Personalstamm!$D$19),Personalstamm!$E$19-J13,0)))))","v":""},"","",{"$f":"IF(OR(M13=\"\",M13=\"Bitte auswählen\"),\"\",IF(M13=\"Feiertag\",T13*U13,IF(M13=\"Gleittag\",0,VLOOKUP(B13,Personalstamm!$D$8:$F$14,3,FALSE))))","v":""},{"$f":"VLOOKUP(B13,Personalstamm!$D$8:$E$14,2,FALSE)","v":{"v":8,"d":"8.00"}},"",{"v":0,"d":"0.00"},null,{"$f":"IF(COUNTIF(Allgemein!$H$8:$H$45,A13)>0,\"Feiertag\",\"\")","v":""},{"$f":"IFERROR(VLOOKUP(A13,Allgemein!$H$8:$I$45,2,FALSE),\"\")","v":""},{"$f":"VLOOKUP(B13,Personalstamm!$D$8:$F$14,3,FALSE)","v":{"v":8,"d":"8.00"}},"",""]
["2026-03-05","Donnerstag","Bitte auswählen",{"$nulls":5},"","",{"$f":"IF(I14=\"\",\"\",IF(AND(I14<>\"\",J14=\"\",I14>=Personalstamm!$D$20),Personalstamm!$E$20,IF(AND(I14<>\"\",J14=\"\",I14>=Personalstamm!$D$19),Personalstamm!$E$19,IF(AND(I14<>\"\",J14<Personalstamm!$E$20,I14>=Personalstamm!$D$20),Personalstamm!$E$20-J14,IF(AND(I14<>\"\",J14<Personalstamm!E$19,I14>=Personalstamm!$D$19),Personalstamm!$E$19-J14,0)))))","v":""},"","",{"$f":"IF(OR(M14=\"\",M14=\"Bitte auswählen\"),\"\",IF(M14=\"Feiertag\",T14*U14,IF(M14=\"Gleittag\",0,VLOOKUP(B14,Personalstamm!$D$8:$F$14,3,FALSE))))","v":""},{"$f":"VLOOKUP(B14,Personalstamm!$D$8:$E$14,2,FALSE)","v":{"v":8,"d":"8.00"}},"",{"v":0,"d":"0.00"},null,{"$f":"IF(COUNTIF(Allgemein!$H$8:$H$45,A14)>0,\"Feiertag\",\"\")","v":""},{"$f":"IFERROR(VLOOKUP(A14,Allgemein!$H$8:$I$45,2,FALSE),\"\")","v":""},{"$f":"VLOOKUP(B14,Personalstamm!$D$8:$F$14,3,FALSE)","v":{"v":8,"d":"8.00"}},"",""]
["2026-03-06","Freitag","Bitte auswählen",{"$nulls":5},"","",{"$f":"IF(I15=\"\",\"\",IF(AND(I15<>\"\",J15=\"\",I15>=Personalstamm!$D$20),Personalstamm!$E$20,IF(AND(I15<>\"\",J15=\"\",I15>=Personalstamm!$D$19),Personalstamm!$E$19,IF(AND(I15<>\"\",J15<Personalstamm!$E$20,I15>=Personalstamm!$D$20),Personalstamm!$E$20-J15,IF(AND(I15<>\"\",J15<Personalstamm!E$19,I15>=Personalstamm!$D$19),Personalstamm!$E$19-J15,0)))))","v":""},"","",{"$f":"IF(OR(M15=\"\",M15=\"Bitte auswählen\"),\"\",IF(M15=\"Feiertag\",T15*U15,IF(M15=\"Gleittag\",0,VLOOKUP(B15,Personalstamm!$D$8:$F$14,3,FALSE))))","v":""},{"$f":"VLOOKUP(B15,Personalstamm!$D$8:$E$14,2,FALSE)","v":{"v":8,"d":"8.00"}},"",{"v":0,"d":"0.00"},null,{"$f":"IF(COUNTIF(Allgemein!$H$8:$H$45,A15)>0,\"Feiertag\",\"\")","v":""},{"$f":"IFERROR(VLOOKUP(A15,Allgemein!$H$8:$I$45,2,FALSE),\"\")","v":""},{"$f":"VLOOKUP(B15,Personalstamm!$D$8:$F$14,3,FALSE)","v":{"v":8,"d":"8.00"}},"",""]
["2026-03-07","Samstag","Wochenende",{"$nulls":5},"","",{"$f":"IF(I16=\"\",\"\",IF(AND(I16<>\"\",J16=\"\",I16>=Personalstamm!$D$20),Personalstamm!$E$20,IF(AND(I16<>\"\",J16=\"\",I16>=Personalstamm!$D$19),Personalstamm!$E$19,IF(AND(I16<>\"\",J16<Personalstamm!$E$20,I16>=Personalstamm!$D$20),Personalstamm!$E$20-J16,IF(AND(I16<>\"\",J16<Personalstamm!E$19,I16>=Personalstamm!$D$19),Personalstamm!$E$19-J16,0)))))","v":""},"","",{"$f":"IF(OR(M16=\"\",M16=\"Bitte auswählen\"),\"\",IF(M16=\"Feiertag\",T16*U16,IF(M16=\"Gleittag\",0,VLOOKUP(B16,Personalstamm!$D$8:$F$14,3,FALSE))))","v":""},{"$f":"VLOOKUP(B16,Personalstamm!$D$8:$E$14,2,FALSE)","v":{"v":0,"d":"0.00"}},"",{"v":0,"d":"0.00"},null,{"$f":"IF(COUNTIF(Allgemein!$H$8:$H$45,A16)>0,\"Feiertag\",\"\")","v":""},{"$f":"IFERROR(VLOOKUP(A16,Allgemein!$H$8:$I$45,2,FALSE),\"\")","v":""},{"$f":"VLOOKUP(B16,Personalstamm!$D$8:$F$14,3,FALSE)","v":{"v":0,"d":"0.00"}},"",""]
["2026-03-08","Sonntag","Wochenende",{"$nulls":5},"","",{"$f":"IF(I17=\"\",\"\",IF(AND(I17<>\"\",J17=\"\",I17>=Personalstamm!$D$20),Personalstamm!$E$20,IF(AND(I17<>\"\",J17=\"\",I17>=Personalstamm!$D$19),Personalstamm!$E$19,IF(AND(I17<>\"\",J17<Personalstamm!$E$20,I17>=Personalstamm!$D$20),Personalstamm!$E$20-J17,IF(AND(I17<>\"\",J17<Personalstamm!E$19,I17>=Personalstamm!$D$19),Personalstamm!$E$19-J17,0)))))","v":""},"","",{"$f":"IF(OR(M17=\"\",M17=\"Bitte auswählen\"),\"\",IF(M17=\"Feiertag\",T17*U17,IF(M17=\"Gleittag\",0,VLOOKUP(B17,Personalstamm!$D$8:$F$14,3,FALSE))))","v":""},{"$f":"VLOOKUP(B17,Personalstamm!$D$8:$E$14,2,FALSE)","v":{"v":0,"d":"0.00"}},"",{"v":0,"d":"0.00"},null,{"$f":"IF(COUNTIF(Allgemein!$H$8:$H$45,A17)>0,\"Feiertag\",\"\")","v":"Feiertag"},{"$f":"IFERROR(VLOOKUP(A17,Allgemein!$H$8:$I$45,2,FALSE),\"\")","v":{"v":0,"d":"0.00"}},{"$f":"VLOOKUP(B17,Personalstamm!$D$8:$F$14,3,FALSE)","v":{"v":0,"d":"0.00"}},"",""]
["2026-03-09","Montag","Bitte auswählen",{"$nulls":5},"","",{"$f":"IF(I18=\"\",\"\",IF(AND(I18<>\"\",J18=\"\",I18>=Personalstamm!$D$20),Personalstamm!$E$20,IF(AND(I18<>\"\",J18=\"\",I18>=Personalstamm!$D$19),Personalstamm!$E$19,IF(AND(I18<>\"\",J18<Personalstamm!$E$20,I18>=Personalstamm!$D$20),Personalstamm!$E$20-J18,IF(AND(I18<>\"\",J18<Personalstamm!E$19,I18>=Personalstamm!$D$19),Personalstamm!$E$19-J18,0)))))","v":""},"","",{"$f":"IF(OR(M18=\"\",M18=\"Bitte auswählen\"),\"\",IF(M18=\"Feiertag\",T18*U18,IF(M18=\"Gleittag\",0,VLOOKUP(B18,Personalstamm!$D$8:$F$14,3,FALSE))))","v":""},{"$f":"VLOOKUP(B18,Personalstamm!$D$8:$E$14,2,FALSE)","v":{"v":8,"d":"8.00"}},"",{"v":0,"d":"0.00"},null,{"$f":"IF(COUNTIF(Allgemein!$H$8:$H$45,A18)>0,\"Feiertag\",\"\")","v":""},{"$f":"IFERROR(VLOOKUP(A18,Allgemein!$H$8:$I$45,2,FALSE),\"\")","v":""},{"$f":"VLOOKUP(B18,Personalstamm!$D$8:$F$14,3,FALSE)","v":{"v":8,"d":"8.00"}},"",""]
["2026-03-10","Dienstag","Bitte auswählen",{"$nulls":5},"","",{"$f":"IF(I19=\"\",\"\",IF(AND(I19<>\"\",J19=\"\",I19>=Personalstamm!$D$20),Personalstamm!$E$20,IF(AND(I19<>\"\",J19=\"\",I19>=Personalstamm!$D$19),Personalstamm!$E$19,IF(AND(I19<>\"\",J19<Personalstamm!$E$20,I19>=Personalstamm!$D$20),Personalstamm!$E$20-J19,IF(AND(I19<>\"\",J19<Personalstamm!E$19,I19>=Personalstamm!$D$19),Personalstamm!$E$19-J19,0)))))","v":""},"","",{"$f":"IF(OR(M19=\"\",M19=\"Bitte auswählen\"),\"\",IF(M19=\"Feiertag\",T19*U19,IF(M19=\"Gleittag\",0,VLOOKUP(B19,Personalstamm!$D$8:$F$14,3,FALSE))))","v":""},{"$f":"VLOOKUP(B19,Personalstamm!$D$8:$E$14,2,FALSE)","v":{"v":8,"d":"8.00"}},"",{"v":0,"d":"0.00"},null,{"$f":"IF(COUNTIF(Allgemein!$H$8:$H$45,A19)>0,\"Feiertag\",\"\")","v":""},{"$f":"IFERROR(VLOOKUP(A19,Allgemein!$H$8:$I$45,2,FALSE),\"\")","v":""},{"$f":"VLOOKUP(B19,Personalstamm!$D$8:$F$14,3,FALSE)","v":{"v":8,"d":"8.00"}},"",""]
["2026-03-11","Mittwoch","Bitte auswählen",{"$nulls":5},"","",{"$f":"IF(I20=\"\",\"\",IF(AND(I20<>\"\",J20=\"\",I20>=Personalstamm!$D$20),Personalstamm!$E$20,IF(AND(I20<>\"\",J20=\"\",I20>=Personalstamm!$D$19),Personalstamm!$E$19,IF(AND(I20<>\"\",J20<Personalstamm!$E$20,I20>=Personalstamm!$D$20),Personalstamm!$E$20-J20,IF(AND(I20<>\"\",J20<Personalstamm!E$19,I20>=Personalstamm!$D$19),Personalstamm!$E$19-J20,0)))))","v":""},"","",{"$f":"IF(OR(M20=\"\",M20=\"Bitte auswählen\"),\"\",IF(M20=\"Feiertag\",T20*U20,IF(M20=\"Gleittag\",0,VLOOKUP(B20,Personalstamm!$D$8:$F$14,3,FALSE))))","v":""},{"$f":"VLOOKUP(B20,Personalstamm!$D$8:$E$14,2,FALSE)","v":{"v":8,"d":"8.00"}},"",{"v":0,"d":"0.00"},null,{"$f":"IF(COUNTIF(Allgemein!$H$8:$H$45,A20)>0,\"Feiertag\",\"\")","v":""},{"$f":"IFERROR(VLOOKUP(A20,Allgemein!$H$8:$I$45,2,FALSE),\"\")","v":""},{"$f":"VLOOKUP(B20,Personalstamm!$D$8:$F$14,3,FALSE)","v":{"v":8,"d":"8.00"}},"",""]
["2026-03-12","Donnerstag","Bitte auswählen",{"$nulls":5},"","",{"$f":"IF(I21=\"\",\"\",IF(AND(I21<>\"\",J21=\"\",I21>=Personalstamm!$D$20),Personalstamm!$E$20,IF(AND(I21<>\"\",J21=\"\",I21>=Personalstamm!$D$19),Personalstamm!$E$19,IF(AND(I21<>\"\",J21<Personalstamm!$E$20,I21>=Personalstamm!$D$20),Personalstamm!$E$20-J21,IF(AND(I21<>\"\",J21<Personalstamm!E$19,I21>=Personalstamm!$D$19),Personalstamm!$E$19-J21,0)))))","v":""},"","",{"$f":"IF(OR(M21=\"\",M21=\"Bitte auswählen\"),\"\",IF(M21=\"Feiertag\",T21*U21,IF(M21=\"Gleittag\",0,VLOOKUP(B21,Personalstamm!$D$8:$F$14,3,FALSE))))","v":""},{"$f":"VLOOKUP(B21,Personalstamm!$D$8:$E$14,2,FALSE)","v":{"v":8,"d":"8.00"}},"",{"v":0,"d":"0.00"},null,{"$f":"IF(COUNTIF(Allgemein!$H$8:$H$45,A21)>0,\"Feiertag\",\"\")","v":""},{"$f":"IFERROR(VLOOKUP(A21,Allgemein!$H$8:$I$45,2,FALSE),\"\")","v":""},{"$f":"VLOOKUP(B21,Personalstamm!$D$8:$F$14,3,FALSE)","v":{"v":8,"d":"8.00"}},"",""]
["2026-03-13","Freitag","Bitte auswählen",{"$nulls":5},"","",{"$f":"IF(I22=\"\",\"\",IF(AND(I22<>\"\",J22=\"\",I22>=Personalstamm!$D$20),Personalstamm!$E$20,IF(AND(I22<>\"\",J22=\"\",I22>=Personalstamm!$D$19),Personalstamm!$E$19,IF(AND(I22<>\"\",J22<Personalstamm!$E$20,I22>=Personalstamm!$D$20),Personalstamm!$E$20-J22,IF(AND(I22<>\"\",J22<Personalstamm!E$19,I22>=Personalstamm!$D$19),Personalstamm!$E$19-J22,0)))))","v":""},"","",{"$f":"IF(OR(M22=\"\",M22=\"Bitte auswählen\"),\"\",IF(M22=\"Feiertag\",T22*U22,IF(M22=\"Gleittag\",0,VLOOKUP(B22,Personalstamm!$D$8:$F$14,3,FALSE))))","v":""},{"$f":"VLOOKUP(B22,Personalstamm!$D$8:$E$14,2,FALSE)","v":{"v":8,"d":"8.00"}},"",{"v":0,"d":"0.00"},null,{"$f":"IF(COUNTIF(Allgemein!$H$8:$H$45,A22)>0,\"Feiertag\",\"\")","v":""},{"$f":"IFERROR(VLOOKUP(A22,Allgemein!$H$8:$I$45,2,FALSE),\"\")","v":""},{"$f":"VLOOKUP(B22,Personalstamm!$D$8:$F$14,3,FALSE)","v":{"v":8,"d":"8.00"}},"",""]
["2026-03-14","Samstag","Wochenende",{"$nulls":5},"","",{"$f":"IF(I23=\"\",\"\",IF(AND(I23<>\"\",J23=\"\",I23>=Personalstamm!$D$20),Personalstamm!$E$20,IF(AND(I23<>\"\",J23=\"\",I23>=Personalstamm!$D$19),Personalstamm!$E$19,IF(AND(I23<>\"\",J23<Personalstamm!$E$20,I23>=Personalstamm!$D$20),Personalstamm!$E$20-J23,IF(AND(I23<>\"\",J23<Personalstamm!E$19,I23>=Personalstamm!$D$19),Personalstamm!$E$19-J23,0)))))","v":""},"","",{"$f":"IF(OR(M23=\"\",M23=\"Bitte auswählen\"),\"\",IF(M23=\"Feiertag\",T23*U23,IF(M23=\"Gleittag\",0,VLOOKUP(B23,Personalstamm!$D$8:$F$14,3,FALSE))))","v":""},{"$f":"VLOOKUP(B23,Personalstamm!$D$8:$E$14,2,FALSE)","v":{"v":0,"d":"0.00"}},"",{"v":0,"d":"0.00"},null,{"$f":"IF(COUNTIF(Allgemein!$H$8:$H$45,A23)>0,\"Feiertag\",\"\")","v":""},{"$f":"IFERROR(VLOOKUP(A23,Allgemein!$H$8:$I$45,2,FALSE),\"\")","v":""},{"$f":"VLOOKUP(B23,Personalstamm!$D$8:$F$14,3,FALSE)","v":{"v":0,"d":"0.00"}},"",""]
["2026-03-15","Sonntag","Wochenende",{"$nulls":5},"","",{"$f":"IF(I24=\"\",\"\",IF(AND(I24<>\"\",J24=\"\",I24>=Personalstamm!$D$20),Personalstamm!$E$20,IF(AND(I24<>\"\",J24=\"\",I24>=Personalstamm!$D$19),Personalstamm!$E$19,IF(AND(I24<>\"\",J24<Personalstamm!$E$20,I24>=Personalstamm!$D$20),Personalstamm!$E$20-J24,IF(AND(I24<>\"\",J24<Personalstamm!E$19,I24>=Personalstamm!$D$19),Personalstamm!$E$19-J24,0)))))","v":""},"","",{"$f":"IF(OR(M24=\"\",M24=\"Bitte auswählen\"),\"\",IF(M24=\"Feiertag\",T24*U24,IF(M24=\"Gleittag\",0,VLOOKUP(B24,Personalstamm!$D$8:$F$14,3,FALSE))))","v":""},{"$f":"VLOOKUP(B24,Personalstamm!$D$8:$E$14,2,FALSE)","v":{"v":0,"d":"0.00"}},"",{"v":0,"d":"0.00"},null,{"$f":"IF(COUNTIF(Allgemein!$H$8:$H$45,A24)>0,\"Feiertag\",\"\")","v":""},{"$f":"IFERROR(VLOOKUP(A24,Allgemein!$H$8:$I$45,2,FALSE),\"\")","v":""},{"$f":"VLOOKUP(B24,Personalstamm!$D$8:$F$14,3,FALSE)","v":{"v":0,"d":"0.00"}},"",""]
["2026-03-16","Montag","Bitte auswählen",{"$nulls":5},"","",{"$f":"IF(I25=\"\",\"\",IF(AND(I25<>\"\",J25=\"\",I25>=Personalstamm!$D$20),Personalstamm!$E$20,IF(AND(I25<>\"\",J25=\"\",I25>=Personalstamm!$D$19),Personalstamm!$E$19,IF(AND(I25<>\"\",J25<Personalstamm!$E$20,I25>=Personalstamm!$D$20),Personalstamm!$E$20-J25,IF(AND(I25<>\"\",J25<Personalstamm!E$19,I25>=Personalstamm!$D$19),Personalstamm!$E$19-J25,0)))))","v":""},"","",{"$f":"IF(OR(M25=\"\",M25=\"Bitte auswählen\"),\"\",IF(M25=\"Feiertag\",T25*U25,IF(M25=\"Gleittag\",0,VLOOKUP(B25,Personalstamm!$D$8:$F$14,3,FALSE))))","v":""},{"$f":"VLOOKUP(B25,Personalstamm!$D$8:$E$14,2,FALSE)","v":{"v":8,"d":"8.00"}},"",{"v":0,"d":"0.00"},null,{"$f":"IF(COUNTIF(Allgemein!$H$8:$H$45,A25)>0,\"Feiertag\",\"\")","v":""},{"$f":"IFERROR(VLOOKUP(A25,Allgemein!$H$8:$I$45,2,FALSE),\"\")","v":""},{"$f":"VLOOKUP(B25,Personalstamm!$D$8:$F$14,3,FALSE)","v":{"v":8,"d":"8.00"}},"",""]
["2026-03-17","Dienstag","Bitte auswählen",{"$nulls":5},"","",{"$f":"IF(I26=\"\",\"\",IF(AND(I26<>\"\",J26=\"\",I26>=Personalstamm!$D$20),Personalstamm!$E$20,IF(AND(I26<>\"\",J26=\"\",I26>=Personalstamm!$D$19),Personalstamm!$E$19,IF(AND(I26<>\"\",J26<Personalstamm!$E$20,I26>=Personalstamm!$D$20),Personalstamm!$E$20-J26,IF(AND(I26<>\"\",J26<Personalstamm!E$19,I26>=Personalstamm!$D$19),Personalstamm!$E$19-J26,0)))))","v":""},"","",{"$f":"IF(OR(M26=\"\",M26=\"Bitte auswählen\"),\"\",IF(M26=\"Feiertag\",T26*U26,IF(M26=\"Gleittag\",0,VLOOKUP(B26,Personalstamm!$D$8:$F$14,3,FALSE))))","v":""},{"$f":"VLOOKUP(B26,Personalstamm!$D$8:$E$14,2,FALSE)","v":{"v":8,"d":"8.00"}},"",{"v":0,"d":"0.00"},null,{"$f":"IF(COUNTIF(Allgemein!$H$8:$H$45,A26)>0,\"Feiertag\",\"\")","v":""},{"$f":"IFERROR(VLOOKUP(A26,Allgemein!$H$8:$I$45,2,FALSE),\"\")","v":""},{"$f":"VLOOKUP(B26,Personalstamm!$D$8:$F$14,3,FALSE)","v":{"v":8,"d":"8.00"}},"",""]
["2026-03-18","Mittwoch","Bitte auswählen",{"$nulls":5},"","",{"$f":"IF(I27=\"\",\"\",IF(AND(I27<>\"\",J27=\"\",I27>=Personalstamm!$D$20),Personalstamm!$E$20,IF(AND(I27<>\"\",J27=\"\",I27>=Personalstamm!$D$19),Personalstamm!$E$19,IF(AND(I27<>\"\",J27<Personalstamm!$E$20,I27>=Personalstamm!$D$20),Personalstamm!$E$20-J27,IF(AND(I27<>\"\",J27<Personalstamm!E$19,I27>=Personalstamm!$D$19),Personalstamm!$E$19-J27,0)))))","v":""},"","",{"$f":"IF(OR(M27=\"\",M27=\"Bitte auswählen\"),\"\",IF(M27=\"Feiertag\",T27*U27,IF(M27=\"Gleittag\",0,VLOOKUP(B27,Personalstamm!$D$8:$F$14,3,FALSE))))","v":""},{"$f":"VLOOKUP(B27,Personalstamm!$D$8:$E$14,2,FALSE)","v":{"v":8,"d":"8.00"}},"",{"v":0,"d":"0.00"},null,{"$f":"IF(COUNTIF(Allgemein!$H$8:$H$45,A27)>0,\"Feiertag\",\"\")","v":""},{"$f":"IFERROR(VLOOKUP(A27,Allgemein!$H$8:$I$45,2,FALSE),\"\")","v":""},{"$f":"VLOOKUP(B27,Personalstamm!$D$8:$F$14,3,FALSE)","v":{"v":8,"d":"8.00"}},"",""]
["2026-03-19","Donnerstag","Bitte auswählen",{"$nulls":5},"","",{"$f":"IF(I28=\"\",\"\",IF(AND(I28<>\"\",J28=\"\",I28>=Personalstamm!$D$20),Personalstamm!$E$20,IF(AND(I28<>\"\",J28=\"\",I28>=Personalstamm!$D$19),Personalstamm!$E$19,IF(AND(I28<>\"\",J28<Personalstamm!$E$20,I28>=Personalstamm!$D$20),Personalstamm!$E$20-J28,IF(AND(I28<>\"\",J28<Personalstamm!E$19,I28>=Personalstamm!$D$19),Personalstamm!$E$19-J28,0)))))","v":""},"","",{"$f":"IF(OR(M28=\"\",M28=\"Bitte auswählen\"),\"\",IF(M28=\"Feiertag\",T28*U28,IF(M28=\"Gleittag\",0,VLOOKUP(B28,Personalstamm!$D$8:$F$14,3,FALSE))))","v":""},{"$f":"VLOOKUP(B28,Personalstamm!$D$8:$E$14,2,FALSE)","v":{"v":8,"d":"8.00"}},"",{"v":0,"d":"0.00"},null,{"$f":"IF(COUNTIF(Allgemein!$H$8:$H$45,A28)>0,\"Feiertag\",\"\")","v":""},{"$f":"IFERROR(VLOOKUP(A28,Allgemein!$H$8:$I$45,2,FALSE),\"\")","v":""},{"$f":"VLOOKUP(B28,Personalstamm!$D$8:$F$14,3,FALSE)","v":{"v":8,"d":"8.00"}},"",""]
["2026-03-20","Freitag","Bitte auswählen",{"$nulls":5},"","",{"$f":"IF(I29=\"\",\"\",IF(AND(I29<>\"\",J29=\"\",I29>=Personalstamm!$D$20),Personalstamm!$E$20,IF(AND(I29<>\"\",J29=\"\",I29>=Personalstamm!$D$19),Personalstamm!$E$19,IF(AND(I29<>\"\",J29<Personalstamm!$E$20,I29>=Personalstamm!$D$20),Personalstamm!$E$20-J29,IF(AND(I29<>\"\",J29<Personalstamm!E$19,I29>=Personalstamm!$D$19),Personalstamm!$E$19-J29,0)))))","v":""},"","",{"$f":"IF(OR(M29=\"\",M29=\"Bitte auswählen\"),\"\",IF(M29=\"Feiertag\",T29*U29,IF(M29=\"Gleittag\",0,VLOOKUP(B29,Personalstamm!$D$8:$F$14,3,FALSE))))","v":""},{"$f":"VLOOKUP(B29,Personalstamm!$D$8:$E$14,2,FALSE)","v":{"v":8,"d":"8.00"}},"",{"v":0,"d":"0.00"},null,{"$f":"IF(COUNTIF(Allgemein!$H$8:$H$45,A29)>0,\"Feiertag\",\"\")","v":""},{"$f":"IFERROR(VLOOKUP(A29,Allgemein!$H$8:$I$45,2,FALSE),\"\")","v":""},{"$f":"VLOOKUP(B29,Personalstamm!$D$8:$F$14,3,FALSE)","v":{"v":8,"d":"8.00"}},"",""]
["2026-03-21","Samstag","Wochenende",{"$nulls":5},"","",{"$f":"IF(I30=\"\",\"\",IF(AND(I30<>\"\",J30=\"\",I30>=Personalstamm!$D$20),Personalstamm!$E$20,IF(AND(I30<>\"\",J30=\"\",I30>=Personalstamm!$D$19),Personalstamm!$E$19,IF(AND(I30<>\"\",J30<Personalstamm!$E$20,I30>=Personalstamm!$D$20),Personalstamm!$E$20-J30,IF(AND(I30<>\"\",J30<Personalstamm!E$19,I30>=Personalstamm!$D$19),Personalstamm!$E$19-J30,0)))))","v":""},"","",{"$f":"IF(OR(M30=\"\",M30=\"Bitte auswählen\"),\"\",IF(M30=\"Feiertag\",T30*U30,IF(M30=\"Gleittag\",0,VLOOKUP(B30,Personalstamm!$D$8:$F$14,3,FALSE))))","v":""},{"$f":"VLOOKUP(B30,Personalstamm!$D$8:$E$14,2,FALSE)","v":{"v":0,"d":"0.00"}},"",{"v":0,"d":"0.00"},null,{"$f":"IF(COUNTIF(Allgemein!$H$8:$H$45,A30)>0,\"Feiertag\",\"\")","v":""},{"$f":"IFERROR(VLOOKUP(A30,Allgemein!$H$8:$I$45,2,FALSE),\"\")","v":""},{"$f":"VLOOKUP(B30,Personalstamm!$D$8:$F$14,3,FALSE)","v":{"v":0,"d":"0.00"}},"",""]
["2026-03-22","Sonntag","Wochenende",{"$nulls":5},"","",{"$f":"IF(I31=\"\",\"\",IF(AND(I31<>\"\",J31=\"\",I31>=Personalstamm!$D$20),Personalstamm!$E$20,IF(AND(I31<>\"\",J31=\"\",I31>=Personalstamm!$D$19),Personalstamm!$E$19,IF(AND(I31<>\"\",J31<Personalstamm!$E$20,I31>=Personalstamm!$D$20),Personalstamm!$E$20-J31,IF(AND(I31<>\"\",J31<Personalstamm!E$19,I31>=Personalstamm!$D$19),Personalstamm!$E$19-J31,0)))))","v":""},"","",{"$f":"IF(OR(M31=\"\",M31=\"Bitte auswählen\"),\"\",IF(M31=\"Feiertag\",T31*U31,IF(M31=\"Gleittag\",0,VLOOKUP(B31,Personalstamm!$D$8:$F$14,3,FALSE))))","v":""},{"$f":"VLOOKUP(B31,Personalstamm!$D$8:$E$14,2,FALSE)","v":{"v":0,"d":"0.00"}},"",{"v":0,"d":"0.00"},null,{"$f":"IF(COUNTIF(Allgemein!$H$8:$H$45,A31)>0,\"Feiertag\",\"\")","v":""},{"$f":"IFERROR(VLOOKUP(A31,Allgemein!$H$8:$I$45,2,FALSE),\"\")","v":""},{"$f":"VLOOKUP(B31,Personalstamm!$D$8:$F$14,3,FALSE)","v":{"v":0,"d":"0.00"}},"",""]
["2026-03-23","Montag","Bitte auswählen",{"$nulls":5},"","",{"$f":"IF(I32=\"\",\"\",IF(AND(I32<>\"\",J32=\"\",I32>=Personalstamm!$D$20),Personalstamm!$E$20,IF(AND(I32<>\"\",J32=\"\",I32>=Personalstamm!$D$19),Personalstamm!$E$19,IF(AND(I32<>\"\",J32<Personalstamm!$E$20,I32>=Personalstamm!$D$20),Personalstamm!$E$20-J32,IF(AND(I32<>\"\",J32<Personalstamm!E$19,I32>=Personalstamm!$D$19),Personalstamm!$E$19-J32,0)))))","v":""},"","",{"$f":"IF(OR(M32=\"\",M32=\"Bitte auswählen\"),\"\",IF(M32=\"Feiertag\",T32*U32,IF(M32=\"Gleittag\",0,VLOOKUP(B32,Personalstamm!$D$8:$F$14,3,FALSE))))","v":""},{"$f":"VLOOKUP(B32,Personalstamm!$D$8:$E$14,2,FALSE)","v":{"v":8,"d":"8.00"}},"",{"v":0,"d":"0.00"},null,{"$f":"IF(COUNTIF(Allgemein!$H$8:$H$45,A32)>0,\"Feiertag\",\"\")","v":""},{"$f":"IFERROR(VLOOKUP(A32,Allgemein!$H$8:$I$45,2,FALSE),\"\")","v":""},{"$f":"VLOOKUP(B32,Personalstamm!$D$8:$F$14,3,FALSE)","v":{"v":8,"d":"8.00"}},"",""]
["2026-03-24","Dienstag","Bitte auswählen",{"$nulls":5},"","",{"$f":"IF(I33=\"\",\"\",IF(AND(I33<>\"\",J33=\"\",I33>=Personalstamm!$D$20),Personalstamm!$E$20,IF(AND(I33<>\"\",J33=\"\",I33>=Personalstamm!$D$19),Personalstamm!$E$19,IF(AND(I33<>\"\",J33<Personalstamm!$E$20,I33>=Personalstamm!$D$20),Personalstamm!$E$20-J33,IF(AND(I33<>\"\",J33<Personalstamm!E$19,I33>=Personalstamm!$D$19),Personalstamm!$E$19-J33,0)))))","v":""},"","",{"$f":"IF(OR(M33=\"\",M33=\"Bitte auswählen\"),\"\",IF(M33=\"Feiertag\",T33*U33,IF(M33=\"Gleittag\",0,VLOOKUP(B33,Personalstamm!$D$8:$F$14,3,FALSE))))","v":""},{"$f":"VLOOKUP(B33,Personalstamm!$D$8:$E$14,2,FALSE)","v":{"v":8,"d":"8.00"}},"",{"v":0,"d":"0.00"},null,{"$f":"IF(COUNTIF(Allgemein!$H$8:$H$45,A33)>0,\"Feiertag\",\"\")","v":""},{"$f":"IFERROR(VLOOKUP(A33,Allgemein!$H$8:$I$45,2,FALSE),\"\")","v":""},{"$f":"VLOOKUP(B33,Personalstamm!$D$8:$F$14,3,FALSE)","v":{"v":8,"d":"8.00"}},"",""]
["2026-03-25","Mittwoch","Bitte auswählen",{"$nulls":5},"","",{"$f":"IF(I34=\"\",\"\",IF(AND(I34<>\"\",J34=\"\",I34>=Personalstamm!$D$20),Personalstamm!$E$20,IF(AND(I34<>\"\",J34=\"\",I34>=Personalstamm!$D$19),Personalstamm!$E$19,IF(AND(I34<>\"\",J34<Personalstamm!$E$20,I34>=Personalstamm!$D$20),Personalstamm!$E$20-J34,IF(AND(I34<>\"\",J34<Personalstamm!E$19,I34>=Personalstamm!$D$19),Personalstamm!$E$19-J34,0)))))","v":""},"","",{"$f":"IF(OR(M34=\"\",M34=\"Bitte auswählen\"),\"\",IF(M34=\"Feiertag\",T34*U34,IF(M34=\"Gleittag\",0,VLOOKUP(B34,Personalstamm!$D$8:$F$14,3,FALSE))))","v":""},{"$f":"VLOOKUP(B34,Personalstamm!$D$8:$E$14,2,FALSE)","v":{"v":8,"d":"8.00"}},"",{"v":0,"d":"0.00"},null,{"$f":"IF(COUNTIF(Allgemein!$H$8:$H$45,A34)>0,\"Feiertag\",\"\")","v":""},{"$f":"IFERROR(VLOOKUP(A34,Allgemein!$H$8:$I$45,2,FALSE),\"\")","v":""},{"$f":"VLOOKUP(B34,Personalstamm!$D$8:$F$14,3,FALSE)","v":{"v":8,"d":"8.00"}},"",""]
["2026-03-26","Donnerstag","Bitte auswählen",{"$nulls":5},"","",{"$f":"IF(I35=\"\",\"\",IF(AND(I35<>\"\",J35=\"\",I35>=Personalstamm!$D$20),Personalstamm!$E$20,IF(AND(I35<>\"\",J35=\"\",I35>=Personalstamm!$D$19),Personalstamm!$E$19,IF(AND(I35<>\"\",J35<Personalstamm!$E$20,I35>=Personalstamm!$D$20),Personalstamm!$E$20-J35,IF(AND(I35<>\"\",J35<Personalstamm!E$19,I35>=Personalstamm!$D$19),Personalstamm!$E$19-J35,0)))))","v":""},"","",{"$f":"IF(OR(M35=\"\",M35=\"Bitte auswählen\"),\"\",IF(M35=\"Feiertag\",T35*U35,IF(M35=\"Gleittag\",0,VLOOKUP(B35,Personalstamm!$D$8:$F$14,3,FALSE))))","v":""},{"$f":"VLOOKUP(B35,Personalstamm!$D$8:$E$14,2,FALSE)","v":{"v":8,"d":"8.00"}},"",{"v":0,"d":"0.00"},null,{"$f":"IF(COUNTIF(Allgemein!$H$8:$H$45,A35)>0,\"Feiertag\",\"\")","v":""},{"$f":"IFERROR(VLOOKUP(A35,Allgemein!$H$8:$I$45,2,FALSE),\"\")","v":""},{"$f":"VLOOKUP(B35,Personalstamm!$D$8:$F$14,3,FALSE)","v":{"v":8,"d":"8.00"}},"",""]
["2026-03-27","Freitag","Bitte auswählen",{"$nulls":5},"","",{"$f":"IF(I36=\"\",\"\",IF(AND(I36<>\"\",J36=\"\",I36>=Personalstamm!$D$20),Personalstamm!$E$20,IF(AND(I36<>\"\",J36=\"\",I36>=Personalstamm!$D$19),Personalstamm!$E$19,IF(AND(I36<>\"\",J36<Personalstamm!$E$20,I36>=Personalstamm!$D$20),Personalstamm!$E$20-J36,IF(AND(I36<>\"\",J36<Personalstamm!E$19,I36>=Personalstamm!$D$19),Personalstamm!$E$19-J36,0)))))","v":""},"","",{"$f":"IF(OR(M36=\"\",M36=\"Bitte auswählen\"),\"\",IF(M36=\"Feiertag\",T36*U36,IF(M36=\"Gleittag\",0,VLOOKUP(B36,Personalstamm!$D$8:$F$14,3,FALSE))))","v":""},{"$f":"VLOOKUP(B36,Personalstamm!$D$8:$E$14,2,FALSE)","v":{"v":8,"d":"8.00"}},"",{"v":0,"d":"0.00"},null,{"$f":"IF(COUNTIF(Allgemein!$H$8:$H$45,A36)>0,\"Feiertag\",\"\")","v":""},{"$f":"IFERROR(VLOOKUP(A36,Allgemein!$H$8:$I$45,2,FALSE),\"\")","v":""},{"$f":"VLOOKUP(B36,Personalstamm!$D$8:$F$14,3,FALSE)","v":{"v":8,"d":"8.00"}},"",""]
["2026-03-28","Samstag","Wochenende",{"$nulls":5},"","",{"$f":"IF(I37=\"\",\"\",IF(AND(I37<>\"\",J37=\"\",I37>=Personalstamm!$D$20),Personalstamm!$E$20,IF(AND(I37<>\"\",J37=\"\",I37>=Personalstamm!$D$19),Personalstamm!$E$19,IF(AND(I37<>\"\",J37<Personalstamm!$E$20,I37>=Personalstamm!$D$20),Personalstamm!$E$20-J37,IF(AND(I37<>\"\",J37<Personalstamm!E$19,I37>=Personalstamm!$D$19),Personalstamm!$E$19-J37,0)))))","v":""},"","",{"$f":"IF(OR(M37=\"\",M37=\"Bitte auswählen\"),\"\",IF(M37=\"Feiertag\",T37*U37,IF(M37=\"Gleittag\",0,VLOOKUP(B37,Personalstamm!$D$8:$F$14,3,FALSE))))","v":""},{"$f":"VLOOKUP(B37,Personalstamm!$D$8:$E$14,2,FALSE)","v":{"v":0,"d":"0.00"}},"",{"v":0,"d":"0.00"},null,{"$f":"IF(COUNTIF(Allgemein!$H$8:$H$45,A37)>0,\"Feiertag\",\"\")","v":""},{"$f":"IFERROR(VLOOKUP(A37,Allgemein!$H$8:$I$45,2,FALSE),\"\")","v":""},{"$f":"VLOOKUP(B37,Personalstamm!$D$8:$F$14,3,FALSE)","v":{"v":0,"d":"0.00"}},"",""]
["2026-03-29","Sonntag","Wochenende",{"$nulls":5},"","",{"$f":"IF(I38=\"\",\"\",IF(AND(I38<>\"\",J38=\"\",I38>=Personalstamm!$D$20),Personalstamm!$E$20,IF(AND(I38<>\"\",J38=\"\",I38>=Personalstamm!$D$19),Personalstamm!$E$19,IF(AND(I38<>\"\",J38<Personalstamm!$E$20,I38>=Personalstamm!$D$20),Personalstamm!$E$20-J38,IF(AND(I38<>\"\",J38<Personalstamm!E$19,I38>=Personalstamm!$D$19),Personalstamm!$E$19-J38,0)))))","v":""},"","",{"$f":"IF(OR(M38=\"\",M38=\"Bitte auswählen\"),\"\",IF(M38=\"Feiertag\",T38*U38,IF(M38=\"Gleittag\",0,VLOOKUP(B38,Personalstamm!$D$8:$F$14,3,FALSE))))","v":""},{"$f":"VLOOKUP(B38,Personalstamm!$D$8:$E$14,2,FALSE)","v":{"v":0,"d":"0.00"}},"",{"v":0,"d":"0.00"},null,{"$f":"IF(COUNTIF(Allgemein!$H$8:$H$45,A38)>0,\"Feiertag\",\"\")","v":"Feiertag"},{"$f":"IFERROR(VLOOKUP(A38,Allgemein!$H$8:$I$45,2,FALSE),\"\")","v":{"v":0,"d":"0.00"}},{"$f":"VLOOKUP(B38,Personalstamm!$D$8:$F$14,3,FALSE)","v":{"v":0,"d":"0.00"}},"",""]
["2026-03-30","Montag","Bitte auswählen",{"$nulls":5},"","",{"$f":"IF(I39=\"\",\"\",IF(AND(I39<>\"\",J39=\"\",I39>=Personalstamm!$D$20),Personalstamm!$E$20,IF(AND(I39<>\"\",J39=\"\",I39>=Personalstamm!$D$19),Personalstamm!$E$19,IF(AND(I39<>\"\",J39<Personalstamm!$E$20,I39>=Personalstamm!$D$20),Personalstamm!$E$20-J39,IF(AND(I39<>\"\",J39<Personalstamm!E$19,I39>=Personalstamm!$D$19),Personalstamm!$E$19-J39,0)))))","v":""},"","",{"$f":"IF(OR(M39=\"\",M39=\"Bitte auswählen\"),\"\",IF(M39=\"Feiertag\",T39*U39,IF(M39=\"Gleittag\",0,VLOOKUP(B39,Personalstamm!$D$8:$F$14,3,FALSE))))","v":""},{"$f":"VLOOKUP(B39,Personalstamm!$D$8:$E$14,2,FALSE)","v":{"v":8,"d":"8.00"}},"",{"v":0,"d":"0.00"},null,{"$f":"IF(COUNTIF(Allgemein!$H$8:$H$45,A39)>0,\"Feiertag\",\"\")","v":""},{"$f":"IFERROR(VLOOKUP(A39,Allgemein!$H$8:$I$45,2,FALSE),\"\")","v":""},{"$f":"VLOOKUP(B39,Personalstamm!$D$8:$F$14,3,FALSE)","v":{"v":8,"d":"8.00"}},"",""]
["2026-03-31","Dienstag","Bitte auswählen",{"$nulls":5},"","",{"$f":"IF(I40=\"\",\"\",IF(AND(I40<>\"\",J40=\"\",I40>=Personalstamm!$D$20),Personalstamm!$E$20,IF(AND(I40<>\"\",J40=\"\",I40>=Personalstamm!$D$19),Personalstamm!$E$19,IF(AND(I40<>\"\",J40<Personalstamm!$E$20,I40>=Personalstamm!$D$20),Personalstamm!$E$20-J40,IF(AND(I40<>\"\",J40<Personalstamm!E$19,I40>=Personalstamm!$D$19),Personalstamm!$E$19-J40,0)))))","v":""},"","",{"$f":"IF(OR(M40=\"\",M40=\"Bitte auswählen\"),\"\",IF(M40=\"Feiertag\",T40*U40,IF(M40=\"Gleittag\",0,VLOOKUP(B40,Personalstamm!$D$8:$F$14,3,FALSE))))","v":""},{"$f":"VLOOKUP(B40,Personalstamm!$D$8:$E$14,2,FALSE)","v":{"v":8,"d":"8.00"}},"",{"v":0,"d":"0.00"},null,{"$f":"IF(COUNTIF(Allgemein!$H$8:$H$45,A40)>0,\"Feiertag\",\"\")","v":""},{"$f":"IFERROR(VLOOKUP(A40,Allgemein!$H$8:$I$45,2,FALSE),\"\")","v":""},{"$f":"VLOOKUP(B40,Personalstamm!$D$8:$F$14,3,FALSE)","v":{"v":8,"d":"8.00"}},"",""]
["Summe",{"$nulls":7},{"$f":"SUM(I10:I40)","v":{"v":0,"d":"0.00"}},{"$f":"SUM(J10:J40)","v":{"v":0,"d":"0.00"}},{"$f":"SUM(K10:K40)","v":{"v":0,"d":"0.00"}},{"$f":"SUM(L10:L40)","v":{"v":0,"d":"0.00"}},null,{"$f":"SUM(N10:N40)","v":{"v":0,"d":"0.00"}},{"$f":"SUM(O10:O40)","v":{"v":176,"d":"176.00"}},{"$f":"SUM(P10:P40)","v":{"v":0,"d":"0.00"}}]
[]
["Art","Anzahl Tage",null,"Fehlzeitenart","Anzahl Tage","Anzahl Stunden",null,"Urlaub genommen","Urlaub geplant"]
["Monat",{"$f":"COUNTIF($C$10:$C$40,\"*\")","v":{"v":31,"d":"31.00"}},null,"Urlaub",{"$f":"COUNTIF($M$10:$M$40,Allgemein!$I$50)","v":{"v":0,"d":"0.00"}},{"$f":"SUMIF($M$10:$M$40,Allgemein!$I$50,$N$10:$N$40)","v":{"v":0,"d":"0.00"}},null,{"$f":"COUNTIFS($A$10:$A$40,\"<\"&TODAY(),$M$10:$M$40,\"Urlaub\")","v":{"v":0,"d":"0.00"}},{"$f":"COUNTIFS($A$10:$A$40,\">=\"&TODAY(),$M$10:$M$40,\"Urlaub\")","v":{"v":0,"d":"0.00"}}]
["Anwesenheit",{"$f":"COUNTIF($C$10:$C$40,Allgemein!$G$50)","v":{"v":0,"d":"0.00"}},null,"Krankheit",{"$f":"COUNTIF($M$10:$M$40,Allgemein!$I$51)","v":{"v":0,"d":"0.00"}},{"$f":"SUMIF($M$10:$M$40,Allgemein!$I$51,$N$10:$N$40)","v":{"v":0,"d":"0.00"}}]
["Fehlzeit",{"$f":"COUNTIF($C$10:$C$40,Allgemein!$G$51)","v":{"v":0,"d":"0.00"}},null,"Kurzarbeit",{"$f":"COUNTIF($M$10:$M$40,Allgemein!$I$52)","v":{"v":0,"d":"0.00"}},{"$f":"SUMIF($M$10:$M$40,Allgemein!$I$52,$N$10:$N$40)","v":{"v":0,"d":"0.00"}}]
["Wochenende",{"$f":"COUNTIF($C$10:$C$40,Allgemein!$G$52)","v":{"v":9,"d":"9.00"}},null,"Mutterschutz",{"$f":"COUNTIF($M$10:$M$40,Allgemein!$I$53)","v":{"v":0,"d":"0.00"}},{"$f":"SUMIF($M$10:$M$40,Allgemein!$I$53,$N$10:$N$40)","v":{"v":0,"d":"0.00"}}]
["Undefiniert",{"$f":"COUNTIF($C$10:$C$40,Allgemein!$G$49)","v":{"v":22,"d":"22.00"}},null,"Fortbildung",{"$f":"COUNTIF($M$10:$M$40,Allgemein!$I$54)","v":{"v":0,"d":"0.00"}},{"$f":"SUMIF($M$10:$M$40,Allgemein!$I$54,$N$10:$N$40)","v":{"v":0,"d":"0.00"}}]
[{"$nulls":3},"Elternzeit",{"$f":"COUNTIF($M$10:$M$40,Allgemein!$I$55)","v":{"v":0,"d":"0.00"}},{"$f":"SUMIF($M$10:$M$40,Allgemein!$I$55,$N$10:$N$40)","v":{"v":0,"d":"0.00"}}]
[{"$nulls":3},"Gleittag",{"$f":"COUNTIF($M$10:$M$40,Allgemein!$I$56)","v":{"v":0,"d":"0.00"}},{"$f":"SUMIF($M$10:$M$40,Allgemein!$I$56,$V$10:$V$40)","v":{"v":0,"d":"0.00"}}]
[{"$nulls":3},"Schule",{"$f":"COUNTIF($M$10:$M$40,Allgemein!$I$57)","v":{"v":0,"d":"0.00"}},{"$f":"SUMIF($M$10:$M$40,Allgemein!$I$57,$N$10:$N$40)","v":{"v":0,"d":"0.00"}}]
[{"$nulls":3},"Feiertag",{"$f":"COUNTIF($M$10:$M$40,Allgemein!$I$58)","v":{"v":0,"d":"0.00"}},{"$f":"SUMIF($M$10:$M$40,Allgemein!$I$58,$N$10:$N$40)","v":{"v":0,"d":"0.00"}}]
[{"$nulls":3},"Undefiniert",{"$f":"COUNTIF($M$10:$M$40,Allgemein!$I$49)","v":{"v":0,"d":"0.00"}},{"$f":"SUMIF($M$10:$M$40,Allgemein!$I$49,$N$10:$N$40)","v":{"v":0,"d":"0.00"}}]

{"sheet":"Apr.","index":8,"n_rows":52,"n_cols":23,"rows_kept":52}
[]
[]
[]
[]
[]
["Urlaubsvortrag",{"$f":"Mrz.!$F$6","v":{"v":30,"d":"30.00"}},"Urlaub genommen",{"$f":"$H$43","v":{"v":0,"d":"0.00"}},"Resturlaub",{"$f":"$B$6-$D$6","v":{"v":30,"d":"30.00"}}]
["Saldovortrag",{"$f":"Mrz.!$F$7","v":{"v":0,"d":"0.00"}},"Saldoänderung",{"$f":"$P$40","v":{"v":0,"d":"0.00"}},"Kumulierter Saldo",{"$f":"$B$7+$D$7","v":{"v":0,"d":"0.00"}}]
[]
["Datum","Wochentag","Art","Arbeitsort","Von Uhrzeit","Bis Uhrzeit","Von Uhrzeit","Bis Uhrzeit","Bruttoarbeitszeit","Geb. Pause","Mindestpause","Nettoarbeitszeit","Fehlzeitenart","Fehlstunden","Sollstunden","Tagessaldo","Kumulierter Saldo",null,"Feiertag","Feiertag Anteil Tag","FZ-Gutschrift","Gleittag","Ausgewertet"]
["2026-04-01",{"$f":"TEXT(A10,\"tttt\")","v":"Mittwoch"},{"$f":"IF(AND(S10=\"Feiertag\",T10>0),\"Fehlzeit\",IF(OR(B10=\"Samstag\",B10=\"Sonntag\"),\"Wochenende\",\"Bitte auswählen\"))","v":"Bitte auswählen"},{"$nulls":5},{"$f":"IF(AND(OR(C10=\"Anwesenheit\",C10=\"Wochenende\"),E10<>\"\",F10<>\"\",W10=\"Ja\"),((F10-E10)+(H10-G10))*24,\"\")","v":""},{"$f":"IF(I10=\"\",\"\",IF(AND(G10<>\"\",H10<>\"\"),(G10-F10)*24,0))","v":""},{"$f":"IF(I10=\"\",\"\",IF(AND(I10<>\"\",J10=\"\",I10>=Personalstamm!$D$20),Personalstamm!$E$20,IF(AND(I10<>\"\",J10=\"\",I10>=Personalstamm!$D$19),Personalstamm!$E$19,IF(AND(I10<>\"\",J10<Personalstamm!$E$20,I10>=Personalstamm!$D$20),Personalstamm!$E$20-J10,IF(AND(I10<>\"\",J10<Personalstamm!E$19,I10>=Personalstamm!$D$19),Personalstamm!$E$19-J10,0)))))","v":""},{"$f":"IF(I10<>\"\",I10-K10,\"\")","v":""},{"$f":"IF(AND(S10=\"Feiertag\",T10>0),\"Feiertag\",IF(C10=\"Fehlzeit\",\"Bitte auswählen\",\"\"))","v":""},{"$f":"IF(OR(M10=\"\",M10=\"Bitte auswählen\"),\"\",IF(M10=\"Feiertag\",T10*U10,IF(M10=\"Gleittag\",0,VLOOKUP(B10,Personalstamm!$D$8:$F$14,3,FALSE))))","v":""},{"$f":"VLOOKUP(B10,Personalstamm!$D$8:$E$14,2,FALSE)","v":{"v":8,"d":"8.00"}},{"$f":"IF(AND(OR(C10=\"Anwesenheit\",C10=\"Wochenende\"),L10<>\"\"),L10-O10,IF(AND(C10=\"Fehlzeit\",N10<>\"\",W10=\"Ja\"),N10-O10,IF(W10=\"Ja\",-O10,\"\")))","v":""},{"$f":"IF(P10=\"\",B7,B7+P10)","v":{"v":0,"d":"0.00"}},null,{"$f":"IF(COUNTIF(Allgemein!$H$8:$H$45,A10)>0,\"Feiertag\",\"\")","v":""},{"$f":"IFERROR(VLOOKUP(A10,Allgemein!$H$8:$I$45,2,FALSE),\"\")","v":""},{"$f":"VLOOKUP(B10,Personalstamm!$D$8:$F$14,3,FALSE)","v":{"v":8,"d":"8.00"}},{"$f":"IF(M10=\"Gleittag\",ABS(P10),\"\")","v":""},{"$f":"IF(A10<=TODAY(),\"Ja\",\"\")","v":""}]
["2026-04-02",{"$f":"TEXT(A11,\"tttt\")","v":"Donnerstag"},{"$f":"IF(AND(S11=\"Feiertag\",T11>0),\"Fehlzeit\",IF(OR(B11=\"Samstag\",B11=\"Sonntag\"),\"Wochenende\",\"Bitte auswählen\"))","v":"Bitte auswählen"},{"$nulls":5},{"$f":"IF(AND(OR(C11=\"Anwesenheit\",C11=\"Wochenende\"),E11<>\"\",F11<>\"\",W11=\"Ja\"),((F11-E11)+(H11-G11))*24,\"\")","v":""},{"$f":"IF(I11=\"\",\"\",IF(AND(G11<>\"\",H11<>\"\"),(G11-F11)*24,0))","v":""},{"$f":"IF(I11=\"\",\"\",IF(AND(I11<>\"\",J11=\"\",I11>=Personalstamm!$D$20),Personalstamm!$E$20,IF(AND(I11<>\"\",J11=\"\",I11>=Personalstamm!$D$19),Personalstamm!$E$19,IF(AND(I11<>\"\",J11<Personalstamm!$E$20,I11>=Personalstamm!$D$20),Personalstamm!$E$20-J11,IF(AND(I11<>\"\",J11<Personalstamm!E$19,I11>=Personalstamm!$D$19),Personalstamm!$E$19-J11,0)))))","v":""},{"$f":"IF(I11<>\"\",I11-K11,\"\")","v":""},{"$f":"IF(AND(S11=\"Feiertag\",T11>0),\"Feiertag\",IF(C11=\"Fehlzeit\",\"Bitte auswählen\",\"\"))","v":""},{"$f":"IF(OR(M11=\"\",M11=\"Bitte auswählen\"),\"\",IF(M11=\"Feiertag\",T11*U11,IF(M11=\"Gleittag\",0,VLOOKUP(B11,Personalstamm!$D$8:$F$14,3,FALSE))))","v":""},{"$f":"VLOOKUP(B11,Personalstamm!$D$8:$E$14,2,FALSE)","v":{"v":8,"d":"8.00"}},{"$f":"IF(AND(OR(C11=\"Anwesenheit\",C11=\"Wochenende\"),L11<>\"\"),L11-O11,IF(AND(C11=\"Fehlzeit\",N11<>\"\",W11=\"Ja\"),N11-O11,IF(W11=\"Ja\",-O11,\"\")))","v":""},{"$f":"IF(P11=\"\",Q10,Q10+P11)","v":{"v":0,"d":"0.00"}},null,{"$f":"IF(COUNTIF(Allgemein!$H$8:$H$45,A11)>0,\"Feiertag\",\"\")","v":"Feiertag"},{"$f":"IFERROR(VLOOKUP(A11,Allgemein!$H$8:$I$45,2,FALSE),\"\")","v":{"v":0,"d":"0.00"}},{"$f":"VLOOKUP(B11,Personalstamm!$D$8:$F$14,3,FALSE)","v":{"v":8,"d":"8.00"}},{"$f":"IF(M11=\"Gleittag\",ABS(P11),\"\")","v":""},{"$f":"IF(A11<=TODAY(),\"Ja\",\"\")","v":""}]
["2026-04-03","Freitag","Fehlzeit",{"$nulls":5},"","",{"$f":"IF(I12=\"\",\"\",IF(AND(I12<>\"\",J12=\"\",I12>=Personalstamm!$D$20),Personalstamm!$E$20,IF(AND(I12<>\"\",J12=\"\",I12>=Personalstamm!$D$19),Personalstamm!$E$19,IF(AND(I12<>\"\",J12<Personalstamm!$E$20,I12>=Personalstamm!$D$20),Personalstamm!$E$20-J12,IF(AND(I12<>\"\",J12<Personalstamm!E$19,I12>=Personalstamm!$D$19),Personalstamm!$E$19-J12,0)))))","v":""},"","Feiertag",{"$f":"IF(OR(M12=\"\",M12=\"Bitte auswählen\"),\"\",IF(M12=\"Feiertag\",T12*U12,IF(M12=\"Gleittag\",0,VLOOKUP(B12,Personalstamm!$D$8:$F$14,3,FALSE))))","v":{"v":8,"d":"8.00"}},{"$f":"VLOOKUP(B12,Personalstamm!$D$8:$E$14,2,FALSE)","v":{"v":8,"d":"8.00"}},"",{"$f":"IF(P12=\"\",Q11,Q11+P12)","v":{"v":0,"d":"0.00"}},null,{"$f":"IF(COUNTIF(Allgemein!$H$8:$H$45,A12)>0,\"Feiertag\",\"\")","v":"Feiertag"},{"$f":"IFERROR(VLOOKUP(A12,Allgemein!$H$8:$I$45,2,FALSE),\"\")","v":{"v":1,"d":"1.00"}},{"$f":"VLOOKUP(B12,Personalstamm!$D$8:$F$14,3,FALSE)","v":{"v":8,"d":"8.00"}},"",""]
["2026-04-04","Samstag","Wochenende",{"$nulls":5},"","",{"$f":"IF(I13=\"\",\"\",IF(AND(I13<>\"\",J13=\"\",I13>=Personalstamm!$D$20),Personalstamm!$E$20,IF(AND(I13<>\"\",J13=\"\",I13>=Personalstamm!$D$19),Personalstamm!$E$19,IF(AND(I13<>\"\",J13<Personalstamm!$E$20,I13>=Personalstamm!$D$20),Personalstamm!$E$20-J13,IF(AND(I13<>\"\",J13<Personalstamm!E$19,I13>=Personalstamm!$D$19),Personalstamm!$E$19-J13,0)))))","v":""},"","",{"$f":"IF(OR(M13=\"\",M13=\"Bitte auswählen\"),\"\",IF(M13=\"Feiertag\",T13*U13,IF(M13=\"Gleittag\",0,VLOOKUP(B13,Personalstamm!$D$8:$F$14,3,FALSE))))","v":""},{"$f":"VLOOKUP(B13,Personalstamm!$D$8:$E$14,2,FALSE)","v":{"v":0,"d":"0.00"}},"",{"$f":"IF(P13=\"\",Q12,Q12+P13)","v":{"v":0,"d":"0.00"}},null,{"$f":"IF(COUNTIF(Allgemein!$H$8:$H$45,A13)>0,\"Feiertag\",\"\")","v":"Feiertag"},{"$f":"IFERROR(VLOOKUP(A13,Allgemein!$H$8:$I$45,2,FALSE),\"\")","v":{"v":0,"d":"0.00"}},{"$f":"VLOOKUP(B13,Personalstamm!$D$8:$F$14,3,FALSE)","v":{"v":0,"d":"0.00"}},"",""]
["2026-04-05","Sonntag","Fehlzeit",{"$nulls":5},"","",{"$f":"IF(I14=\"\",\"\",IF(AND(I14<>\"\",J14=\"\",I14>=Personalstamm!$D$20),Personalstamm!$E$20,IF(AND(I14<>\"\",J14=\"\",I14>=Personalstamm!$D$19),Personalstamm!$E$19,IF(AND(I14<>\"\",J14<Personalstamm!$E$20,I14>=Personalstamm!$D$20),Personalstamm!$E$20-J14,IF(AND(I14<>\"\",J14<Personalstamm!E$19,I14>=Personalstamm!$D$19),Personalstamm!$E$19-J14,0)))))","v":""},"","Feiertag",{"$f":"IF(OR(M14=\"\",M14=\"Bitte auswählen\"),\"\",IF(M14=\"Feiertag\",T14*U14,IF(M14=\"Gleittag\",0,VLOOKUP(B14,Personalstamm!$D$8:$F$14,3,FALSE))))","v":{"v":0,"d":"0.00"}},{"$f":"VLOOKUP(B14,Personalstamm!$D$8:$E$14,2,FALSE)","v":{"v":0,"d":"0.00"}},"",{"$f":"IF(P14=\"\",Q13,Q13+P14)","v":{"v":0,"d":"0.00"}},null,{"$f":"IF(COUNTIF(Allgemein!$H$8:$H$45,A14)>0,\"Feiertag\",\"\")","v":"Feiertag"},{"$f":"IFERROR(VLOOKUP(A14,Allgemein!$H$8:$I$45,2,FALSE),\"\")","v":{"v":1,"d":"1.00"}},{"$f":"VLOOKUP(B14,Personalstamm!$D$8:$F$14,3,FALSE)","v":{"v":0,"d":"0.00"}},"",""]
["2026-04-06","Montag","Bitte auswählen",{"$nulls":5},"","",{"$f":"IF(I15=\"\",\"\",IF(AND(I15<>\"\",J15=\"\",I15>=Personalstamm!$D$20),Personalstamm!$E$20,IF(AND(I15<>\"\",J15=\"\",I15>=Personalstamm!$D$19),Personalstamm!$E$19,IF(AND(I15<>\"\",J15<Personalstamm!$E$20,I15>=Personalstamm!$D$20),Personalstamm!$E$20-J15,IF(AND(I15<>\"\",J15<Personalstamm!E$19,I15>=Personalstamm!$D$19),Personalstamm!$E$19-J15,0)))))","v":""},"","",{"$f":"IF(OR(M15=\"\",M15=\"Bitte auswählen\"),\"\",IF(M15=\"Feiertag\",T15*U15,IF(M15=\"Gleittag\",0,VLOOKUP(B15,Personalstamm!$D$8:$F$14,3,FALSE))))","v":""},{"$f":"VLOOKUP(B15,Personalstamm!$D$8:$E$14,2,FALSE)","v":{"v":8,"d":"8.00"}},"",{"v":0,"d":"0.00"},null,{"$f":"IF(COUNTIF(Allgemein!$H$8:$H$45,A15)>0,\"Feiertag\",\"\")","v":""},{"$f":"IFERROR(VLOOKUP(A15,Allgemein!$H$8:$I$45,2,FALSE),\"\")","v":""},{"$f":"VLOOKUP(B15,Personalstamm!$D$8:$F$14,3,FALSE)","v":{"v":8,"d":"8.00"}},"",""]
["2026-04-07","Dienstag","Bitte auswählen",{"$nulls":5},"","",{"$f":"IF(I16=\"\",\"\",IF(AND(I16<>\"\",J16=\"\",I16>=Personalstamm!$D$20),Personalstamm!$E$20,IF(AND(I16<>\"\",J16=\"\",I16>=Personalstamm!$D$19),Personalstamm!$E$19,IF(AND(I16<>\"\",J16<Personalstamm!$E$20,I16>=Personalstamm!$D$20),Personalstamm!$E$20-J16,IF(AND(I16<>\"\",J16<Personalstamm!E$19,I16>=Personalstamm!$D$19),Personalstamm!$E$19-J16,0)))))","v":""},"","",{"$f":"IF(OR(M16=\"\",M16=\"Bitte auswählen\"),\"\",IF(M16=\"Feiertag\",T16*U16,IF(M16=\"Gleittag\",0,VLOOKUP(B16,Personalstamm!$D$8:$F$14,3,FALSE))))","v":""},{"$f":"VLOOKUP(B16,Personalstamm!$D$8:$E$14,2,FALSE)","v":{"v":8,"d":"8.00"}},"",{"v":0,"d":"0.00"},null,{"$f":"IF(COUNTIF(Allgemein!$H$8:$H$45,A16)>0,\"Feiertag\",\"\")","v":""},{"$f":"IFERROR(VLOOKUP(A16,Allgemein!$H$8:$I$45,2,FALSE),\"\")","v":""},{"$f":"VLOOKUP(B16,Personalstamm!$D$8:$F$14,3,FALSE)","v":{"v":8,"d":"8.00"}},"",""]
["2026-04-08","Mittwoch","Bitte auswählen",{"$nulls":5},"","",{"$f":"IF(I17=\"\",\"\",IF(AND(I17<>\"\",J17=\"\",I17>=Personalstamm!$D$20),Personalstamm!$E$20,IF(AND(I17<>\"\",J17=\"\",I17>=Personalstamm!$D$19),Personalstamm!$E$19,IF(AND(I17<>\"\",J17<Personalstamm!$E$20,I17>=Personalstamm!$D$20),Personalstamm!$E$20-J17,IF(AND(I17<>\"\",J17<Personalstamm!E$19,I17>=Personalstamm!$D$19),Personalstamm!$E$19-J17,0)))))","v":""},"","",{"$f":"IF(OR(M17=\"\",M17=\"Bitte auswählen\"),\"\",IF(M17=\"Feiertag\",T17*U17,IF(M17=\"Gleittag\",0,VLOOKUP(B17,Personalstamm!$D$8:$F$14,3,FALSE))))","v":""},{"$f":"VLOOKUP(B17,Personalstamm!$D$8:$E$14,2,FALSE)","v":{"v":8,"d":"8.00"}},"",{"v":0,"d":"0.00"},null,{"$f":"IF(COUNTIF(Allgemein!$H$8:$H$45,A17)>0,\"Feiertag\",\"\")","v":""},{"$f":"IFERROR(VLOOKUP(A17,Allgemein!$H$8:$I$45,2,FALSE),\"\")","v":""},{"$f":"VLOOKUP(B17,Personalstamm!$D$8:$F$14,3,FALSE)","v":{"v":8,"d":"8.00"}},"",""]
["2026-04-09","Donnerstag","Bitte auswählen",{"$nulls":5},"","",{"$f":"IF(I18=\"\",\"\",IF(AND(I18<>\"\",J18=\"\",I18>=Personalstamm!$D$20),Personalstamm!$E$20,IF(AND(I18<>\"\",J18=\"\",I18>=Personalstamm!$D$19),Personalstamm!$E$19,IF(AND(I18<>\"\",J18<Personalstamm!$E$20,I18>=Personalstamm!$D$20),Personalstamm!$E$20-J18,IF(AND(I18<>\"\",J18<Personalstamm!E$19,I18>=Personalstamm!$D$19),Personalstamm!$E$19-J18,0)))))","v":""},"","",{"$f":"IF(OR(M18=\"\",M18=\"Bitte auswählen\"),\"\",IF(M18=\"Feiertag\",T18*U18,IF(M18=\"Gleittag\",0,VLOOKUP(B18,Personalstamm!$D$8:$F$14,3,FALSE))))","v":""},{"$f":"VLOOKUP(B18,Personalstamm!$D$8:$E$14,2,FALSE)","v":{"v":8,"d":"8.00"}},"",{"v":0,"d":"0.00"},null,{"$f":"IF(COUNTIF(Allgemein!$H$8:$H$45,A18)>0,\"Feiertag\",\"\")","v":""},{"$f":"IFERROR(VLOOKUP(A18,Allgemein!$H$8:$I$45,2,FALSE),\"\")","v":""},{"$f":"VLOOKUP(B18,Personalstamm!$D$8:$F$14,3,FALSE)","v":{"v":8,"d":"8.00"}},"",""]
["2026-04-10","Freitag","Bitte auswählen",{"$nulls":5},"","",{"$f":"IF(I19=\"\",\"\",IF(AND(I19<>\"\",J19=\"\",I19>=Personalstamm!$D$20),Personalstamm!$E$20,IF(AND(I19<>\"\",J19=\"\",I19>=Personalstamm!$D$19),Personalstamm!$E$19,IF(AND(I19<>\"\",J19<Personalstamm!$E$20,I19>=Personalstamm!$D$20),Personalstamm!$E$20-J19,IF(AND(I19<>\"\",J19<Personalstamm!E$19,I19>=Personalstamm!$D$19),Personalstamm!$E$19-J19,0)))))","v":""},"","",{"$f":"IF(OR(M19=\"\",M19=\"Bitte auswählen\"),\"\",IF(M19=\"Feiertag\",T19*U19,IF(M19=\"Gleittag\",0,VLOOKUP(B19,Personalstamm!$D$8:$F$14,3,FALSE))))","v":""},{"$f":"VLOOKUP(B19,Personalstamm!$D$8:$E$14,2,FALSE)","v":{"v":8,"d":"8.00"}},"",{"v":0,"d":"0.00"},null,{"$f":"IF(COUNTIF(Allgemein!$H$8:$H$45,A19)>0,\"Feiertag\",\"\")","v":""},{"$f":"IFERROR(VLOOKUP(A19,Allgemein!$H$8:$I$45,2,FALSE),\"\")","v":""},{"$f":"VLOOKUP(B19,Personalstamm!$D$8:$F$14,3,FALSE)","v":{"v":8,"d":"8.00"}},"",""]
["2026-04-11","Samstag","Wochenende",{"$nulls":5},"","",{"$f":"IF(I20=\"\",\"\",IF(AND(I20<>\"\",J20=\"\",I20>=Personalstamm!$D$20),Personalstamm!$E$20,IF(AND(I20<>\"\",J20=\"\",I20>=Personalstamm!$D$19),Personalstamm!$E$19,IF(AND(I20<>\"\",J20<Personalstamm!$E$20,I20>=Personalstamm!$D$20),Personalstamm!$E$20-J20,IF(AND(I20<>\"\",J20<Personalstamm!E$19,I20>=Personalstamm!$D$19),Personalstamm!$E$19-J20,0)))))","v":""},"","",{"$f":"IF(OR(M20=\"\",M20=\"Bitte auswählen\"),\"\",IF(M20=\"Feiertag\",T20*U20,IF(M20=\"Gleittag\",0,VLOOKUP(B20,Personalstamm!$D$8:$F$14,3,FALSE))))","v":""},{"$f":"VLOOKUP(B20,Personalstamm!$D$8:$E$14,2,FALSE)","v":{"v":0,"d":"0.00"}},"",{"v":0,"d":"0.00"},null,{"$f":"IF(COUNTIF(Allgemein!$H$8:$H$45,A20)>0,\"Feiertag\",\"\")","v":""},{"$f":"IFERROR(VLOOKUP(A20,Allgemein!$H$8:$I$45,2,FALSE),\"\")","v":""},{"$f":"VLOOKUP(B20,Personalstamm!$D$8:$F$14,3,FALSE)","v":{"v":0,"d":"0.00"}},"",""]
["2026-04-12","Sonntag","Wochenende",{"$nulls":5},"","",{"$f":"IF(I21=\"\",\"\",IF(AND(I21<>\"\",J21=\"\",I21>=Personalstamm!$D$20),Personalstamm!$E$20,IF(AND(I21<>\"\",J21=\"\",I21>=Personalstamm!$D$19),Personalstamm!$E$19,IF(AND(I21<>\"\",J21<Personalstamm!$E$20,I21>=Personalstamm!$D$20),Personalstamm!$E$20-J21,IF(AND(I21<>\"\",J21<Personalstamm!E$19,I21>=Personalstamm!$D$19),Personalstamm!$E$19-J21,0)))))","v":""},"","",{"$f":"IF(OR(M21=\"\",M21=\"Bitte auswählen\"),\"\",IF(M21=\"Feiertag\",T21*U21,IF(M21=\"Gleittag\",0,VLOOKUP(B21,Personalstamm!$D$8:$F$14,3,FALSE))))","v":""},{"$f":"VLOOKUP(B21,Personalstamm!$D$8:$E$14,2,FALSE)","v":{"v":0,"d":"0.00"}},"",{"v":0,"d":"0.00"},null,{"$f":"IF(COUNTIF(Allgemein!$H$8:$H$45,A21)>0,\"Feiertag\",\"\")","v":""},{"$f":"IFERROR(VLOOKUP(A21,Allgemein!$H$8:$I$45,2,FALSE),\"\")","v":""},{"$f":"VLOOKUP(B21,Personalstamm!$D$8:$F$14,3,FALSE)","v":{"v":0,"d":"0.00"}},"",""]
["2026-04-13","Montag","Bitte auswählen",{"$nulls":5},"","",{"$f":"IF(I22=\"\",\"\",IF(AND(I22<>\"\",J22=\"\",I22>=Personalstamm!$D$20),Personalstamm!$E$20,IF(AND(I22<>\"\",J22=\"\",I22>=Personalstamm!$D$19),Personalstamm!$E$19,IF(AND(I22<>\"\",J22<Personalstamm!$E$20,I22>=Personalstamm!$D$20),Personalstamm!$E$20-J22,IF(AND(I22<>\"\",J22<Personalstamm!E$19,I22>=Personalstamm!$D$19),Personalstamm!$E$19-J22,0)))))","v":""},"","",{"$f":"IF(OR(M22=\"\",M22=\"Bitte auswählen\"),\"\",IF(M22=\"Feiertag\",T22*U22,IF(M22=\"Gleittag\",0,VLOOKUP(B22,Personalstamm!$D$8:$F$14,3,FALSE))))","v":""},{"$f":"VLOOKUP(B22,Personalstamm!$D$8:$E$14,2,FALSE)","v":{"v":8,"d":"8.00"}},"",{"v":0,"d":"0.00"},null,{"$f":"IF(COUNTIF(Allgemein!$H$8:$H$45,A22)>0,\"Feiertag\",\"\")","v":""},{"$f":"IFERROR(VLOOKUP(A22,Allgemein!$H$8:$I$45,2,FALSE),\"\")","v":""},{"$f":"VLOOKUP(B22,Personalstamm!$D$8:$F$14,3,FALSE)","v":{"v":8,"d":"8.00"}},"",""]
["2026-04-14","Dienstag","Bitte auswählen",{"$nulls":5},"","",{"$f":"IF(I23=\"\",\"\",IF(AND(I23<>\"\",J23=\"\",I23>=Personalstamm!$D$20),Personalstamm!$E$20,IF(AND(I23<>\"\",J23=\"\",I23>=Personalstamm!$D$19),Personalstamm!$E$19,IF(AND(I23<>\"\",J23<Personalstamm!$E$20,I23>=Personalstamm!$D$20),Personalstamm!$E$20-J23,IF(AND(I23<>\"\",J23<Personalstamm!E$19,I23>=Personalstamm!$D$19),Personalstamm!$E$19-J23,0)))))","v":""},"","",{"$f":"IF(OR(M23=\"\",M23=\"Bitte auswählen\"),\"\",IF(M23=\"Feiertag\",T23*U23,IF(M23=\"Gleittag\",0,VLOOKUP(B23,Personalstamm!$D$8:$F$14,3,FALSE))))","v":""},{"$f":"VLOOKUP(B23,Personalstamm!$D$8:$E$14,2,FALSE)","v":{"v":8,"d":"8.00"}},"",{"v":0,"d":"0.00"},null,{"$f":"IF(COUNTIF(Allgemein!$H$8:$H$45,A23)>0,\"Feiertag\",\"\")","v":""},{"$f":"IFERROR(VLOOKUP(A23,Allgemein!$H$8:$I$45,2,FALSE),\"\")","v":""},{"$f":"VLOOKUP(B23,Personalstamm!$D$8:$F$14,3,FALSE)","v":{"v":8,"d":"8.00"}},"",""]
["2026-04-15","Mittwoch","Bitte auswählen",{"$nulls":5},"","",{"$f":"IF(I24=\"\",\"\",IF(AND(I24<>\"\",J24=\"\",I24>=Personalstamm!$D$20),Personalstamm!$E$20,IF(AND(I24<>\"\",J24=\"\",I24>=Personalstamm!$D$19),Personalstamm!$E$19,IF(AND(I24<>\"\",J24<Personalstamm!$E$20,I24>=Personalstamm!$D$20),Personalstamm!$E$20-J24,IF(AND(I24<>\"\",J24<Personalstamm!E$19,I24>=Personalstamm!$D$19),Personalstamm!$E$19-J24,0)))))","v":""},"","",{"$f":"IF(OR(M24=\"\",M24=\"Bitte auswählen\"),\"\",IF(M24=\"Feiertag\",T24*U24,IF(M24=\"Gleittag\",0,VLOOKUP(B24,Personalstamm!$D$8:$F$14,3,FALSE))))","v":""},{"$f":"VLOOKUP(B24,Personalstamm!$D$8:$E$14,2,FALSE)","v":{"v":8,"d":"8.00"}},"",{"v":0,"d":"0.00"},null,{"$f":"IF(COUNTIF(Allgemein!$H$8:$H$45,A24)>0,\"Feiertag\",\"\")","v":""},{"$f":"IFERROR(VLOOKUP(A24,Allgemein!$H$8:$I$45,2,FALSE),\"\")","v":""},{"$f":"VLOOKUP(B24,Personalstamm!$D$8:$F$14,3,FALSE)","v":{"v":8,"d":"8.00"}},"",""]
["2026-04-16","Donnerstag","Bitte auswählen",{"$nulls":5},"","",{"$f":"IF(I25=\"\",\"\",IF(AND(I25<>\"\",J25=\"\",I25>=Personalstamm!$D$20),Personalstamm!$E$20,IF(AND(I25<>\"\",J25=\"\",I25>=Personalstamm!$D$19),Personalstamm!$E$19,IF(AND(I25<>\"\",J25<Personalstamm!$E$20,I25>=Personalstamm!$D$20),Personalstamm!$E$20-J25,IF(AND(I25<>\"\",J25<Personalstamm!E$19,I25>=Personalstamm!$D$19),Personalstamm!$E$19-J25,0)))))","v":""},"","",{"$f":"IF(OR(M25=\"\",M25=\"Bitte auswählen\"),\"\",IF(M25=\"Feiertag\",T25*U25,IF(M25=\"Gleittag\",0,VLOOKUP(B25,Personalstamm!$D$8:$F$14,3,FALSE))))","v":""},{"$f":"VLOOKUP(B25,Personalstamm!$D$8:$E$14,2,FALSE)","v":{"v":8,"d":"8.00"}},"",{"v":0,"d":"0.00"},null,{"$f":"IF(COUNTIF(Allgemein!$H$8:$H$45,A25)>0,\"Feiertag\",\"\")","v":""},{"$f":"IFERROR(VLOOKUP(A25,Allgemein!$H$8:$I$45,2,FALSE),\"\")","v":""},{"$f":"VLOOKUP(B25,Personalstamm!$D$8:$F$14,3,FALSE)","v":{"v":8,"d":"8.00"}},"",""]
["2026-04-17","Freitag","Bitte auswählen",{"$nulls":5},"","",{"$f":"IF(I26=\"\",\"\",IF(AND(I26<>\"\",J26=\"\",I26>=Personalstamm!$D$20),Personalstamm!$E$20,IF(AND(I26<>\"\",J26=\"\",I26>=Personalstamm!$D$19),Personalstamm!$E$19,IF(AND(I26<>\"\",J26<Personalstamm!$E$20,I26>=Personalstamm!$D$20),Personalstamm!$E$20-J26,IF(AND(I26<>\"\",J26<Personalstamm!E$19,I26>=Personalstamm!$D$19),Personalstamm!$E$19-J26,0)))))","v":""},"","",{"$f":"IF(OR(M26=\"\",M26=\"Bitte auswählen\"),\"\",IF(M26=\"Feiertag\",T26*U26,IF(M26=\"Gleittag\",0,VLOOKUP(B26,Personalstamm!$D$8:$F$14,3,FALSE))))","v":""},{"$f":"VLOOKUP(B26,Personalstamm!$D$8:$E$14,2,FALSE)","v":{"v":8,"d":"8.00"}},"",{"v":0,"d":"0.00"},null,{"$f":"IF(COUNTIF(Allgemein!$H$8:$H$45,A26)>0,\"Feiertag\",\"\")","v":""},{"$f":"IFERROR(VLOOKUP(A26,Allgemein!$H$8:$I$45,2,FALSE),\"\")","v":""},{"$f":"VLOOKUP(B26,Personalstamm!$D$8:$F$14,3,FALSE)","v":{"v":8,"d":"8.00"}},"",""]
["2026-04-18","Samstag","Wochenende",{"$nulls":5},"","",{"$f":"IF(I27=\"\",\"\",IF(AND(I27<>\"\",J27=\"\",I27>=Personalstamm!$D$20),Personalstamm!$E$20,IF(AND(I27<>\"\",J27=\"\",I27>=Personalstamm!$D$19),Personalstamm!$E$19,IF(AND(I27<>\"\",J27<Personalstamm!$E$20,I27>=Personalstamm!$D$20),Personalstamm!$E$20-J27,IF(AND(I27<>\"\",J27<Personalstamm!E$19,I27>=Personalstamm!$D$19),Personalstamm!$E$19-J27,0)))))","v":""},"","",{"$f":"IF(OR(M27=\"\",M27=\"Bitte auswählen\"),\"\",IF(M27=\"Feiertag\",T27*U27,IF(M27=\"Gleittag\",0,VLOOKUP(B27,Personalstamm!$D$8:$F$14,3,FALSE))))","v":""},{"$f":"VLOOKUP(B27,Personalstamm!$D$8:$E$14,2,FALSE)","v":{"v":0,"d":"0.00"}},"",{"v":0,"d":"0.00"},null,{"$f":"IF(COUNTIF(Allgemein!$H$8:$H$45,A27)>0,\"Feiertag\",\"\")","v":""},{"$f":"IFERROR(VLOOKUP(A27,Allgemein!$H$8:$I$45,2,FALSE),\"\")","v":""},{"$f":"VLOOKUP(B27,Personalstamm!$D$8:$F$14,3,FALSE)","v":{"v":0,"d":"0.00"}},"",""]
["2026-04-19","Sonntag","Wochenende",{"$nulls":5},"","",{"$f":"IF(I28=\"\",\"\",IF(AND(I28<>\"\",J28=\"\",I28>=Personalstamm!$D$20),Personalstamm!$E$20,IF(AND(I28<>\"\",J28=\"\",I28>=Personalstamm!$D$19),Personalstamm!$E$19,IF(AND(I28<>\"\",J28<Personalstamm!$E$20,I28>=Personalstamm!$D$20),Personalstamm!$E$20-J28,IF(AND(I28<>\"\",J28<Personalstamm!E$19,I28>=Personalstamm!$D$19),Personalstamm!$E$19-J28,0)))))","v":""},"","",{"$f":"IF(OR(M28=\"\",M28=\"Bitte auswählen\"),\"\",IF(M28=\"Feiertag\",T28*U28,IF(M28=\"Gleittag\",0,VLOOKUP(B28,Personalstamm!$D$8:$F$14,3,FALSE))))","v":""},{"$f":"VLOOKUP(B28,Personalstamm!$D$8:$E$14,2,FALSE)","v":{"v":0,"d":"0.00"}},"",{"v":0,"d":"0.00"},null,{"$f":"IF(COUNTIF(Allgemein!$H$8:$H$45,A28)>0,\"Feiertag\",\"\")","v":""},{"$f":"IFERROR(VLOOKUP(A28,Allgemein!$H$8:$I$45,2,FALSE),\"\")","v":""},{"$f":"VLOOKUP(B28,Personalstamm!$D$8:$F$14,3,FALSE)","v":{"v":0,"d":"0.00"}},"",""]
["2026-04-20","Montag","Bitte auswählen",{"$nulls":5},"","",{"$f":"IF(I29=\"\",\"\",IF(AND(I29<>\"\",J29=\"\",I29>=Personalstamm!$D$20),Personalstamm!$E$20,IF(AND(I29<>\"\",J29=\"\",I29>=Personalstamm!$D$19),Personalstamm!$E$19,IF(AND(I29<>\"\",J29<Personalstamm!$E$20,I29>=Personalstamm!$D$20),Personalstamm!$E$20-J29,IF(AND(I29<>\"\",J29<Personalstamm!E$19,I29>=Personalstamm!$D$19),Personalstamm!$E$19-J29,0)))))","v":""},"","",{"$f":"IF(OR(M29=\"\",M29=\"Bitte auswählen\"),\"\",IF(M29=\"Feiertag\",T29*U29,IF(M29=\"Gleittag\",0,VLOOKUP(B29,Personalstamm!$D$8:$F$14,3,FALSE))))","v":""},{"$f":"VLOOKUP(B29,Personalstamm!$D$8:$E$14,2,FALSE)","v":{"v":8,"d":"8.00"}},"",{"v":0,"d":"0.00"},null,{"$f":"IF(COUNTIF(Allgemein!$H$8:$H$45,A29)>0,\"Feiertag\",\"\")","v":""},{"$f":"IFERROR(VLOOKUP(A29,Allgemein!$H$8:$I$45,2,FALSE),\"\")","v":""},{"$f":"VLOOKUP(B29,Personalstamm!$D$8:$F$14,3,FALSE)","v":{"v":8,"d":"8.00"}},"",""]
["2026-04-21","Dienstag","Bitte auswählen",{"$nulls":5},"","",{"$f":"IF(I30=\"\",\"\",IF(AND(I30<>\"\",J30=\"\",I30>=Personalstamm!$D$20),Personalstamm!$E$20,IF(AND(I30<>\"\",J30=\"\",I30>=Personalstamm!$D$19),Personalstamm!$E$19,IF(AND(I30<>\"\",J30<Personalstamm!$E$20,I30>=Personalstamm!$D$20),Personalstamm!$E$20-J30,IF(AND(I30<>\"\",J30<Personalstamm!E$19,I30>=Personalstamm!$D$19),Personalstamm!$E$19-J30,0)))))","v":""},"","",{"$f":"IF(OR(M30=\"\",M30=\"Bitte auswählen\"),\"\",IF(M30=\"Feiertag\",T30*U30,IF(M30=\"Gleittag\",0,VLOOKUP(B30,Personalstamm!$D$8:$F$14,3,FALSE))))","v":""},{"$f":"VLOOKUP(B30,Personalstamm!$D$8:$E$14,2,FALSE)","v":{"v":8,"d":"8.00"}},"",{"v":0,"d":"0.00"},null,{"$f":"IF(COUNTIF(Allgemein!$H$8:$H$45,A30)>0,\"Feiertag\",\"\")","v":""},{"$f":"IFERROR(VLOOKUP(A30,Allgemein!$H$8:$I$45,2,FALSE),\"\")","v":""},{"$f":"VLOOKUP(B30,Personalstamm!$D$8:$F$14,3,FALSE)","v":{"v":8,"d":"8.00"}},"",""]
["2026-04-22","Mittwoch","Bitte auswählen",{"$nulls":5},"","",{"$f":"IF(I31=\"\",\"\",IF(AND(I31<>\"\",J31=\"\",I31>=Personalstamm!$D$20),Personalstamm!$E$20,IF(AND(I31<>\"\",J31=\"\",I31>=Personalstamm!$D$19),Personalstamm!$E$19,IF(AND(I31<>\"\",J31<Personalstamm!$E$20,I31>=Personalstamm!$D$20),Personalstamm!$E$20-J31,IF(AND(I31<>\"\",J31<Personalstamm!E$19,I31>=Personalstamm!$D$19),Personalstamm!$E$19-J31,0)))))","v":""},"","",{"$f":"IF(OR(M31=\"\",M31=\"Bitte auswählen\"),\"\",IF(M31=\"Feiertag\",T31*U31,IF(M31=\"Gleittag\",0,VLOOKUP(B31,Personalstamm!$D$8:$F$14,3,FALSE))))","v":""},{"$f":"VLOOKUP(B31,Personalstamm!$D$8:$E$14,2,FALSE)","v":{"v":8,"d":"8.00"}},"",{"v":0,"d":"0.00"},null,{"$f":"IF(COUNTIF(Allgemein!$H$8:$H$45,A31)>0,\"Feiertag\",\"\")","v":""},{"$f":"IFERROR(VLOOKUP(A31,Allgemein!$H$8:$I$45,2,FALSE),\"\")","v":""},{"$f":"VLOOKUP(B31,Personalstamm!$D$8:$F$14,3,FALSE)","v":{"v":8,"d":"8.00"}},"",""]
["2026-04-23","Donnerstag","Bitte auswählen",{"$nulls":5},"","",{"$f":"IF(I32=\"\",\"\",IF(AND(I32<>\"\",J32=\"\",I32>=Personalstamm!$D$20),Personalstamm!$E$20,IF(AND(I32<>\"\",J32=\"\",I32>=Personalstamm!$D$19),Personalstamm!$E$19,IF(AND(I32<>\"\",J32<Personalstamm!$E$20,I32>=Personalstamm!$D$20),Personalstamm!$E$20-J32,IF(AND(I32<>\"\",J32<Personalstamm!E$19,I32>=Personalstamm!$D$19),Personalstamm!$E$19-J32,0)))))","v":""},"","",{"$f":"IF(OR(M32=\"\",M32=\"Bitte auswählen\"),\"\",IF(M32=\"Feiertag\",T32*U32,IF(M32=\"Gleittag\",0,VLOOKUP(B32,Personalstamm!$D$8:$F$14,3,FALSE))))","v":""},{"$f":"VLOOKUP(B32,Personalstamm!$D$8:$E$14,2,FALSE)","v":{"v":8,"d":"8.00"}},"",{"v":0,"d":"0.00"},null,{"$f":"IF(COUNTIF(Allgemein!$H$8:$H$45,A32)>0,\"Feiertag\",\"\")","v":""},{"$f":"IFERROR(VLOOKUP(A32,Allgemein!$H$8:$I$45,2,FALSE),\"\")","v":""},{"$f":"VLOOKUP(B32,Personalstamm!$D$8:$F$14,3,FALSE)","v":{"v":8,"d":"8.00"}},"",""]
["2026-04-24","Freitag","Bitte auswählen",{"$nulls":5},"","",{"$f":"IF(I33=\"\",\"\",IF(AND(I33<>\"\",J33=\"\",I33>=Personalstamm!$D$20),Personalstamm!$E$20,IF(AND(I33<>\"\",J33=\"\",I33>=Personalstamm!$D$19),Personalstamm!$E$19,IF(AND(I33<>\"\",J33<Personalstamm!$E$20,I33>=Personalstamm!$D$20),Personalstamm!$E$20-J33,IF(AND(I33<>\"\",J33<Personalstamm!E$19,I33>=Personalstamm!$D$19),Personalstamm!$E$19-J33,0)))))","v":""},"","",{"$f":"IF(OR(M33=\"\",M33=\"Bitte auswählen\"),\"\",IF(M33=\"Feiertag\",T33*U33,IF(M33=\"Gleittag\",0,VLOOKUP(B33,Personalstamm!$D$8:$F$14,3,FALSE))))","v":""},{"$f":"VLOOKUP(B33,Personalstamm!$D$8:$E$14,2,FALSE)","v":{"v":8,"d":"8.00"}},"",{"v":0,"d":"0.00"},null,{"$f":"IF(COUNTIF(Allgemein!$H$8:$H$45,A33)>0,\"Feiertag\",\"\")","v":""},{"$f":"IFERROR(VLOOKUP(A33,Allgemein!$H$8:$I$45,2,FALSE),\"\")","v":""},{"$f":"VLOOKUP(B33,Personalstamm!$D$8:$F$14,3,FALSE)","v":{"v":8,"d":"8.00"}},"",""]
["2026-04-25","Samstag","Wochenende",{"$nulls":5},"","",{"$f":"IF(I34=\"\",\"\",IF(AND(I34<>\"\",J34=\"\",I34>=Personalstamm!$D$20),Personalstamm!$E$20,IF(AND(I34<>\"\",J34=\"\",I34>=Personalstamm!$D$19),Personalstamm!$E$19,IF(AND(I34<>\"\",J34<Personalstamm!$E$20,I34>=Personalstamm!$D$20),Personalstamm!$E$20-J34,IF(AND(I34<>\"\",J34<Personalstamm!E$19,I34>=Personalstamm!$D$19),Personalstamm!$E$19-J34,0)))))","v":""},"","",{"$f":"IF(OR(M34=\"\",M34=\"Bitte auswählen\"),\"\",IF(M34=\"Feiertag\",T34*U34,IF(M34=\"Gleittag\",0,VLOOKUP(B34,Personalstamm!$D$8:$F$14,3,FALSE))))","v":""},{"$f":"VLOOKUP(B34,Personalstamm!$D$8:$E$14,2,FALSE)","v":{"v":0,"d":"0.00"}},"",{"v":0,"d":"0.00"},null,{"$f":"IF(COUNTIF(Allgemein!$H$8:$H$45,A34)>0,\"Feiertag\",\"\")","v":""},{"$f":"IFERROR(VLOOKUP(A34,Allgemein!$H$8:$I$45,2,FALSE),\"\")","v":""},{"$f":"VLOOKUP(B34,Personalstamm!$D$8:$F$14,3,FALSE)","v":{"v":0,"d":"0.00"}},"",""]
["2026-04-26","Sonntag","Wochenende",{"$nulls":5},"","",{"$f":"IF(I35=\"\",\"\",IF(AND(I35<>\"\",J35=\"\",I35>=Personalstamm!$D$20),Personalstamm!$E$20,IF(AND(I35<>\"\",J35=\"\",I35>=Personalstamm!$D$19),Personalstamm!$E$19,IF(AND(I35<>\"\",J35<Personalstamm!$E$20,I35>=Personalstamm!$D$20),Personalstamm!$E$20-J35,IF(AND(I35<>\"\",J35<Personalstamm!E$19,I35>=Personalstamm!$D$19),Personalstamm!$E$19-J35,0)))))","v":""},"","",{"$f":"IF(OR(M35=\"\",M35=\"Bitte auswählen\"),\"\",IF(M35=\"Feiertag\",T35*U35,IF(M35=\"Gleittag\",0,VLOOKUP(B35,Personalstamm!$D$8:$F$14,3,FALSE))))","v":""},{"$f":"VLOOKUP(B35,Personalstamm!$D$8:$E$14,2,FALSE)","v":{"v":0,"d":"0.00"}},"",{"v":0,"d":"0.00"},null,{"$f":"IF(COUNTIF(Allgemein!$H$8:$H$45,A35)>0,\"Feiertag\",\"\")","v":""},{"$f":"IFERROR(VLOOKUP(A35,Allgemein!$H$8:$I$45,2,FALSE),\"\")","v":""},{"$f":"VLOOKUP(B35,Personalstamm!$D$8:$F$14,3,FALSE)","v":{"v":0,"d":"0.00"}},"",""]
["2026-04-27","Montag","Bitte auswählen",{"$nulls":5},"","",{"$f":"IF(I36=\"\",\"\",IF(AND(I36<>\"\",J36=\"\",I36>=Personalstamm!$D$20),Personalstamm!$E$20,IF(AND(I36<>\"\",J36=\"\",I36>=Personalstamm!$D$19),Personalstamm!$E$19,IF(AND(I36<>\"\",J36<Personalstamm!$E$20,I36>=Personalstamm!$D$20),Personalstamm!$E$20-J36,IF(AND(I36<>\"\",J36<Personalstamm!E$19,I36>=Personalstamm!$D$19),Personalstamm!$E$19-J36,0)))))","v":""},"","",{"$f":"IF(OR(M36=\"\",M36=\"Bitte auswählen\"),\"\",IF(M36=\"Feiertag\",T36*U36,IF(M36=\"Gleittag\",0,VLOOKUP(B36,Personalstamm!$D$8:$F$14,3,FALSE))))","v":""},{"$f":"VLOOKUP(B36,Personalstamm!$D$8:$E$14,2,FALSE)","v":{"v":8,"d":"8.00"}},"",{"v":0,"d":"0.00"},null,{"$f":"IF(COUNTIF(Allgemein!$H$8:$H$45,A36)>0,\"Feiertag\",\"\")","v":""},{"$f":"IFERROR(VLOOKUP(A36,Allgemein!$H$8:$I$45,2,FALSE),\"\")","v":""},{"$f":"VLOOKUP(B36,Personalstamm!$D$8:$F$14,3,FALSE)","v":{"v":8,"d":"8.00"}},"",""]
["2026-04-28","Dienstag","Bitte auswählen",{"$nulls":5},"","",{"$f":"IF(I37=\"\",\"\",IF(AND(I37<>\"\",J37=\"\",I37>=Personalstamm!$D$20),Personalstamm!$E$20,IF(AND(I37<>\"\",J37=\"\",I37>=Personalstamm!$D$19),Personalstamm!$E$19,IF(AND(I37<>\"\",J37<Personalstamm!$E$20,I37>=Personalstamm!$D$20),Personalstamm!$E$20-J37,IF(AND(I37<>\"\",J37<Personalstamm!E$19,I37>=Personalstamm!$D$19),Personalstamm!$E$19-J37,0)))))","v":""},"","",{"$f":"IF(OR(M37=\"\",M37=\"Bitte auswählen\"),\"\",IF(M37=\"Feiertag\",T37*U37,IF(M37=\"Gleittag\",0,VLOOKUP(B37,Personalstamm!$D$8:$F$14,3,FALSE))))","v":""},{"$f":"VLOOKUP(B37,Personalstamm!$D$8:$E$14,2,FALSE)","v":{"v":8,"d":"8.00"}},"",{"v":0,"d":"0.00"},null,{"$f":"IF(COUNTIF(Allgemein!$H$8:$H$45,A37)>0,\"Feiertag\",\"\")","v":""},{"$f":"IFERROR(VLOOKUP(A37,Allgemein!$H$8:$I$45,2,FALSE),\"\")","v":""},{"$f":"VLOOKUP(B37,Personalstamm!$D$8:$F$14,3,FALSE)","v":{"v":8,"d":"8.00"}},"",""]
["2026-04-29","Mittwoch","Bitte auswählen",{"$nulls":5},"","",{"$f":"IF(I38=\"\",\"\",IF(AND(I38<>\"\",J38=\"\",I38>=Personalstamm!$D$20),Personalstamm!$E$20,IF(AND(I38<>\"\",J38=\"\",I38>=Personalstamm!$D$19),Personalstamm!$E$19,IF(AND(I38<>\"\",J38<Personalstamm!$E$20,I38>=Personalstamm!$D$20),Personalstamm!$E$20-J38,IF(AND(I38<>\"\",J38<Personalstamm!E$19,I38>=Personalstamm!$D$19),Personalstamm!$E$19-J38,0)))))","v":""},"","",{"$f":"IF(OR(M38=\"\",M38=\"Bitte auswählen\"),\"\",IF(M38=\"Feiertag\",T38*U38,IF(M38=\"Gleittag\",0,VLOOKUP(B38,Personalstamm!$D$8:$F$14,3,FALSE))))","v":""},{"$f":"VLOOKUP(B38,Personalstamm!$D$8:$E$14,2,FALSE)","v":{"v":8,"d":"8.00"}},"",{"v":0,"d":"0.00"},null,{"$f":"IF(COUNTIF(Allgemein!$H$8:$H$45,A38)>0,\"Feiertag\",\"\")","v":""},{"$f":"IFERROR(VLOOKUP(A38,Allgemein!$H$8:$I$45,2,FALSE),\"\")","v":""},{"$f":"VLOOKUP(B38,Personalstamm!$D$8:$F$14,3,FALSE)","v":{"v":8,"d":"8.00"}},"",""]
["2026-04-30","Donnerstag","Bitte auswählen",{"$nulls":5},"","",{"$f":"IF(I39=\"\",\"\",IF(AND(I39<>\"\",J39=\"\",I39>=Personalstamm!$D$20),Personalstamm!$E$20,IF(AND(I39<>\"\",J39=\"\",I39>=Personalstamm!$D$19),Personalstamm!$E$19,IF(AND(I39<>\"\",J39<Personalstamm!$E$20,I39>=Personalstamm!$D$20),Personalstamm!$E$20-J39,IF(AND(I39<>\"\",J39<Personalstamm!E$19,I39>=Personalstamm!$D$19),Personalstamm!$E$19-J39,0)))))","v":""},"","",{"$f":"IF(OR(M39=\"\",M39=\"Bitte auswählen\"),\"\",IF(M39=\"Feiertag\",T39*U39,IF(M39=\"Gleittag\",0,VLOOKUP(B39,Personalstamm!$D$8:$F$14,3,FALSE))))","v":""},{"$f":"VLOOKUP(B39,Personalstamm!$D$8:$E$14,2,FALSE)","v":{"v":8,"d":"8.00"}},"",{"v":0,"d":"0.00"},null,{"$f":"IF(COUNTIF(Allgemein!$H$8:$H$45,A39)>0,\"Feiertag\",\"\")","v":"Feiertag"},{"$f":"IFERROR(VLOOKUP(A39,Allgemein!$H$8:$I$45,2,FALSE),\"\")","v":{"v":0,"d":"0.00"}},{"$f":"VLOOKUP(B39,Personalstamm!$D$8:$F$14,3,FALSE)","v":{"v":8,"d":"8.00"}},"",""]
["Summe",{"$nulls":7},{"$f":"SUM(I10:I39)","v":{"v":0,"d":"0.00"}},{"$f":"SUM(J10:J39)","v":{"v":0,"d":"0.00"}},{"$f":"SUM(K10:K39)","v":{"v":0,"d":"0.00"}},{"$f":"SUM(L10:L39)","v":{"v":0,"d":"0.00"}},null,{"$f":"SUM(N10:N39)","v":{"v":8,"d":"8.00"}},{"$f":"SUM(O10:O39)","v":{"v":176,"d":"176.00"}},{"$f":"SUM(P10:P39)","v":{"v":0,"d":"0.00"}}]
[]
["Art","Anzahl Tage",null,"Fehlzeitenart","Anzahl Tage","Anzahl Stunden",null,"Urlaub genommen","Urlaub geplant"]
["Monat",{"$f":"COUNTIF($C$10:$C$39,\"*\")","v":{"v":30,"d":"30.00"}},null,"Urlaub",{"$f":"COUNTIF($M$10:$M$39,Allgemein!$I$50)","v":{"v":0,"d":"0.00"}},{"$f":"SUMIF($M$10:$M$39,Allgemein!$I$50,$N$10:$N$39)","v":{"v":0,"d":"0.00"}},null,{"$f":"COUNTIFS($A$10:$A$39,\"<\"&TODAY(),$M$10:$M$39,\"Urlaub\")","v":{"v":0,"d":"0.00"}},{"$f":"COUNTIFS($A$10:$A$39,\">=\"&TODAY(),$M$10:$M$39,\"Urlaub\")","v":{"v":0,"d":"0.00"}}]
["Anwesenheit",{"$f":"COUNTIF($C$10:$C$39,Allgemein!$G$50)","v":{"v":0,"d":"0.00"}},null,"Krankheit",{"$f":"COUNTIF($M$10:$M$39,Allgemein!$I$51)","v":{"v":0,"d":"0.00"}},{"$f":"SUMIF($M$10:$M$39,Allgemein!$I$51,$N$10:$N$39)","v":{"v":0,"d":"0.00"}}]
["Fehlzeit",{"$f":"COUNTIF($C$10:$C$39,Allgemein!$G$51)","v":{"v":2,"d":"2.00"}},null,"Kurzarbeit",{"$f":"COUNTIF($M$10:$M$39,Allgemein!$I$52)","v":{"v":0,"d":"0.00"}},{"$f":"SUMIF($M$10:$M$39,Allgemein!$I$52,$N$10:$N$39)","v":{"v":0,"d":"0.00"}}]
["Wochenende",{"$f":"COUNTIF($C$10:$C$39,Allgemein!$G$52)","v":{"v":7,"d":"7.00"}},null,"Mutterschutz",{"$f":"COUNTIF($M$10:$M$39,Allgemein!$I$53)","v":{"v":0,"d":"0.00"}},{"$f":"SUMIF($M$10:$M$39,Allgemein!$I$53,$N$10:$N$39)","v":{"v":0,"d":"0.00"}}]
["Undefiniert",{"$f":"COUNTIF($C$10:$C$39,Allgemein!$G$49)","v":{"v":21,"d":"21.00"}},null,"Fortbildung",{"$f":"COUNTIF($M$10:$M$39,Allgemein!$I$54)","v":{"v":0,"d":"0.00"}},{"$f":"SUMIF($M$10:$M$39,Allgemein!$I$54,$N$10:$N$39)","v":{"v":0,"d":"0.00"}}]
[{"$nulls":3},"Elternzeit",{"$f":"COUNTIF($M$10:$M$39,Allgemein!$I$55)","v":{"v":0,"d":"0.00"}},{"$f":"SUMIF($M$10:$M$39,Allgemein!$I$55,$N$10:$N$39)","v":{"v":0,"d":"0.00"}}]
[{"$nulls":3},"Gleittag",{"$f":"COUNTIF($M$10:$M$39,Allgemein!$I$56)","v":{"v":0,"d":"0.00"}},{"$f":"SUMIF($M$10:$M$39,Allgemein!$I$56,$V$10:$V$39)","v":{"v":0,"d":"0.00"}}]
[{"$nulls":3},"Schule",{"$f":"COUNTIF($M$10:$M$39,Allgemein!$I$57)","v":{"v":0,"d":"0.00"}},{"$f":"SUMIF($M$10:$M$39,Allgemein!$I$57,$N$10:$N$39)","v":{"v":0,"d":"0.00"}}]
[{"$nulls":3},"Feiertag",{"$f":"COUNTIF($M$10:$M$39,Allgemein!$I$58)","v":{"v":2,"d":"2.00"}},{"$f":"SUMIF($M$10:$M$39,Allgemein!$I$58,$N$10:$N$39)","v":{"v":8,"d":"8.00"}}]
[{"$nulls":3},"Undefiniert",{"$f":"COUNTIF($M$10:$M$39,Allgemein!$I$49)","v":{"v":0,"d":"0.00"}},{"$f":"SUMIF($M$10:$M$39,Allgemein!$I$49,$N$10:$N$39)","v":{"v":0,"d":"0.00"}}]

{"sheet":"Mai","index":9,"n_rows":53,"n_cols":23,"rows_kept":53}
[]
[]
[]
[]
[]
["Urlaubsvortrag",{"$f":"Apr.!$F$6","v":{"v":30,"d":"30.00"}},"Urlaub genommen",{"$f":"$H$44","v":{"v":0,"d":"0.00"}},"Resturlaub",{"$f":"$B$6-$D$6","v":{"v":30,"d":"30.00"}}]
["Saldovortrag",{"$f":"Apr.!$F$7","v":{"v":0,"d":"0.00"}},"Saldoänderung",{"$f":"$P$41","v":{"v":0,"d":"0.00"}},"Kumulierter Saldo",{"$f":"$B$7+$D$7","v":{"v":0,"d":"0.00"}}]
[]
["Datum","Wochentag","Art","Arbeitsort","Von Uhrzeit","Bis Uhrzeit","Von Uhrzeit","Bis Uhrzeit","Bruttoarbeitszeit","Geb. Pause","Mindestpause","Nettoarbeitszeit","Fehlzeitenart","Fehlstunden","Sollstunden","Tagessaldo","Kumulierter Saldo",null,"Feiertag","Feiertag Anteil Tag","FZ-Gutschrift","Gleittag","Ausgewertet"]
["2026-05-01",{"$f":"TEXT(A10,\"tttt\")","v":"Freitag"},{"$f":"IF(AND(S10=\"Feiertag\",T10>0),\"Fehlzeit\",IF(OR(B10=\"Samstag\",B10=\"Sonntag\"),\"Wochenende\",\"Bitte auswählen\"))","v":"Fehlzeit"},{"$nulls":5},{"$f":"IF(AND(OR(C10=\"Anwesenheit\",C10=\"Wochenende\"),E10<>\"\",F10<>\"\",W10=\"Ja\"),((F10-E10)+(H10-G10))*24,\"\")","v":""},{"$f":"IF(I10=\"\",\"\",IF(AND(G10<>\"\",H10<>\"\"),(G10-F10)*24,0))","v":""},{"$f":"IF(I10=\"\",\"\",IF(AND(I10<>\"\",J10=\"\",I10>=Personalstamm!$D$20),Personalstamm!$E$20,IF(AND(I10<>\"\",J10=\"\",I10>=Personalstamm!$D$19),Personalstamm!$E$19,IF(AND(I10<>\"\",J10<Personalstamm!$E$20,I10>=Personalstamm!$D$20),Personalstamm!$E$20-J10,IF(AND(I10<>\"\",J10<Personalstamm!E$19,I10>=Personalstamm!$D$19),Personalstamm!$E$19-J10,0)))))","v":""},{"$f":"IF(I10<>\"\",I10-K10,\"\")","v":""},{"$f":"IF(AND(S10=\"Feiertag\",T10>0),\"Feiertag\",IF(C10=\"Fehlzeit\",\"Bitte auswählen\",\"\"))","v":"Feiertag"},{"$f":"IF(OR(M10=\"\",M10=\"Bitte auswählen\"),\"\",IF(M10=\"Feiertag\",T10*U10,IF(M10=\"Gleittag\",0,VLOOKUP(B10,Personalstamm!$D$8:$F$14,3,FALSE))))","v":{"v":8,"d":"8.00"}},{"$f":"VLOOKUP(B10,Personalstamm!$D$8:$E$14,2,FALSE)","v":{"v":8,"d":"8.00"}},{"$f":"IF(AND(OR(C10=\"Anwesenheit\",C10=\"Wochenende\"),L10<>\"\"),L10-O10,IF(AND(C10=\"Fehlzeit\",N10<>\"\",W10=\"Ja\"),N10-O10,IF(W10=\"Ja\",-O10,\"\")))","v":""},{"$f":"IF(P10=\"\",B7,B7+P10)","v":{"v":0,"d":"0.00"}},null,{"$f":"IF(COUNTIF(Allgemein!$H$8:$H$45,A10)>0,\"Feiertag\",\"\")","v":"Feiertag"},{"$f":"IFERROR(VLOOKUP(A10,Allgemein!$H$8:$I$45,2,FALSE),\"\")","v":{"v":1,"d":"1.00"}},{"$f":"VLOOKUP(B10,Personalstamm!$D$8:$F$14,3,FALSE)","v":{"v":8,"d":"8.00"}},{"$f":"IF(M10=\"Gleittag\",ABS(P10),\"\")","v":""},{"$f":"IF(A10<=TODAY(),\"Ja\",\"\")","v":""}]
["2026-05-02",{"$f":"TEXT(A11,\"tttt\")","v":"Samstag"},{"$f":"IF(AND(S11=\"Feiertag\",T11>0),\"Fehlzeit\",IF(OR(B11=\"Samstag\",B11=\"Sonntag\"),\"Wochenende\",\"Bitte auswählen\"))","v":"Wochenende"},{"$nulls":5},{"$f":"IF(AND(OR(C11=\"Anwesenheit\",C11=\"Wochenende\"),E11<>\"\",F11<>\"\",W11=\"Ja\"),((F11-E11)+(H11-G11))*24,\"\")","v":""},{"$f":"IF(I11=\"\",\"\",IF(AND(G11<>\"\",H11<>\"\"),(G11-F11)*24,0))","v":""},{"$f":"IF(I11=\"\",\"\",IF(AND(I11<>\"\",J11=\"\",I11>=Personalstamm!$D$20),Personalstamm!$E$20,IF(AND(I11<>\"\",J11=\"\",I11>=Personalstamm!$D$19),Personalstamm!$E$19,IF(AND(I11<>\"\",J11<Personalstamm!$E$20,I11>=Personalstamm!$D$20),Personalstamm!$E$20-J11,IF(AND(I11<>\"\",J11<Personalstamm!E$19,I11>=Personalstamm!$D$19),Personalstamm!$E$19-J11,0)))))","v":""},{"$f":"IF(I11<>\"\",I11-K11,\"\")","v":""},{"$f":"IF(AND(S11=\"Feiertag\",T11>0),\"Feiertag\",IF(C11=\"Fehlzeit\",\"Bitte auswählen\",\"\"))","v":""},{"$f":"IF(OR(M11=\"\",M11=\"Bitte auswählen\"),\"\",IF(M11=\"Feiertag\",T11*U11,IF(M11=\"Gleittag\",0,VLOOKUP(B11,Personalstamm!$D$8:$F$14,3,FALSE))))","v":""},{"$f":"VLOOKUP(B11,Personalstamm!$D$8:$E$14,2,FALSE)","v":{"v":0,"d":"0.00"}},{"$f":"IF(AND(OR(C11=\"Anwesenheit\",C11=\"Wochenende\"),L11<>\"\"),L11-O11,IF(AND(C11=\"Fehlzeit\",N11<>\"\",W11=\"Ja\"),N11-O11,IF(W11=\"Ja\",-O11,\"\")))","v":""},{"$f":"IF(P11=\"\",Q10,Q10+P11)","v":{"v":0,"d":"0.00"}},null,{"$f":"IF(COUNTIF(Allgemein!$H$8:$H$45,A11)>0,\"Feiertag\",\"\")","v":""},{"$f":"IFERROR(VLOOKUP(A11,Allgemein!$H$8:$I$45,2,FALSE),\"\")","v":""},{"$f":"VLOOKUP(B11,Personalstamm!$D$8:$F$14,3,FALSE)","v":{"v":0,"d":"0.00"}},{"$f":"IF(M11=\"Gleittag\",ABS(P11),\"\")","v":""},{"$f":"IF(A11<=TODAY(),\"Ja\",\"\")","v":""}]
["2026-05-03","Sonntag","Wochenende",{"$nulls":5},"","",{"$f":"IF(I12=\"\",\"\",IF(AND(I12<>\"\",J12=\"\",I12>=Personalstamm!$D$20),Personalstamm!$E$20,IF(AND(I12<>\"\",J12=\"\",I12>=Personalstamm!$D$19),Personalstamm!$E$19,IF(AND(I12<>\"\",J12<Personalstamm!$E$20,I12>=Personalstamm!$D$20),Personalstamm!$E$20-J12,IF(AND(I12<>\"\",J12<Personalstamm!E$19,I12>=Personalstamm!$D$19),Personalstamm!$E$19-J12,0)))))","v":""},"","",{"$f":"IF(OR(M12=\"\",M12=\"Bitte auswählen\"),\"\",IF(M12=\"Feiertag\",T12*U12,IF(M12=\"Gleittag\",0,VLOOKUP(B12,Personalstamm!$D$8:$F$14,3,FALSE))))","v":""},{"$f":"VLOOKUP(B12,Personalstamm!$D$8:$E$14,2,FALSE)","v":{"v":0,"d":"0.00"}},"",{"$f":"IF(P12=\"\",Q11,Q11+P12)","v":{"v":0,"d":"0.00"}},null,{"$f":"IF(COUNTIF(Allgemein!$H$8:$H$45,A12)>0,\"Feiertag\",\"\")","v":""},{"$f":"IFERROR(VLOOKUP(A12,Allgemein!$H$8:$I$45,2,FALSE),\"\")","v":""},{"$f":"VLOOKUP(B12,Personalstamm!$D$8:$F$14,3,FALSE)","v":{"v":0,"d":"0.00"}},"",""]
["2026-05-04","Montag","Bitte auswählen",{"$nulls":5},"","",{"$f":"IF(I13=\"\",\"\",IF(AND(I13<>\"\",J13=\"\",I13>=Personalstamm!$D$20),Personalstamm!$E$20,IF(AND(I13<>\"\",J13=\"\",I13>=Personalstamm!$D$19),Personalstamm!$E$19,IF(AND(I13<>\"\",J13<Personalstamm!$E$20,I13>=Personalstamm!$D$20),Personalstamm!$E$20-J13,IF(AND(I13<>\"\",J13<Personalstamm!E$19,I13>=Personalstamm!$D$19),Personalstamm!$E$19-J13,0)))))","v":""},"","",{"$f":"IF(OR(M13=\"\",M13=\"Bitte auswählen\"),\"\",IF(M13=\"Feiertag\",T13*U13,IF(M13=\"Gleittag\",0,VLOOKUP(B13,Personalstamm!$D$8:$F$14,3,FALSE))))","v":""},{"$f":"VLOOKUP(B13,Personalstamm!$D$8:$E$14,2,FALSE)","v":{"v":8,"d":"8.00"}},"",{"$f":"IF(P13=\"\",Q12,Q12+P13)","v":{"v":0,"d":"0.00"}},null,{"$f":"IF(COUNTIF(Allgemein!$H$8:$H$45,A13)>0,\"Feiertag\",\"\")","v":""},{"$f":"IFERROR(VLOOKUP(A13,Allgemein!$H$8:$I$45,2,FALSE),\"\")","v":""},{"$f":"VLOOKUP(B13,Personalstamm!$D$8:$F$14,3,FALSE)","v":{"v":8,"d":"8.00"}},"",""]
["2026-05-05","Dienstag","Bitte auswählen",{"$nulls":5},"","",{"$f":"IF(I14=\"\",\"\",IF(AND(I14<>\"\",J14=\"\",I14>=Personalstamm!$D$20),Personalstamm!$E$20,IF(AND(I14<>\"\",J14=\"\",I14>=Personalstamm!$D$19),Personalstamm!$E$19,IF(AND(I14<>\"\",J14<Personalstamm!$E$20,I14>=Personalstamm!$D$20),Personalstamm!$E$20-J14,IF(AND(I14<>\"\",J14<Personalstamm!E$19,I14>=Personalstamm!$D$19),Personalstamm!$E$19-J14,0)))))","v":""},"","",{"$f":"IF(OR(M14=\"\",M14=\"Bitte auswählen\"),\"\",IF(M14=\"Feiertag\",T14*U14,IF(M14=\"Gleittag\",0,VLOOKUP(B14,Personalstamm!$D$8:$F$14,3,FALSE))))","v":""},{"$f":"VLOOKUP(B14,Personalstamm!$D$8:$E$14,2,FALSE)","v":{"v":8,"d":"8.00"}},"",{"v":0,"d":"0.00"},null,{"$f":"IF(COUNTIF(Allgemein!$H$8:$H$45,A14)>0,\"Feiertag\",\"\")","v":""},{"$f":"IFERROR(VLOOKUP(A14,Allgemein!$H$8:$I$45,2,FALSE),\"\")","v":""},{"$f":"VLOOKUP(B14,Personalstamm!$D$8:$F$14,3,FALSE)","v":{"v":8,"d":"8.00"}},"",""]
["2026-05-06","Mittwoch","Fehlzeit",{"$nulls":5},"","",{"$f":"IF(I15=\"\",\"\",IF(AND(I15<>\"\",J15=\"\",I15>=Personalstamm!$D$20),Personalstamm!$E$20,IF(AND(I15<>\"\",J15=\"\",I15>=Personalstamm!$D$19),Personalstamm!$E$19,IF(AND(I15<>\"\",J15<Personalstamm!$E$20,I15>=Personalstamm!$D$20),Personalstamm!$E$20-J15,IF(AND(I15<>\"\",J15<Personalstamm!E$19,I15>=Personalstamm!$D$19),Personalstamm!$E$19-J15,0)))))","v":""},"","Feiertag",{"$f":"IF(OR(M15=\"\",M15=\"Bitte auswählen\"),\"\",IF(M15=\"Feiertag\",T15*U15,IF(M15=\"Gleittag\",0,VLOOKUP(B15,Personalstamm!$D$8:$F$14,3,FALSE))))","v":{"v":8,"d":"8.00"}},{"$f":"VLOOKUP(B15,Personalstamm!$D$8:$E$14,2,FALSE)","v":{"v":8,"d":"8.00"}},"",{"v":0,"d":"0.00"},null,{"$f":"IF(COUNTIF(Allgemein!$H$8:$H$45,A15)>0,\"Feiertag\",\"\")","v":"Feiertag"},{"$f":"IFERROR(VLOOKUP(A15,Allgemein!$H$8:$I$45,2,FALSE),\"\")","v":{"v":1,"d":"1.00"}},{"$f":"VLOOKUP(B15,Personalstamm!$D$8:$F$14,3,FALSE)","v":{"v":8,"d":"8.00"}},"",""]
["2026-05-07","Donnerstag","Bitte auswählen",{"$nulls":5},"","",{"$f":"IF(I16=\"\",\"\",IF(AND(I16<>\"\",J16=\"\",I16>=Personalstamm!$D$20),Personalstamm!$E$20,IF(AND(I16<>\"\",J16=\"\",I16>=Personalstamm!$D$19),Personalstamm!$E$19,IF(AND(I16<>\"\",J16<Personalstamm!$E$20,I16>=Personalstamm!$D$20),Personalstamm!$E$20-J16,IF(AND(I16<>\"\",J16<Personalstamm!E$19,I16>=Personalstamm!$D$19),Personalstamm!$E$19-J16,0)))))","v":""},"","",{"$f":"IF(OR(M16=\"\",M16=\"Bitte auswählen\"),\"\",IF(M16=\"Feiertag\",T16*U16,IF(M16=\"Gleittag\",0,VLOOKUP(B16,Personalstamm!$D$8:$F$14,3,FALSE))))","v":""},{"$f":"VLOOKUP(B16,Personalstamm!$D$8:$E$14,2,FALSE)","v":{"v":8,"d":"8.00"}},"",{"v":0,"d":"0.00"},null,{"$f":"IF(COUNTIF(Allgemein!$H$8:$H$45,A16)>0,\"Feiertag\",\"\")","v":""},{"$f":"IFERROR(VLOOKUP(A16,Allgemein!$H$8:$I$45,2,FALSE),\"\")","v":""},{"$f":"VLOOKUP(B16,Personalstamm!$D$8:$F$14,3,FALSE)","v":{"v":8,"d":"8.00"}},"",""]
["2026-05-08","Freitag","Bitte auswählen",{"$nulls":5},"","",{"$f":"IF(I17=\"\",\"\",IF(AND(I17<>\"\",J17=\"\",I17>=Personalstamm!$D$20),Personalstamm!$E$20,IF(AND(I17<>\"\",J17=\"\",I17>=Personalstamm!$D$19),Personalstamm!$E$19,IF(AND(I17<>\"\",J17<Personalstamm!$E$20,I17>=Personalstamm!$D$20),Personalstamm!$E$20-J17,IF(AND(I17<>\"\",J17<Personalstamm!E$19,I17>=Personalstamm!$D$19),Personalstamm!$E$19-J17,0)))))","v":""},"","",{"$f":"IF(OR(M17=\"\",M17=\"Bitte auswählen\"),\"\",IF(M17=\"Feiertag\",T17*U17,IF(M17=\"Gleittag\",0,VLOOKUP(B17,Personalstamm!$D$8:$F$14,3,FALSE))))","v":""},{"$f":"VLOOKUP(B17,Personalstamm!$D$8:$E$14,2,FALSE)","v":{"v":8,"d":"8.00"}},"",{"v":0,"d":"0.00"},null,{"$f":"IF(COUNTIF(Allgemein!$H$8:$H$45,A17)>0,\"Feiertag\",\"\")","v":""},{"$f":"IFERROR(VLOOKUP(A17,Allgemein!$H$8:$I$45,2,FALSE),\"\")","v":""},{"$f":"VLOOKUP(B17,Personalstamm!$D$8:$F$14,3,FALSE)","v":{"v":8,"d":"8.00"}},"",""]
["2026-05-09","Samstag","Wochenende",{"$nulls":5},"","",{"$f":"IF(I18=\"\",\"\",IF(AND(I18<>\"\",J18=\"\",I18>=Personalstamm!$D$20),Personalstamm!$E$20,IF(AND(I18<>\"\",J18=\"\",I18>=Personalstamm!$D$19),Personalstamm!$E$19,IF(AND(I18<>\"\",J18<Personalstamm!$E$20,I18>=Personalstamm!$D$20),Personalstamm!$E$20-J18,IF(AND(I18<>\"\",J18<Personalstamm!E$19,I18>=Personalstamm!$D$19),Personalstamm!$E$19-J18,0)))))","v":""},"","",{"$f":"IF(OR(M18=\"\",M18=\"Bitte auswählen\"),\"\",IF(M18=\"Feiertag\",T18*U18,IF(M18=\"Gleittag\",0,VLOOKUP(B18,Personalstamm!$D$8:$F$14,3,FALSE))))","v":""},{"$f":"VLOOKUP(B18,Personalstamm!$D$8:$E$14,2,FALSE)","v":{"v":0,"d":"0.00"}},"",{"v":0,"d":"0.00"},null,{"$f":"IF(COUNTIF(Allgemein!$H$8:$H$45,A18)>0,\"Feiertag\",\"\")","v":""},{"$f":"IFERROR(VLOOKUP(A18,Allgemein!$H$8:$I$45,2,FALSE),\"\")","v":""},{"$f":"VLOOKUP(B18,Personalstamm!$D$8:$F$14,3,FALSE)","v":{"v":0,"d":"0.00"}},"",""]
["2026-05-10","Sonntag","Wochenende",{"$nulls":5},"","",{"$f":"IF(I19=\"\",\"\",IF(AND(I19<>\"\",J19=\"\",I19>=Personalstamm!$D$20),Personalstamm!$E$20,IF(AND(I19<>\"\",J19=\"\",I19>=Personalstamm!$D$19),Personalstamm!$E$19,IF(AND(I19<>\"\",J19<Personalstamm!$E$20,I19>=Personalstamm!$D$20),Personalstamm!$E$20-J19,IF(AND(I19<>\"\",J19<Personalstamm!E$19,I19>=Personalstamm!$D$19),Personalstamm!$E$19-J19,0)))))","v":""},"","",{"$f":"IF(OR(M19=\"\",M19=\"Bitte auswählen\"),\"\",IF(M19=\"Feiertag\",T19*U19,IF(M19=\"Gleittag\",0,VLOOKUP(B19,Personalstamm!$D$8:$F$14,3,FALSE))))","v":""},{"$f":"VLOOKUP(B19,Personalstamm!$D$8:$E$14,2,FALSE)","v":{"v":0,"d":"0.00"}},"",{"v":0,"d":"0.00"},null,{"$f":"IF(COUNTIF(Allgemein!$H$8:$H$45,A19)>0,\"Feiertag\",\"\")","v":"Feiertag"},{"$f":"IFERROR(VLOOKUP(A19,Allgemein!$H$8:$I$45,2,FALSE),\"\")","v":{"v":0,"d":"0.00"}},{"$f":"VLOOKUP(B19,Personalstamm!$D$8:$F$14,3,FALSE)","v":{"v":0,"d":"0.00"}},"",""]
["2026-05-11","Montag","Bitte auswählen",{"$nulls":5},"","",{"$f":"IF(I20=\"\",\"\",IF(AND(I20<>\"\",J20=\"\",I20>=Personalstamm!$D$20),Personalstamm!$E$20,IF(AND(I20<>\"\",J20=\"\",I20>=Personalstamm!$D$19),Personalstamm!$E$19,IF(AND(I20<>\"\",J20<Personalstamm!$E$20,I20>=Personalstamm!$D$20),Personalstamm!$E$20-J20,IF(AND(I20<>\"\",J20<Personalstamm!E$19,I20>=Personalstamm!$D$19),Personalstamm!$E$19-J20,0)))))","v":""},"","",{"$f":"IF(OR(M20=\"\",M20=\"Bitte auswählen\"),\"\",IF(M20=\"Feiertag\",T20*U20,IF(M20=\"Gleittag\",0,VLOOKUP(B20,Personalstamm!$D$8:$F$14,3,FALSE))))","v":""},{"$f":"VLOOKUP(B20,Personalstamm!$D$8:$E$14,2,FALSE)","v":{"v":8,"d":"8.00"}},"",{"v":0,"d":"0.00"},null,{"$f":"IF(COUNTIF(Allgemein!$H$8:$H$45,A20)>0,\"Feiertag\",\"\")","v":""},{"$f":"IFERROR(VLOOKUP(A20,Allgemein!$H$8:$I$45,2,FALSE),\"\")","v":""},{"$f":"VLOOKUP(B20,Personalstamm!$D$8:$F$14,3,FALSE)","v":{"v":8,"d":"8.00"}},"",""]
["2026-05-12","Dienstag","Bitte auswählen",{"$nulls":5},"","",{"$f":"IF(I21=\"\",\"\",IF(AND(I21<>\"\",J21=\"\",I21>=Personalstamm!$D$20),Personalstamm!$E$20,IF(AND(I21<>\"\",J21=\"\",I21>=Personalstamm!$D$19),Personalstamm!$E$19,IF(AND(I21<>\"\",J21<Personalstamm!$E$20,I21>=Personalstamm!$D$20),Personalstamm!$E$20-J21,IF(AND(I21<>\"\",J21<Personalstamm!E$19,I21>=Personalstamm!$D$19),Personalstamm!$E$19-J21,0)))))","v":""},"","",{"$f":"IF(OR(M21=\"\",M21=\"Bitte auswählen\"),\"\",IF(M21=\"Feiertag\",T21*U21,IF(M21=\"Gleittag\",0,VLOOKUP(B21,Personalstamm!$D$8:$F$14,3,FALSE))))","v":""},{"$f":"VLOOKUP(B21,Personalstamm!$D$8:$E$14,2,FALSE)","v":{"v":8,"d":"8.00"}},"",{"v":0,"d":"0.00"},null,{"$f":"IF(COUNTIF(Allgemein!$H$8:$H$45,A21)>0,\"Feiertag\",\"\")","v":""},{"$f":"IFERROR(VLOOKUP(A21,Allgemein!$H$8:$I$45,2,FALSE),\"\")","v":""},{"$f":"VLOOKUP(B21,Personalstamm!$D$8:$F$14,3,FALSE)","v":{"v":8,"d":"8.00"}},"",""]
["2026-05-13","Mittwoch","Bitte auswählen",{"$nulls":5},"","",{"$f":"IF(I22=\"\",\"\",IF(AND(I22<>\"\",J22=\"\",I22>=Personalstamm!$D$20),Personalstamm!$E$20,IF(AND(I22<>\"\",J22=\"\",I22>=Personalstamm!$D$19),Personalstamm!$E$19,IF(AND(I22<>\"\",J22<Personalstamm!$E$20,I22>=Personalstamm!$D$20),Personalstamm!$E$20-J22,IF(AND(I22<>\"\",J22<Personalstamm!E$19,I22>=Personalstamm!$D$19),Personalstamm!$E$19-J22,0)))))","v":""},"","",{"$f":"IF(OR(M22=\"\",M22=\"Bitte auswählen\"),\"\",IF(M22=\"Feiertag\",T22*U22,IF(M22=\"Gleittag\",0,VLOOKUP(B22,Personalstamm!$D$8:$F$14,3,FALSE))))","v":""},{"$f":"VLOOKUP(B22,Personalstamm!$D$8:$E$14,2,FALSE)","v":{"v":8,"d":"8.00"}},"",{"v":0,"d":"0.00"},null,{"$f":"IF(COUNTIF(Allgemein!$H$8:$H$45,A22)>0,\"Feiertag\",\"\")","v":""},{"$f":"IFERROR(VLOOKUP(A22,Allgemein!$H$8:$I$45,2,FALSE),\"\")","v":""},{"$f":"VLOOKUP(B22,Personalstamm!$D$8:$F$14,3,FALSE)","v":{"v":8,"d":"8.00"}},"",""]
["2026-05-14","Donnerstag","Fehlzeit",{"$nulls":5},"","",{"$f":"IF(I23=\"\",\"\",IF(AND(I23<>\"\",J23=\"\",I23>=Personalstamm!$D$20),Personalstamm!$E$20,IF(AND(I23<>\"\",J23=\"\",I23>=Personalstamm!$D$19),Personalstamm!$E$19,IF(AND(I23<>\"\",J23<Personalstamm!$E$20,I23>=Personalstamm!$D$20),Personalstamm!$E$20-J23,IF(AND(I23<>\"\",J23<Personalstamm!E$19,I23>=Personalstamm!$D$19),Personalstamm!$E$19-J23,0)))))","v":""},"","Feiertag",{"$f":"IF(OR(M23=\"\",M23=\"Bitte auswählen\"),\"\",IF(M23=\"Feiertag\",T23*U23,IF(M23=\"Gleittag\",0,VLOOKUP(B23,Personalstamm!$D$8:$F$14,3,FALSE))))","v":{"v":8,"d":"8.00"}},{"$f":"VLOOKUP(B23,Personalstamm!$D$8:$E$14,2,FALSE)","v":{"v":8,"d":"8.00"}},"",{"v":0,"d":"0.00"},null,{"$f":"IF(COUNTIF(Allgemein!$H$8:$H$45,A23)>0,\"Feiertag\",\"\")","v":"Feiertag"},{"$f":"IFERROR(VLOOKUP(A23,Allgemein!$H$8:$I$45,2,FALSE),\"\")","v":{"v":1,"d":"1.00"}},{"$f":"VLOOKUP(B23,Personalstamm!$D$8:$F$14,3,FALSE)","v":{"v":8,"d":"8.00"}},"",""]
["2026-05-15","Freitag","Bitte auswählen",{"$nulls":5},"","",{"$f":"IF(I24=\"\",\"\",IF(AND(I24<>\"\",J24=\"\",I24>=Personalstamm!$D$20),Personalstamm!$E$20,IF(AND(I24<>\"\",J24=\"\",I24>=Personalstamm!$D$19),Personalstamm!$E$19,IF(AND(I24<>\"\",J24<Personalstamm!$E$20,I24>=Personalstamm!$D$20),Personalstamm!$E$20-J24,IF(AND(I24<>\"\",J24<Personalstamm!E$19,I24>=Personalstamm!$D$19),Personalstamm!$E$19-J24,0)))))","v":""},"","",{"$f":"IF(OR(M24=\"\",M24=\"Bitte auswählen\"),\"\",IF(M24=\"Feiertag\",T24*U24,IF(M24=\"Gleittag\",0,VLOOKUP(B24,Personalstamm!$D$8:$F$14,3,FALSE))))","v":""},{"$f":"VLOOKUP(B24,Personalstamm!$D$8:$E$14,2,FALSE)","v":{"v":8,"d":"8.00"}},"",{"v":0,"d":"0.00"},null,{"$f":"IF(COUNTIF(Allgemein!$H$8:$H$45,A24)>0,\"Feiertag\",\"\")","v":""},{"$f":"IFERROR(VLOOKUP(A24,Allgemein!$H$8:$I$45,2,FALSE),\"\")","v":""},{"$f":"VLOOKUP(B24,Personalstamm!$D$8:$F$14,3,FALSE)","v":{"v":8,"d":"8.00"}},"",""]
["2026-05-16","Samstag","Wochenende",{"$nulls":5},"","",{"$f":"IF(I25=\"\",\"\",IF(AND(I25<>\"\",J25=\"\",I25>=Personalstamm!$D$20),Personalstamm!$E$20,IF(AND(I25<>\"\",J25=\"\",I25>=Personalstamm!$D$19),Personalstamm!$E$19,IF(AND(I25<>\"\",J25<Personalstamm!$E$20,I25>=Personalstamm!$D$20),Personalstamm!$E$20-J25,IF(AND(I25<>\"\",J25<Personalstamm!E$19,I25>=Personalstamm!$D$19),Personalstamm!$E$19-J25,0)))))","v":""},"","",{"$f":"IF(OR(M25=\"\",M25=\"Bitte auswählen\"),\"\",IF(M25=\"Feiertag\",T25*U25,IF(M25=\"Gleittag\",0,VLOOKUP(B25,Personalstamm!$D$8:$F$14,3,FALSE))))","v":""},{"$f":"VLOOKUP(B25,Personalstamm!$D$8:$E$14,2,FALSE)","v":{"v":0,"d":"0.00"}},"",{"v":0,"d":"0.00"},null,{"$f":"IF(COUNTIF(Allgemein!$H$8:$H$45,A25)>0,\"Feiertag\",\"\")","v":""},{"$f":"IFERROR(VLOOKUP(A25,Allgemein!$H$8:$I$45,2,FALSE),\"\")","v":""},{"$f":"VLOOKUP(B25,Personalstamm!$D$8:$F$14,3,FALSE)","v":{"v":0,"d":"0.00"}},"",""]
["2026-05-17","Sonntag","Wochenende",{"$nulls":5},"","",{"$f":"IF(I26=\"\",\"\",IF(AND(I26<>\"\",J26=\"\",I26>=Personalstamm!$D$20),Personalstamm!$E$20,IF(AND(I26<>\"\",J26=\"\",I26>=Personalstamm!$D$19),Personalstamm!$E$19,IF(AND(I26<>\"\",J26<Personalstamm!$E$20,I26>=Personalstamm!$D$20),Personalstamm!$E$20-J26,IF(AND(I26<>\"\",J26<Personalstamm!E$19,I26>=Personalstamm!$D$19),Personalstamm!$E$19-J26,0)))))","v":""},"","",{"$f":"IF(OR(M26=\"\",M26=\"Bitte auswählen\"),\"\",IF(M26=\"Feiertag\",T26*U26,IF(M26=\"Gleittag\",0,VLOOKUP(B26,Personalstamm!$D$8:$F$14,3,FALSE))))","v":""},{"$f":"VLOOKUP(B26,Personalstamm!$D$8:$E$14,2,FALSE)","v":{"v":0,"d":"0.00"}},"",{"v":0,"d":"0.00"},null,{"$f":"IF(COUNTIF(Allgemein!$H$8:$H$45,A26)>0,\"Feiertag\",\"\")","v":""},{"$f":"IFERROR(VLOOKUP(A26,Allgemein!$H$8:$I$45,2,FALSE),\"\")","v":""},{"$f":"VLOOKUP(B26,Personalstamm!$D$8:$F$14,3,FALSE)","v":{"v":0,"d":"0.00"}},"",""]
["2026-05-18","Montag","Bitte auswählen",{"$nulls":5},"","",{"$f":"IF(I27=\"\",\"\",IF(AND(I27<>\"\",J27=\"\",I27>=Personalstamm!$D$20),Personalstamm!$E$20,IF(AND(I27<>\"\",J27=\"\",I27>=Personalstamm!$D$19),Personalstamm!$E$19,IF(AND(I27<>\"\",J27<Personalstamm!$E$20,I27>=Personalstamm!$D$20),Personalstamm!$E$20-J27,IF(AND(I27<>\"\",J27<Personalstamm!E$19,I27>=Personalstamm!$D$19),Personalstamm!$E$19-J27,0)))))","v":""},"","",{"$f":"IF(OR(M27=\"\",M27=\"Bitte auswählen\"),\"\",IF(M27=\"Feiertag\",T27*U27,IF(M27=\"Gleittag\",0,VLOOKUP(B27,Personalstamm!$D$8:$F$14,3,FALSE))))","v":""},{"$f":"VLOOKUP(B27,Personalstamm!$D$8:$E$14,2,FALSE)","v":{"v":8,"d":"8.00"}},"",{"v":0,"d":"0.00"},null,{"$f":"IF(COUNTIF(Allgemein!$H$8:$H$45,A27)>0,\"Feiertag\",\"\")","v":""},{"$f":"IFERROR(VLOOKUP(A27,Allgemein!$H$8:$I$45,2,FALSE),\"\")","v":""},{"$f":"VLOOKUP(B27,Personalstamm!$D$8:$F$14,3,FALSE)","v":{"v":8,"d":"8.00"}},"",""]
["2026-05-19","Dienstag","Bitte auswählen",{"$nulls":5},"","",{"$f":"IF(I28=\"\",\"\",IF(AND(I28<>\"\",J28=\"\",I28>=Personalstamm!$D$20),Personalstamm!$E$20,IF(AND(I28<>\"\",J28=\"\",I28>=Personalstamm!$D$19),Personalstamm!$E$19,IF(AND(I28<>\"\",J28<Personalstamm!$E$20,I28>=Personalstamm!$D$20),Personalstamm!$E$20-J28,IF(AND(I28<>\"\",J28<Personalstamm!E$19,I28>=Personalstamm!$D$19),Personalstamm!$E$19-J28,0)))))","v":""},"","",{"$f":"IF(OR(M28=\"\",M28=\"Bitte auswählen\"),\"\",IF(M28=\"Feiertag\",T28*U28,IF(M28=\"Gleittag\",0,VLOOKUP(B28,Personalstamm!$D$8:$F$14,3,FALSE))))","v":""},{"$f":"VLOOKUP(B28,Personalstamm!$D$8:$E$14,2,FALSE)","v":{"v":8,"d":"8.00"}},"",{"v":0,"d":"0.00"},null,{"$f":"IF(COUNTIF(Allgemein!$H$8:$H$45,A28)>0,\"Feiertag\",\"\")","v":""},{"$f":"IFERROR(VLOOKUP(A28,Allgemein!$H$8:$I$45,2,FALSE),\"\")","v":""},{"$f":"VLOOKUP(B28,Personalstamm!$D$8:$F$14,3,FALSE)","v":{"v":8,"d":"8.00"}},"",""]
["2026-05-20","Mittwoch","Bitte auswählen",{"$nulls":5},"","",{"$f":"IF(I29=\"\",\"\",IF(AND(I29<>\"\",J29=\"\",I29>=Personalstamm!$D$20),Personalstamm!$E$20,IF(AND(I29<>\"\",J29=\"\",I29>=Personalstamm!$D$19),Personalstamm!$E$19,IF(AND(I29<>\"\",J29<Personalstamm!$E$20,I29>=Personalstamm!$D$20),Personalstamm!$E$20-J29,IF(AND(I29<>\"\",J29<Personalstamm!E$19,I29>=Personalstamm!$D$19),Personalstamm!$E$19-J29,0)))))","v":""},"","",{"$f":"IF(OR(M29=\"\",M29=\"Bitte auswählen\"),\"\",IF(M29=\"Feiertag\",T29*U29,IF(M29=\"Gleittag\",0,VLOOKUP(B29,Personalstamm!$D$8:$F$14,3,FALSE))))","v":""},{"$f":"VLOOKUP(B29,Personalstamm!$D$8:$E$14,2,FALSE)","v":{"v":8,"d":"8.00"}},"",{"v":0,"d":"0.00"},null,{"$f":"IF(COUNTIF(Allgemein!$H$8:$H$45,A29)>0,\"Feiertag\",\"\")","v":""},{"$f":"IFERROR(VLOOKUP(A29,Allgemein!$H$8:$I$45,2,FALSE),\"\")","v":""},{"$f":"VLOOKUP(B29,Personalstamm!$D$8:$F$14,3,FALSE)","v":{"v":8,"d":"8.00"}},"",""]
["2026-05-21","Donnerstag","Bitte auswählen",{"$nulls":5},"","",{"$f":"IF(I30=\"\",\"\",IF(AND(I30<>\"\",J30=\"\",I30>=Personalstamm!$D$20),Personalstamm!$E$20,IF(AND(I30<>\"\",J30=\"\",I30>=Personalstamm!$D$19),Personalstamm!$E$19,IF(AND(I30<>\"\",J30<Personalstamm!$E$20,I30>=Personalstamm!$D$20),Personalstamm!$E$20-J30,IF(AND(I30<>\"\",J30<Personalstamm!E$19,I30>=Personalstamm!$D$19),Personalstamm!$E$19-J30,0)))))","v":""},"","",{"$f":"IF(OR(M30=\"\",M30=\"Bitte auswählen\"),\"\",IF(M30=\"Feiertag\",T30*U30,IF(M30=\"Gleittag\",0,VLOOKUP(B30,Personalstamm!$D$8:$F$14,3,FALSE))))","v":""},{"$f":"VLOOKUP(B30,Personalstamm!$D$8:$E$14,2,FALSE)","v":{"v":8,"d":"8.00"}},"",{"v":0,"d":"0.00"},null,{"$f":"IF(COUNTIF(Allgemein!$H$8:$H$45,A30)>0,\"Feiertag\",\"\")","v":""},{"$f":"IFERROR(VLOOKUP(A30,Allgemein!$H$8:$I$45,2,FALSE),\"\")","v":""},{"$f":"VLOOKUP(B30,Personalstamm!$D$8:$F$14,3,FALSE)","v":{"v":8,"d":"8.00"}},"",""]
["2026-05-22","Freitag","Bitte auswählen",{"$nulls":5},"","",{"$f":"IF(I31=\"\",\"\",IF(AND(I31<>\"\",J31=\"\",I31>=Personalstamm!$D$20),Personalstamm!$E$20,IF(AND(I31<>\"\",J31=\"\",I31>=Personalstamm!$D$19),Personalstamm!$E$19,IF(AND(I31<>\"\",J31<Personalstamm!$E$20,I31>=Personalstamm!$D$20),Personalstamm!$E$20-J31,IF(AND(I31<>\"\",J31<Personalstamm!E$19,I31>=Personalstamm!$D$19),Personalstamm!$E$19-J31,0)))))","v":""},"","",{"$f":"IF(OR(M31=\"\",M31=\"Bitte auswählen\"),\"\",IF(M31=\"Feiertag\",T31*U31,IF(M31=\"Gleittag\",0,VLOOKUP(B31,Personalstamm!$D$8:$F$14,3,FALSE))))","v":""},{"$f":"VLOOKUP(B31,Personalstamm!$D$8:$E$14,2,FALSE)","v":{"v":8,"d":"8.00"}},"",{"v":0,"d":"0.00"},null,{"$f":"IF(COUNTIF(Allgemein!$H$8:$H$45,A31)>0,\"Feiertag\",\"\")","v":""},{"$f":"IFERROR(VLOOKUP(A31,Allgemein!$H$8:$I$45,2,FALSE),\"\")","v":""},{"$f":"VLOOKUP(B31,Personalstamm!$D$8:$F$14,3,FALSE)","v":{"v":8,"d":"8.00"}},"",""]
["2026-05-23","Samstag","Wochenende",{"$nulls":5},"","",{"$f":"IF(I32=\"\",\"\",IF(AND(I32<>\"\",J32=\"\",I32>=Personalstamm!$D$20),Personalstamm!$E$20,IF(AND(I32<>\"\",J32=\"\",I32>=Personalstamm!$D$19),Personalstamm!$E$19,IF(AND(I32<>\"\",J32<Personalstamm!$E$20,I32>=Personalstamm!$D$20),Personalstamm!$E$20-J32,IF(AND(I32<>\"\",J32<Personalstamm!E$19,I32>=Personalstamm!$D$19),Personalstamm!$E$19-J32,0)))))","v":""},"","",{"$f":"IF(OR(M32=\"\",M32=\"Bitte auswählen\"),\"\",IF(M32=\"Feiertag\",T32*U32,IF(M32=\"Gleittag\",0,VLOOKUP(B32,Personalstamm!$D$8:$F$14,3,FALSE))))","v":""},{"$f":"VLOOKUP(B32,Personalstamm!$D$8:$E$14,2,FALSE)","v":{"v":0,"d":"0.00"}},"",{"v":0,"d":"0.00"},null,{"$f":"IF(COUNTIF(Allgemein!$H$8:$H$45,A32)>0,\"Feiertag\",\"\")","v":""},{"$f":"IFERROR(VLOOKUP(A32,Allgemein!$H$8:$I$45,2,FALSE),\"\")","v":""},{"$f":"VLOOKUP(B32,Personalstamm!$D$8:$F$14,3,FALSE)","v":{"v":0,"d":"0.00"}},"",""]
["2026-05-24","Sonntag","Fehlzeit",{"$nulls":5},"","",{"$f":"IF(I33=\"\",\"\",IF(AND(I33<>\"\",J33=\"\",I33>=Personalstamm!$D$20),Personalstamm!$E$20,IF(AND(I33<>\"\",J33=\"\",I33>=Personalstamm!$D$19),Personalstamm!$E$19,IF(AND(I33<>\"\",J33<Personalstamm!$E$20,I33>=Personalstamm!$D$20),Personalstamm!$E$20-J33,IF(AND(I33<>\"\",J33<Personalstamm!E$19,I33>=Personalstamm!$D$19),Personalstamm!$E$19-J33,0)))))","v":""},"","Feiertag",{"$f":"IF(OR(M33=\"\",M33=\"Bitte auswählen\"),\"\",IF(M33=\"Feiertag\",T33*U33,IF(M33=\"Gleittag\",0,VLOOKUP(B33,Personalstamm!$D$8:$F$14,3,FALSE))))","v":{"v":0,"d":"0.00"}},{"$f":"VLOOKUP(B33,Personalstamm!$D$8:$E$14,2,FALSE)","v":{"v":0,"d":"0.00"}},"",{"v":0,"d":"0.00"},null,{"$f":"IF(COUNTIF(Allgemein!$H$8:$H$45,A33)>0,\"Feiertag\",\"\")","v":"Feiertag"},{"$f":"IFERROR(VLOOKUP(A33,Allgemein!$H$8:$I$45,2,FALSE),\"\")","v":{"v":1,"d":"1.00"}},{"$f":"VLOOKUP(B33,Personalstamm!$D$8:$F$14,3,FALSE)","v":{"v":0,"d":"0.00"}},"",""]
["2026-05-25","Montag","Fehlzeit",{"$nulls":5},"","",{"$f":"IF(I34=\"\",\"\",IF(AND(I34<>\"\",J34=\"\",I34>=Personalstamm!$D$20),Personalstamm!$E$20,IF(AND(I34<>\"\",J34=\"\",I34>=Personalstamm!$D$19),Personalstamm!$E$19,IF(AND(I34<>\"\",J34<Personalstamm!$E$20,I34>=Personalstamm!$D$20),Personalstamm!$E$20-J34,IF(AND(I34<>\"\",J34<Personalstamm!E$19,I34>=Personalstamm!$D$19),Personalstamm!$E$19-J34,0)))))","v":""},"","Feiertag",{"$f":"IF(OR(M34=\"\",M34=\"Bitte auswählen\"),\"\",IF(M34=\"Feiertag\",T34*U34,IF(M34=\"Gleittag\",0,VLOOKUP(B34,Personalstamm!$D$8:$F$14,3,FALSE))))","v":{"v":8,"d":"8.00"}},{"$f":"VLOOKUP(B34,Personalstamm!$D$8:$E$14,2,FALSE)","v":{"v":8,"d":"8.00"}},"",{"v":0,"d":"0.00"},null,{"$f":"IF(COUNTIF(Allgemein!$H$8:$H$45,A34)>0,\"Feiertag\",\"\")","v":"Feiertag"},{"$f":"IFERROR(VLOOKUP(A34,Allgemein!$H$8:$I$45,2,FALSE),\"\")","v":{"v":1,"d":"1.00"}},{"$f":"VLOOKUP(B34,Personalstamm!$D$8:$F$14,3,FALSE)","v":{"v":8,"d":"8.00"}},"",""]
["2026-05-26","Dienstag","Bitte auswählen",{"$nulls":5},"","",{"$f":"IF(I35=\"\",\"\",IF(AND(I35<>\"\",J35=\"\",I35>=Personalstamm!$D$20),Personalstamm!$E$20,IF(AND(I35<>\"\",J35=\"\",I35>=Personalstamm!$D$19),Personalstamm!$E$19,IF(AND(I35<>\"\",J35<Personalstamm!$E$20,I35>=Personalstamm!$D$20),Personalstamm!$E$20-J35,IF(AND(I35<>\"\",J35<Personalstamm!E$19,I35>=Personalstamm!$D$19),Personalstamm!$E$19-J35,0)))))","v":""},"","",{"$f":"IF(OR(M35=\"\",M35=\"Bitte auswählen\"),\"\",IF(M35=\"Feiertag\",T35*U35,IF(M35=\"Gleittag\",0,VLOOKUP(B35,Personalstamm!$D$8:$F$14,3,FALSE))))","v":""},{"$f":"VLOOKUP(B35,Personalstamm!$D$8:$E$14,2,FALSE)","v":{"v":8,"d":"8.00"}},"",{"v":0,"d":"0.00"},null,{"$f":"IF(COUNTIF(Allgemein!$H$8:$H$45,A35)>0,\"Feiertag\",\"\")","v":""},{"$f":"IFERROR(VLOOKUP(A35,Allgemein!$H$8:$I$45,2,FALSE),\"\")","v":""},{"$f":"VLOOKUP(B35,Personalstamm!$D$8:$F$14,3,FALSE)","v":{"v":8,"d":"8.00"}},"",""]
["2026-05-27","Mittwoch","Bitte auswählen",{"$nulls":5},"","",{"$f":"IF(I36=\"\",\"\",IF(AND(I36<>\"\",J36=\"\",I36>=Personalstamm!$D$20),Personalstamm!$E$20,IF(AND(I36<>\"\",J36=\"\",I36>=Personalstamm!$D$19),Personalstamm!$E$19,IF(AND(I36<>\"\",J36<Personalstamm!$E$20,I36>=Personalstamm!$D$20),Personalstamm!$E$20-J36,IF(AND(I36<>\"\",J36<Personalstamm!E$19,I36>=Personalstamm!$D$19),Personalstamm!$E$19-J36,0)))))","v":""},"","",{"$f":"IF(OR(M36=\"\",M36=\"Bitte auswählen\"),\"\",IF(M36=\"Feiertag\",T36*U36,IF(M36=\"Gleittag\",0,VLOOKUP(B36,Personalstamm!$D$8:$F$14,3,FALSE))))","v":""},{"$f":"VLOOKUP(B36,Personalstamm!$D$8:$E$14,2,FALSE)","v":{"v":8,"d":"8.00"}},"",{"v":0,"d":"0.00"},null,{"$f":"IF(COUNTIF(Allgemein!$H$8:$H$45,A36)>0,\"Feiertag\",\"\")","v":""},{"$f":"IFERROR(VLOOKUP(A36,Allgemein!$H$8:$I$45,2,FALSE),\"\")","v":""},{"$f":"VLOOKUP(B36,Personalstamm!$D$8:$F$14,3,FALSE)","v":{"v":8,"d":"8.00"}},"",""]
["2026-05-28","Donnerstag","Bitte auswählen",{"$nulls":5},"","",{"$f":"IF(I37=\"\",\"\",IF(AND(I37<>\"\",J37=\"\",I37>=Personalstamm!$D$20),Personalstamm!$E$20,IF(AND(I37<>\"\",J37=\"\",I37>=Personalstamm!$D$19),Personalstamm!$E$19,IF(AND(I37<>\"\",J37<Personalstamm!$E$20,I37>=Personalstamm!$D$20),Personalstamm!$E$20-J37,IF(AND(I37<>\"\",J37<Personalstamm!E$19,I37>=Personalstamm!$D$19),Personalstamm!$E$19-J37,0)))))","v":""},"","",{"$f":"IF(OR(M37=\"\",M37=\"Bitte auswählen\"),\"\",IF(M37=\"Feiertag\",T37*U37,IF(M37=\"Gleittag\",0,VLOOKUP(B37,Personalstamm!$D$8:$F$14,3,FALSE))))","v":""},{"$f":"VLOOKUP(B37,Personalstamm!$D$8:$E$14,2,FALSE)","v":{"v":8,"d":"8.00"}},"",{"v":0,"d":"0.00"},null,{"$f":"IF(COUNTIF(Allgemein!$H$8:$H$45,A37)>0,\"Feiertag\",\"\")","v":""},{"$f":"IFERROR(VLOOKUP(A37,Allgemein!$H$8:$I$45,2,FALSE),\"\")","v":""},{"$f":"VLOOKUP(B37,Personalstamm!$D$8:$F$14,3,FALSE)","v":{"v":8,"d":"8.00"}},"",""]
["2026-05-29","Freitag","Bitte auswählen",{"$nulls":5},"","",{"$f":"IF(I38=\"\",\"\",IF(AND(I38<>\"\",J38=\"\",I38>=Personalstamm!$D$20),Personalstamm!$E$20,IF(AND(I38<>\"\",J38=\"\",I38>=Personalstamm!$D$19),Personalstamm!$E$19,IF(AND(I38<>\"\",J38<Personalstamm!$E$20,I38>=Personalstamm!$D$20),Personalstamm!$E$20-J38,IF(AND(I38<>\"\",J38<Personalstamm!E$19,I38>=Personalstamm!$D$19),Personalstamm!$E$19-J38,0)))))","v":""},"","",{"$f":"IF(OR(M38=\"\",M38=\"Bitte auswählen\"),\"\",IF(M38=\"Feiertag\",T38*U38,IF(M38=\"Gleittag\",0,VLOOKUP(B38,Personalstamm!$D$8:$F$14,3,FALSE))))","v":""},{"$f":"VLOOKUP(B38,Personalstamm!$D$8:$E$14,2,FALSE)","v":{"v":8,"d":"8.00"}},"",{"v":0,"d":"0.00"},null,{"$f":"IF(COUNTIF(Allgemein!$H$8:$H$45,A38)>0,\"Feiertag\",\"\")","v":""},{"$f":"IFERROR(VLOOKUP(A38,Allgemein!$H$8:$I$45,2,FALSE),\"\")","v":""},{"$f":"VLOOKUP(B38,Personalstamm!$D$8:$F$14,3,FALSE)","v":{"v":8,"d":"8.00"}},"",""]
["2026-05-30","Samstag","Wochenende",{"$nulls":5},"","",{"$f":"IF(I39=\"\",\"\",IF(AND(I39<>\"\",J39=\"\",I39>=Personalstamm!$D$20),Personalstamm!$E$20,IF(AND(I39<>\"\",J39=\"\",I39>=Personalstamm!$D$19),Personalstamm!$E$19,IF(AND(I39<>\"\",J39<Personalstamm!$E$20,I39>=Personalstamm!$D$20),Personalstamm!$E$20-J39,IF(AND(I39<>\"\",J39<Personalstamm!E$19,I39>=Personalstamm!$D$19),Personalstamm!$E$19-J39,0)))))","v":""},"","",{"$f":"IF(OR(M39=\"\",M39=\"Bitte auswählen\"),\"\",IF(M39=\"Feiertag\",T39*U39,IF(M39=\"Gleittag\",0,VLOOKUP(B39,Personalstamm!$D$8:$F$14,3,FALSE))))","v":""},{"$f":"VLOOKUP(B39,Personalstamm!$D$8:$E$14,2,FALSE)","v":{"v":0,"d":"0.00"}},"",{"v":0,"d":"0.00"},null,{"$f":"IF(COUNTIF(Allgemein!$H$8:$H$45,A39)>0,\"Feiertag\",\"\")","v":""},{"$f":"IFERROR(VLOOKUP(A39,Allgemein!$H$8:$I$45,2,FALSE),\"\")","v":""},{"$f":"VLOOKUP(B39,Personalstamm!$D$8:$F$14,3,FALSE)","v":{"v":0,"d":"0.00"}},"",""]
["2026-05-31","Sonntag","Wochenende",{"$nulls":5},"","",{"$f":"IF(I40=\"\",\"\",IF(AND(I40<>\"\",J40=\"\",I40>=Personalstamm!$D$20),Personalstamm!$E$20,IF(AND(I40<>\"\",J40=\"\",I40>=Personalstamm!$D$19),Personalstamm!$E$19,IF(AND(I40<>\"\",J40<Personalstamm!$E$20,I40>=Personalstamm!$D$20),Personalstamm!$E$20-J40,IF(AND(I40<>\"\",J40<Personalstamm!E$19,I40>=Personalstamm!$D$19),Personalstamm!$E$19-J40,0)))))","v":""},"","",{"$f":"IF(OR(M40=\"\",M40=\"Bitte auswählen\"),\"\",IF(M40=\"Feiertag\",T40*U40,IF(M40=\"Gleittag\",0,VLOOKUP(B40,Personalstamm!$D$8:$F$14,3,FALSE))))","v":""},{"$f":"VLOOKUP(B40,Personalstamm!$D$8:$E$14,2,FALSE)","v":{"v":0,"d":"0.00"}},"",{"v":0,"d":"0.00"},null,{"$f":"IF(COUNTIF(Allgemein!$H$8:$H$45,A40)>0,\"Feiertag\",\"\")","v":""},{"$f":"IFERROR(VLOOKUP(A40,Allgemein!$H$8:$I$45,2,FALSE),\"\")","v":""},{"$f":"VLOOKUP(B40,Personalstamm!$D$8:$F$14,3,FALSE)","v":{"v":0,"d":"0.00"}},"",""]
["Summe",{"$nulls":7},{"$f":"SUM(I10:I40)","v":{"v":0,"d":"0.00"}},{"$f":"SUM(J10:J40)","v":{"v":0,"d":"0.00"}},{"$f":"SUM(K10:K40)","v":{"v":0,"d":"0.00"}},{"$f":"SUM(L10:L40)","v":{"v":0,"d":"0.00"}},null,{"$f":"SUM(N10:N40)","v":{"v":32,"d":"32.00"}},{"$f":"SUM(O10:O40)","v":{"v":168,"d":"168.00"}},{"$f":"SUM(P10:P40)","v":{"v":0,"d":"0.00"}}]
[]
["Art","Anzahl Tage",null,"Fehlzeitenart","Anzahl Tage","Anzahl Stunden",null,"Urlaub genommen","Urlaub geplant"]
["Monat",{"$f":"COUNTIF($C$10:$C$40,\"*\")","v":{"v":31,"d":"31.00"}},null,"Urlaub",{"$f":"COUNTIF($M$10:$M$40,Allgemein!$I$50)","v":{"v":0,"d":"0.00"}},{"$f":"SUMIF($M$10:$M$40,Allgemein!$I$50,$N$10:$N$40)","v":{"v":0,"d":"0.00"}},null,{"$f":"COUNTIFS($A$10:$A$40,\"<\"&TODAY(),$M$10:$M$40,\"Urlaub\")","v":{"v":0,"d":"0.00"}},{"$f":"COUNTIFS($A$10:$A$40,\">=\"&TODAY(),$M$10:$M$40,\"Urlaub\")","v":{"v":0,"d":"0.00"}}]
["Anwesenheit",{"$f":"COUNTIF($C$10:$C$40,Allgemein!$G$50)","v":{"v":0,"d":"0.00"}},null,"Krankheit",{"$f":"COUNTIF($M$10:$M$40,Allgemein!$I$51)","v":{"v":0,"d":"0.00"}},{"$f":"SUMIF($M$10:$M$40,Allgemein!$I$51,$N$10:$N$40)","v":{"v":0,"d":"0.00"}}]
["Fehlzeit",{"$f":"COUNTIF($C$10:$C$40,Allgemein!$G$51)","v":{"v":5,"d":"5.00"}},null,"Kurzarbeit",{"$f":"COUNTIF($M$10:$M$40,Allgemein!$I$52)","v":{"v":0,"d":"0.00"}},{"$f":"SUMIF($M$10:$M$40,Allgemein!$I$52,$N$10:$N$40)","v":{"v":0,"d":"0.00"}}]
["Wochenende",{"$f":"COUNTIF($C$10:$C$40,Allgemein!$G$52)","v":{"v":9,"d":"9.00"}},null,"Mutterschutz",{"$f":"COUNTIF($M$10:$M$40,Allgemein!$I$53)","v":{"v":0,"d":"0.00"}},{"$f":"SUMIF($M$10:$M$40,Allgemein!$I$53,$N$10:$N$40)","v":{"v":0,"d":"0.00"}}]
["Undefiniert",{"$f":"COUNTIF($C$10:$C$40,Allgemein!$G$49)","v":{"v":17,"d":"17.00"}},null,"Fortbildung",{"$f":"COUNTIF($M$10:$M$40,Allgemein!$I$54)","v":{"v":0,"d":"0.00"}},{"$f":"SUMIF($M$10:$M$40,Allgemein!$I$54,$N$10:$N$40)","v":{"v":0,"d":"0.00"}}]
[{"$nulls":3},"Elternzeit",{"$f":"COUNTIF($M$10:$M$40,Allgemein!$I$55)","v":{"v":0,"d":"0.00"}},{"$f":"SUMIF($M$10:$M$40,Allgemein!$I$55,$N$10:$N$40)","v":{"v":0,"d":"0.00"}}]
[{"$nulls":3},"Gleittag",{"$f":"COUNTIF($M$10:$M$40,Allgemein!$I$56)","v":{"v":0,"d":"0.00"}},{"$f":"SUMIF($M$10:$M$40,Allgemein!$I$56,$V$10:$V$40)","v":{"v":0,"d":"0.00"}}]
[{"$nulls":3},"Schule",{"$f":"COUNTIF($M$10:$M$40,Allgemein!$I$57)","v":{"v":0,"d":"0.00"}},{"$f":"SUMIF($M$10:$M$40,Allgemein!$I$57,$N$10:$N$40)","v":{"v":0,"d":"0.00"}}]
[{"$nulls":3},"Feiertag",{"$f":"COUNTIF($M$10:$M$40,Allgemein!$I$58)","v":{"v":5,"d":"5.00"}},{"$f":"SUMIF($M$10:$M$40,Allgemein!$I$58,$N$10:$N$40)","v":{"v":32,"d":"32.00"}}]
[{"$nulls":3},"Undefiniert",{"$f":"COUNTIF($M$10:$M$40,Allgemein!$I$49)","v":{"v":0,"d":"0.00"}},{"$f":"SUMIF($M$10:$M$40,Allgemein!$I$49,$N$10:$N$40)","v":{"v":0,"d":"0.00"}}]

{"sheet":"Jun.","index":10,"n_rows":52,"n_cols":23,"rows_kept":52}
[]
[]
[]
[]
[]
["Urlaubsvortrag",{"$f":"Mai!$F$6","v":{"v":30,"d":"30.00"}},"Urlaub genommen",{"$f":"$H$43","v":{"v":0,"d":"0.00"}},"Resturlaub",{"$f":"$B$6-$D$6","v":{"v":30,"d":"30.00"}}]
["Saldovortrag",{"$f":"Mai!$F$7","v":{"v":0,"d":"0.00"}},"Saldoänderung",{"$f":"$P$40","v":{"v":0,"d":"0.00"}},"Kumulierter Saldo",{"$f":"$B$7+$D$7","v":{"v":0,"d":"0.00"}}]
[]
["Datum","Wochentag","Art","Arbeitsort","Von Uhrzeit","Bis Uhrzeit","Von Uhrzeit","Bis Uhrzeit","Bruttoarbeitszeit","Geb. Pause","Mindestpause","Nettoarbeitszeit","Fehlzeitenart","Fehlstunden","Sollstunden","Tagessaldo","Kumulierter Saldo",null,"Feiertag","Feiertag Anteil Tag","FZ-Gutschrift","Gleittag","Ausgewertet"]
["2026-06-01",{"$f":"TEXT(A10,\"tttt\")","v":"Montag"},{"$f":"IF(AND(S10=\"Feiertag\",T10>0),\"Fehlzeit\",IF(OR(B10=\"Samstag\",B10=\"Sonntag\"),\"Wochenende\",\"Bitte auswählen\"))","v":"Bitte auswählen"},{"$nulls":5},{"$f":"IF(AND(OR(C10=\"Anwesenheit\",C10=\"Wochenende\"),E10<>\"\",F10<>\"\",W10=\"Ja\"),((F10-E10)+(H10-G10))*24,\"\")","v":""},{"$f":"IF(I10=\"\",\"\",IF(AND(G10<>\"\",H10<>\"\"),(G10-F10)*24,0))","v":""},{"$f":"IF(I10=\"\",\"\",IF(AND(I10<>\"\",J10=\"\",I10>=Personalstamm!$D$20),Personalstamm!$E$20,IF(AND(I10<>\"\",J10=\"\",I10>=Personalstamm!$D$19),Personalstamm!$E$19,IF(AND(I10<>\"\",J10<Personalstamm!$E$20,I10>=Personalstamm!$D$20),Personalstamm!$E$20-J10,IF(AND(I10<>\"\",J10<Personalstamm!E$19,I10>=Personalstamm!$D$19),Personalstamm!$E$19-J10,0)))))","v":""},{"$f":"IF(I10<>\"\",I10-K10,\"\")","v":""},{"$f":"IF(AND(S10=\"Feiertag\",T10>0),\"Feiertag\",IF(C10=\"Fehlzeit\",\"Bitte auswählen\",\"\"))","v":""},{"$f":"IF(OR(M10=\"\",M10=\"Bitte auswählen\"),\"\",IF(M10=\"Feiertag\",T10*U10,IF(M10=\"Gleittag\",0,VLOOKUP(B10,Personalstamm!$D$8:$F$14,3,FALSE))))","v":""},{"$f":"VLOOKUP(B10,Personalstamm!$D$8:$E$14,2,FALSE)","v":{"v":8,"d":"8.00"}},{"$f":"IF(AND(OR(C10=\"Anwesenheit\",C10=\"Wochenende\"),L10<>\"\"),L10-O10,IF(AND(C10=\"Fehlzeit\",N10<>\"\",W10=\"Ja\"),N10-O10,IF(W10=\"Ja\",-O10,\"\")))","v":""},{"$f":"IF(P10=\"\",B7,B7+P10)","v":{"v":0,"d":"0.00"}},null,{"$f":"IF(COUNTIF(Allgemein!$H$8:$H$45,A10)>0,\"Feiertag\",\"\")","v":"Feiertag"},{"$f":"IFERROR(VLOOKUP(A10,Allgemein!$H$8:$I$45,2,FALSE),\"\")","v":{"v":0,"d":"0.00"}},{"$f":"VLOOKUP(B10,Personalstamm!$D$8:$F$14,3,FALSE)","v":{"v":8,"d":"8.00"}},{"$f":"IF(M10=\"Gleittag\",ABS(P10),\"\")","v":""},{"$f":"IF(A10<=TODAY(),\"Ja\",\"\")","v":""}]
["2026-06-02",{"$f":"TEXT(A11,\"tttt\")","v":"Dienstag"},{"$f":"IF(AND(S11=\"Feiertag\",T11>0),\"Fehlzeit\",IF(OR(B11=\"Samstag\",B11=\"Sonntag\"),\"Wochenende\",\"Bitte auswählen\"))","v":"Bitte auswählen"},{"$nulls":5},{"$f":"IF(AND(OR(C11=\"Anwesenheit\",C11=\"Wochenende\"),E11<>\"\",F11<>\"\",W11=\"Ja\"),((F11-E11)+(H11-G11))*24,\"\")","v":""},{"$f":"IF(I11=\"\",\"\",IF(AND(G11<>\"\",H11<>\"\"),(G11-F11)*24,0))","v":""},{"$f":"IF(I11=\"\",\"\",IF(AND(I11<>\"\",J11=\"\",I11>=Personalstamm!$D$20),Personalstamm!$E$20,IF(AND(I11<>\"\",J11=\"\",I11>=Personalstamm!$D$19),Personalstamm!$E$19,IF(AND(I11<>\"\",J11<Personalstamm!$E$20,I11>=Personalstamm!$D$20),Personalstamm!$E$20-J11,IF(AND(I11<>\"\",J11<Personalstamm!E$19,I11>=Personalstamm!$D$19),Personalstamm!$E$19-J11,0)))))","v":""},{"$f":"IF(I11<>\"\",I11-K11,\"\")","v":""},{"$f":"IF(AND(S11=\"Feiertag\",T11>0),\"Feiertag\",IF(C11=\"Fehlzeit\",\"Bitte auswählen\",\"\"))","v":""},{"$f":"IF(OR(M11=\"\",M11=\"Bitte auswählen\"),\"\",IF(M11=\"Feiertag\",T11*U11,IF(M11=\"Gleittag\",0,VLOOKUP(B11,Personalstamm!$D$8:$F$14,3,FALSE))))","v":""},{"$f":"VLOOKUP(B11,Personalstamm!$D$8:$E$14,2,FALSE)","v":{"v":8,"d":"8.00"}},{"$f":"IF(AND(OR(C11=\"Anwesenheit\",C11=\"Wochenende\"),L11<>\"\"),L11-O11,IF(AND(C11=\"Fehlzeit\",N11<>\"\",W11=\"Ja\"),N11-O11,IF(W11=\"Ja\",-O11,\"\")))","v":""},{"$f":"IF(P11=\"\",Q10,Q10+P11)","v":{"v":0,"d":"0.00"}},null,{"$f":"IF(COUNTIF(Allgemein!$H$8:$H$45,A11)>0,\"Feiertag\",\"\")","v":""},{"$f":"IFERROR(VLOOKUP(A11,Allgemein!$H$8:$I$45,2,FALSE),\"\")","v":""},{"$f":"VLOOKUP(B11,Personalstamm!$D$8:$F$14,3,FALSE)","v":{"v":8,"d":"8.00"}},{"$f":"IF(M11=\"Gleittag\",ABS(P11),\"\")","v":""},{"$f":"IF(A11<=TODAY(),\"Ja\",\"\")","v":""}]
["2026-06-03","Mittwoch","Bitte auswählen",{"$nulls":5},"","",{"$f":"IF(I12=\"\",\"\",IF(AND(I12<>\"\",J12=\"\",I12>=Personalstamm!$D$20),Personalstamm!$E$20,IF(AND(I12<>\"\",J12=\"\",I12>=Personalstamm!$D$19),Personalstamm!$E$19,IF(AND(I12<>\"\",J12<Personalstamm!$E$20,I12>=Personalstamm!$D$20),Personalstamm!$E$20-J12,IF(AND(I12<>\"\",J12<Personalstamm!E$19,I12>=Personalstamm!$D$19),Personalstamm!$E$19-J12,0)))))","v":""},"","",{"$f":"IF(OR(M12=\"\",M12=\"Bitte auswählen\"),\"\",IF(M12=\"Feiertag\",T12*U12,IF(M12=\"Gleittag\",0,VLOOKUP(B12,Personalstamm!$D$8:$F$14,3,FALSE))))","v":""},{"$f":"VLOOKUP(B12,Personalstamm!$D$8:$E$14,2,FALSE)","v":{"v":8,"d":"8.00"}},"",{"$f":"IF(P12=\"\",Q11,Q11+P12)","v":{"v":0,"d":"0.00"}},null,{"$f":"IF(COUNTIF(Allgemein!$H$8:$H$45,A12)>0,\"Feiertag\",\"\")","v":""},{"$f":"IFERROR(VLOOKUP(A12,Allgemein!$H$8:$I$45,2,FALSE),\"\")","v":""},{"$f":"VLOOKUP(B12,Personalstamm!$D$8:$F$14,3,FALSE)","v":{"v":8,"d":"8.00"}},"",""]
["2026-06-04","Donnerstag","Fehlzeit",{"$nulls":5},"","",{"$f":"IF(I13=\"\",\"\",IF(AND(I13<>\"\",J13=\"\",I13>=Personalstamm!$D$20),Personalstamm!$E$20,IF(AND(I13<>\"\",J13=\"\",I13>=Personalstamm!$D$19),Personalstamm!$E$19,IF(AND(I13<>\"\",J13<Personalstamm!$E$20,I13>=Personalstamm!$D$20),Personalstamm!$E$20-J13,IF(AND(I13<>\"\",J13<Personalstamm!E$19,I13>=Personalstamm!$D$19),Personalstamm!$E$19-J13,0)))))","v":""},"","Feiertag",{"$f":"IF(OR(M13=\"\",M13=\"Bitte auswählen\"),\"\",IF(M13=\"Feiertag\",T13*U13,IF(M13=\"Gleittag\",0,VLOOKUP(B13,Personalstamm!$D$8:$F$14,3,FALSE))))","v":{"v":8,"d":"8.00"}},{"$f":"VLOOKUP(B13,Personalstamm!$D$8:$E$14,2,FALSE)","v":{"v":8,"d":"8.00"}},"",{"v":0,"d":"0.00"},null,{"$f":"IF(COUNTIF(Allgemein!$H$8:$H$45,A13)>0,\"Feiertag\",\"\")","v":"Feiertag"},{"$f":"IFERROR(VLOOKUP(A13,Allgemein!$H$8:$I$45,2,FALSE),\"\")","v":{"v":1,"d":"1.00"}},{"$f":"VLOOKUP(B13,Personalstamm!$D$8:$F$14,3,FALSE)","v":{"v":8,"d":"8.00"}},"",""]
["2026-06-05","Freitag","Bitte auswählen",{"$nulls":5},"","",{"$f":"IF(I14=\"\",\"\",IF(AND(I14<>\"\",J14=\"\",I14>=Personalstamm!$D$20),Personalstamm!$E$20,IF(AND(I14<>\"\",J14=\"\",I14>=Personalstamm!$D$19),Personalstamm!$E$19,IF(AND(I14<>\"\",J14<Personalstamm!$E$20,I14>=Personalstamm!$D$20),Personalstamm!$E$20-J14,IF(AND(I14<>\"\",J14<Personalstamm!E$19,I14>=Personalstamm!$D$19),Personalstamm!$E$19-J14,0)))))","v":""},"","",{"$f":"IF(OR(M14=\"\",M14=\"Bitte auswählen\"),\"\",IF(M14=\"Feiertag\",T14*U14,IF(M14=\"Gleittag\",0,VLOOKUP(B14,Personalstamm!$D$8:$F$14,3,FALSE))))","v":""},{"$f":"VLOOKUP(B14,Personalstamm!$D$8:$E$14,2,FALSE)","v":{"v":8,"d":"8.00"}},"",{"v":0,"d":"0.00"},null,{"$f":"IF(COUNTIF(Allgemein!$H$8:$H$45,A14)>0,\"Feiertag\",\"\")","v":""},{"$f":"IFERROR(VLOOKUP(A14,Allgemein!$H$8:$I$45,2,FALSE),\"\")","v":""},{"$f":"VLOOKUP(B14,Personalstamm!$D$8:$F$14,3,FALSE)","v":{"v":8,"d":"8.00"}},"",""]
["2026-06-06","Samstag","Wochenende",{"$nulls":5},"","",{"$f":"IF(I15=\"\",\"\",IF(AND(I15<>\"\",J15=\"\",I15>=Personalstamm!$D$20),Personalstamm!$E$20,IF(AND(I15<>\"\",J15=\"\",I15>=Personalstamm!$D$19),Personalstamm!$E$19,IF(AND(I15<>\"\",J15<Personalstamm!$E$20,I15>=Personalstamm!$D$20),Personalstamm!$E$20-J15,IF(AND(I15<>\"\",J15<Personalstamm!E$19,I15>=Personalstamm!$D$19),Personalstamm!$E$19-J15,0)))))","v":""},"","",{"$f":"IF(OR(M15=\"\",M15=\"Bitte auswählen\"),\"\",IF(M15=\"Feiertag\",T15*U15,IF(M15=\"Gleittag\",0,VLOOKUP(B15,Personalstamm!$D$8:$F$14,3,FALSE))))","v":""},{"$f":"VLOOKUP(B15,Personalstamm!$D$8:$E$14,2,FALSE)","v":{"v":0,"d":"0.00"}},"",{"v":0,"d":"0.00"},null,{"$f":"IF(COUNTIF(Allgemein!$H$8:$H$45,A15)>0,\"Feiertag\",\"\")","v":""},{"$f":"IFERROR(VLOOKUP(A15,Allgemein!$H$8:$I$45,2,FALSE),\"\")","v":""},{"$f":"VLOOKUP(B15,Personalstamm!$D$8:$F$14,3,FALSE)","v":{"v":0,"d":"0.00"}},"",""]
["2026-06-07","Sonntag","Wochenende",{"$nulls":5},"","",{"$f":"IF(I16=\"\",\"\",IF(AND(I16<>\"\",J16=\"\",I16>=Personalstamm!$D$20),Personalstamm!$E$20,IF(AND(I16<>\"\",J16=\"\",I16>=Personalstamm!$D$19),Personalstamm!$E$19,IF(AND(I16<>\"\",J16<Personalstamm!$E$20,I16>=Personalstamm!$D$20),Personalstamm!$E$20-J16,IF(AND(I16<>\"\",J16<Personalstamm!E$19,I16>=Personalstamm!$D$19),Personalstamm!$E$19-J16,0)))))","v":""},"","",{"$f":"IF(OR(M16=\"\",M16=\"Bitte auswählen\"),\"\",IF(M16=\"Feiertag\",T16*U16,IF(M16=\"Gleittag\",0,VLOOKUP(B16,Personalstamm!$D$8:$F$14,3,FALSE))))","v":""},{"$f":"VLOOKUP(B16,Personalstamm!$D$8:$E$14,2,FALSE)","v":{"v":0,"d":"0.00"}},"",{"v":0,"d":"0.00"},null,{"$f":"IF(COUNTIF(Allgemein!$H$8:$H$45,A16)>0,\"Feiertag\",\"\")","v":""},{"$f":"IFERROR(VLOOKUP(A16,Allgemein!$H$8:$I$45,2,FALSE),\"\")","v":""},{"$f":"VLOOKUP(B16,Personalstamm!$D$8:$F$14,3,FALSE)","v":{"v":0,"d":"0.00"}},"",""]
["2026-06-08","Montag","Bitte auswählen",{"$nulls":5},"","",{"$f":"IF(I17=\"\",\"\",IF(AND(I17<>\"\",J17=\"\",I17>=Personalstamm!$D$20),Personalstamm!$E$20,IF(AND(I17<>\"\",J17=\"\",I17>=Personalstamm!$D$19),Personalstamm!$E$19,IF(AND(I17<>\"\",J17<Personalstamm!$E$20,I17>=Personalstamm!$D$20),Personalstamm!$E$20-J17,IF(AND(I17<>\"\",J17<Personalstamm!E$19,I17>=Personalstamm!$D$19),Personalstamm!$E$19-J17,0)))))","v":""},"","",{"$f":"IF(OR(M17=\"\",M17=\"Bitte auswählen\"),\"\",IF(M17=\"Feiertag\",T17*U17,IF(M17=\"Gleittag\",0,VLOOKUP(B17,Personalstamm!$D$8:$F$14,3,FALSE))))","v":""},{"$f":"VLOOKUP(B17,Personalstamm!$D$8:$E$14,2,FALSE)","v":{"v":8,"d":"8.00"}},"",{"v":0,"d":"0.00"},null,{"$f":"IF(COUNTIF(Allgemein!$H$8:$H$45,A17)>0,\"Feiertag\",\"\")","v":""},{"$f":"IFERROR(VLOOKUP(A17,Allgemein!$H$8:$I$45,2,FALSE),\"\")","v":""},{"$f":"VLOOKUP(B17,Personalstamm!$D$8:$F$14,3,FALSE)","v":{"v":8,"d":"8.00"}},"",""]
["2026-06-09","Dienstag","Bitte auswählen",{"$nulls":5},"","",{"$f":"IF(I18=\"\",\"\",IF(AND(I18<>\"\",J18=\"\",I18>=Personalstamm!$D$20),Personalstamm!$E$20,IF(AND(I18<>\"\",J18=\"\",I18>=Personalstamm!$D$19),Personalstamm!$E$19,IF(AND(I18<>\"\",J18<Personalstamm!$E$20,I18>=Personalstamm!$D$20),Personalstamm!$E$20-J18,IF(AND(I18<>\"\",J18<Personalstamm!E$19,I18>=Personalstamm!$D$19),Personalstamm!$E$19-J18,0)))))","v":""},"","",{"$f":"IF(OR(M18=\"\",M18=\"Bitte auswählen\"),\"\",IF(M18=\"Feiertag\",T18*U18,IF(M18=\"Gleittag\",0,VLOOKUP(B18,Personalstamm!$D$8:$F$14,3,FALSE))))","v":""},{"$f":"VLOOKUP(B18,Personalstamm!$D$8:$E$14,2,FALSE)","v":{"v":8,"d":"8.00"}},"",{"v":0,"d":"0.00"},null,{"$f":"IF(COUNTIF(Allgemein!$H$8:$H$45,A18)>0,\"Feiertag\",\"\")","v":""},{"$f":"IFERROR(VLOOKUP(A18,Allgemein!$H$8:$I$45,2,FALSE),\"\")","v":""},{"$f":"VLOOKUP(B18,Personalstamm!$D$8:$F$14,3,FALSE)","v":{"v":8,"d":"8.00"}},"",""]
["2026-06-10","Mittwoch","Bitte auswählen",{"$nulls":5},"","",{"$f":"IF(I19=\"\",\"\",IF(AND(I19<>\"\",J19=\"\",I19>=Personalstamm!$D$20),Personalstamm!$E$20,IF(AND(I19<>\"\",J19=\"\",I19>=Personalstamm!$D$19),Personalstamm!$E$19,IF(AND(I19<>\"\",J19<Personalstamm!$E$20,I19>=Personalstamm!$D$20),Personalstamm!$E$20-J19,IF(AND(I19<>\"\",J19<Personalstamm!E$19,I19>=Personalstamm!$D$19),Personalstamm!$E$19-J19,0)))))","v":""},"","",{"$f":"IF(OR(M19=\"\",M19=\"Bitte auswählen\"),\"\",IF(M19=\"Feiertag\",T19*U19,IF(M19=\"Gleittag\",0,VLOOKUP(B19,Personalstamm!$D$8:$F$14,3,FALSE))))","v":""},{"$f":"VLOOKUP(B19,Personalstamm!$D$8:$E$14,2,FALSE)","v":{"v":8,"d":"8.00"}},"",{"v":0,"d":"0.00"},null,{"$f":"IF(COUNTIF(Allgemein!$H$8:$H$45,A19)>0,\"Feiertag\",\"\")","v":""},{"$f":"IFERROR(VLOOKUP(A19,Allgemein!$H$8:$I$45,2,FALSE),\"\")","v":""},{"$f":"VLOOKUP(B19,Personalstamm!$D$8:$F$14,3,FALSE)","v":{"v":8,"d":"8.00"}},"",""]
["2026-06-11","Donnerstag","Bitte auswählen",{"$nulls":5},"","",{"$f":"IF(I20=\"\",\"\",IF(AND(I20<>\"\",J20=\"\",I20>=Personalstamm!$D$20),Personalstamm!$E$20,IF(AND(I20<>\"\",J20=\"\",I20>=Personalstamm!$D$19),Personalstamm!$E$19,IF(AND(I20<>\"\",J20<Personalstamm!$E$20,I20>=Personalstamm!$D$20),Personalstamm!$E$20-J20,IF(AND(I20<>\"\",J20<Personalstamm!E$19,I20>=Personalstamm!$D$19),Personalstamm!$E$19-J20,0)))))","v":""},"","",{"$f":"IF(OR(M20=\"\",M20=\"Bitte auswählen\"),\"\",IF(M20=\"Feiertag\",T20*U20,IF(M20=\"Gleittag\",0,VLOOKUP(B20,Personalstamm!$D$8:$F$14,3,FALSE))))","v":""},{"$f":"VLOOKUP(B20,Personalstamm!$D$8:$E$14,2,FALSE)","v":{"v":8,"d":"8.00"}},"",{"v":0,"d":"0.00"},null,{"$f":"IF(COUNTIF(Allgemein!$H$8:$H$45,A20)>0,\"Feiertag\",\"\")","v":""},{"$f":"IFERROR(VLOOKUP(A20,Allgemein!$H$8:$I$45,2,FALSE),\"\")","v":""},{"$f":"VLOOKUP(B20,Personalstamm!$D$8:$F$14,3,FALSE)","v":{"v":8,"d":"8.00"}},"",""]
["2026-06-12","Freitag","Bitte auswählen",{"$nulls":5},"","",{"$f":"IF(I21=\"\",\"\",IF(AND(I21<>\"\",J21=\"\",I21>=Personalstamm!$D$20),Personalstamm!$E$20,IF(AND(I21<>\"\",J21=\"\",I21>=Personalstamm!$D$19),Personalstamm!$E$19,IF(AND(I21<>\"\",J21<Personalstamm!$E$20,I21>=Personalstamm!$D$20),Personalstamm!$E$20-J21,IF(AND(I21<>\"\",J21<Personalstamm!E$19,I21>=Personalstamm!$D$19),Personalstamm!$E$19-J21,0)))))","v":""},"","",{"$f":"IF(OR(M21=\"\",M21=\"Bitte auswählen\"),\"\",IF(M21=\"Feiertag\",T21*U21,IF(M21=\"Gleittag\",0,VLOOKUP(B21,Personalstamm!$D$8:$F$14,3,FALSE))))","v":""},{"$f":"VLOOKUP(B21,Personalstamm!$D$8:$E$14,2,FALSE)","v":{"v":8,"d":"8.00"}},"",{"v":0,"d":"0.00"},null,{"$f":"IF(COUNTIF(Allgemein!$H$8:$H$45,A21)>0,\"Feiertag\",\"\")","v":""},{"$f":"IFERROR(VLOOKUP(A21,Allgemein!$H$8:$I$45,2,FALSE),\"\")","v":""},{"$f":"VLOOKUP(B21,Personalstamm!$D$8:$F$14,3,FALSE)","v":{"v":8,"d":"8.00"}},"",""]
["2026-06-13","Samstag","Wochenende",{"$nulls":5},"","",{"$f":"IF(I22=\"\",\"\",IF(AND(I22<>\"\",J22=\"\",I22>=Personalstamm!$D$20),Personalstamm!$E$20,IF(AND(I22<>\"\",J22=\"\",I22>=Personalstamm!$D$19),Personalstamm!$E$19,IF(AND(I22<>\"\",J22<Personalstamm!$E$20,I22>=Personalstamm!$D$20),Personalstamm!$E$20-J22,IF(AND(I22<>\"\",J22<Personalstamm!E$19,I22>=Personalstamm!$D$19),Personalstamm!$E$19-J22,0)))))","v":""},"","",{"$f":"IF(OR(M22=\"\",M22=\"Bitte auswählen\"),\"\",IF(M22=\"Feiertag\",T22*U22,IF(M22=\"Gleittag\",0,VLOOKUP(B22,Personalstamm!$D$8:$F$14,3,FALSE))))","v":""},{"$f":"VLOOKUP(B22,Personalstamm!$D$8:$E$14,2,FALSE)","v":{"v":0,"d":"0.00"}},"",{"v":0,"d":"0.00"},null,{"$f":"IF(COUNTIF(Allgemein!$H$8:$H$45,A22)>0,\"Feiertag\",\"\")","v":""},{"$f":"IFERROR(VLOOKUP(A22,Allgemein!$H$8:$I$45,2,FALSE),\"\")","v":""},{"$f":"VLOOKUP(B22,Personalstamm!$D$8:$F$14,3,FALSE)","v":{"v":0,"d":"0.00"}},"",""]
["2026-06-14","Sonntag","Wochenende",{"$nulls":5},"","",{"$f":"IF(I23=\"\",\"\",IF(AND(I23<>\"\",J23=\"\",I23>=Personalstamm!$D$20),Personalstamm!$E$20,IF(AND(I23<>\"\",J23=\"\",I23>=Personalstamm!$D$19),Personalstamm!$E$19,IF(AND(I23<>\"\",J23<Personalstamm!$E$20,I23>=Personalstamm!$D$20),Personalstamm!$E$20-J23,IF(AND(I23<>\"\",J23<Personalstamm!E$19,I23>=Personalstamm!$D$19),Personalstamm!$E$19-J23,0)))))","v":""},"","",{"$f":"IF(OR(M23=\"\",M23=\"Bitte auswählen\"),\"\",IF(M23=\"Feiertag\",T23*U23,IF(M23=\"Gleittag\",0,VLOOKUP(B23,Personalstamm!$D$8:$F$14,3,FALSE))))","v":""},{"$f":"VLOOKUP(B23,Personalstamm!$D$8:$E$14,2,FALSE)","v":{"v":0,"d":"0.00"}},"",{"v":0,"d":"0.00"},null,{"$f":"IF(COUNTIF(Allgemein!$H$8:$H$45,A23)>0,\"Feiertag\",\"\")","v":""},{"$f":"IFERROR(VLOOKUP(A23,Allgemein!$H$8:$I$45,2,FALSE),\"\")","v":""},{"$f":"VLOOKUP(B23,Personalstamm!$D$8:$F$14,3,FALSE)","v":{"v":0,"d":"0.00"}},"",""]
["2026-06-15","Montag","Bitte auswählen",{"$nulls":5},"","",{"$f":"IF(I24=\"\",\"\",IF(AND(I24<>\"\",J24=\"\",I24>=Personalstamm!$D$20),Personalstamm!$E$20,IF(AND(I24<>\"\",J24=\"\",I24>=Personalstamm!$D$19),Personalstamm!$E$19,IF(AND(I24<>\"\",J24<Personalstamm!$E$20,I24>=Personalstamm!$D$20),Personalstamm!$E$20-J24,IF(AND(I24<>\"\",J24<Personalstamm!E$19,I24>=Personalstamm!$D$19),Personalstamm!$E$19-J24,0)))))","v":""},"","",{"$f":"IF(OR(M24=\"\",M24=\"Bitte auswählen\"),\"\",IF(M24=\"Feiertag\",T24*U24,IF(M24=\"Gleittag\",0,VLOOKUP(B24,Personalstamm!$D$8:$F$14,3,FALSE))))","v":""},{"$f":"VLOOKUP(B24,Personalstamm!$D$8:$E$14,2,FALSE)","v":{"v":8,"d":"8.00"}},"",{"v":0,"d":"0.00"},null,{"$f":"IF(COUNTIF(Allgemein!$H$8:$H$45,A24)>0,\"Feiertag\",\"\")","v":""},{"$f":"IFERROR(VLOOKUP(A24,Allgemein!$H$8:$I$45,2,FALSE),\"\")","v":""},{"$f":"VLOOKUP(B24,Personalstamm!$D$8:$F$14,3,FALSE)","v":{"v":8,"d":"8.00"}},"",""]
["2026-06-16","Dienstag","Bitte auswählen",{"$nulls":5},"","",{"$f":"IF(I25=\"\",\"\",IF(AND(I25<>\"\",J25=\"\",I25>=Personalstamm!$D$20),Personalstamm!$E$20,IF(AND(I25<>\"\",J25=\"\",I25>=Personalstamm!$D$19),Personalstamm!$E$19,IF(AND(I25<>\"\",J25<Personalstamm!$E$20,I25>=Personalstamm!$D$20),Personalstamm!$E$20-J25,IF(AND(I25<>\"\",J25<Personalstamm!E$19,I25>=Personalstamm!$D$19),Personalstamm!$E$19-J25,0)))))","v":""},"","",{"$f":"IF(OR(M25=\"\",M25=\"Bitte auswählen\"),\"\",IF(M25=\"Feiertag\",T25*U25,IF(M25=\"Gleittag\",0,VLOOKUP(B25,Personalstamm!$D$8:$F$14,3,FALSE))))","v":""},{"$f":"VLOOKUP(B25,Personalstamm!$D$8:$E$14,2,FALSE)","v":{"v":8,"d":"8.00"}},"",{"v":0,"d":"0.00"},null,{"$f":"IF(COUNTIF(Allgemein!$H$8:$H$45,A25)>0,\"Feiertag\",\"\")","v":""},{"$f":"IFERROR(VLOOKUP(A25,Allgemein!$H$8:$I$45,2,FALSE),\"\")","v":""},{"$f":"VLOOKUP(B25,Personalstamm!$D$8:$F$14,3,FALSE)","v":{"v":8,"d":"8.00"}},"",""]
["2026-06-17","Mittwoch","Bitte auswählen",{"$nulls":5},"","",{"$f":"IF(I26=\"\",\"\",IF(AND(I26<>\"\",J26=\"\",I26>=Personalstamm!$D$20),Personalstamm!$E$20,IF(AND(I26<>\"\",J26=\"\",I26>=Personalstamm!$D$19),Personalstamm!$E$19,IF(AND(I26<>\"\",J26<Personalstamm!$E$20,I26>=Personalstamm!$D$20),Personalstamm!$E$20-J26,IF(AND(I26<>\"\",J26<Personalstamm!E$19,I26>=Personalstamm!$D$19),Personalstamm!$E$19-J26,0)))))","v":""},"","",{"$f":"IF(OR(M26=\"\",M26=\"Bitte auswählen\"),\"\",IF(M26=\"Feiertag\",T26*U26,IF(M26=\"Gleittag\",0,VLOOKUP(B26,Personalstamm!$D$8:$F$14,3,FALSE))))","v":""},{"$f":"VLOOKUP(B26,Personalstamm!$D$8:$E$14,2,FALSE)","v":{"v":8,"d":"8.00"}},"",{"v":0,"d":"0.00"},null,{"$f":"IF(COUNTIF(Allgemein!$H$8:$H$45,A26)>0,\"Feiertag\",\"\")","v":""},{"$f":"IFERROR(VLOOKUP(A26,Allgemein!$H$8:$I$45,2,FALSE),\"\")","v":""},{"$f":"VLOOKUP(B26,Personalstamm!$D$8:$F$14,3,FALSE)","v":{"v":8,"d":"8.00"}},"",""]
["2026-06-18","Donnerstag","Bitte auswählen",{"$nulls":5},"","",{"$f":"IF(I27=\"\",\"\",IF(AND(I27<>\"\",J27=\"\",I27>=Personalstamm!$D$20),Personalstamm!$E$20,IF(AND(I27<>\"\",J27=\"\",I27>=Personalstamm!$D$19),Personalstamm!$E$19,IF(AND(I27<>\"\",J27<Personalstamm!$E$20,I27>=Personalstamm!$D$20),Personalstamm!$E$20-J27,IF(AND(I27<>\"\",J27<Personalstamm!E$19,I27>=Personalstamm!$D$19),Personalstamm!$E$19-J27,0)))))","v":""},"","",{"$f":"IF(OR(M27=\"\",M27=\"Bitte auswählen\"),\"\",IF(M27=\"Feiertag\",T27*U27,IF(M27=\"Gleittag\",0,VLOOKUP(B27,Personalstamm!$D$8:$F$14,3,FALSE))))","v":""},{"$f":"VLOOKUP(B27,Personalstamm!$D$8:$E$14,2,FALSE)","v":{"v":8,"d":"8.00"}},"",{"v":0,"d":"0.00"},null,{"$f":"IF(COUNTIF(Allgemein!$H$8:$H$45,A27)>0,\"Feiertag\",\"\")","v":""},{"$f":"IFERROR(VLOOKUP(A27,Allgemein!$H$8:$I$45,2,FALSE),\"\")","v":""},{"$f":"VLOOKUP(B27,Personalstamm!$D$8:$F$14,3,FALSE)","v":{"v":8,"d":"8.00"}},"",""]
["2026-06-19","Freitag","Bitte auswählen",{"$nulls":5},"","",{"$f":"IF(I28=\"\",\"\",IF(AND(I28<>\"\",J28=\"\",I28>=Personalstamm!$D$20),Personalstamm!$E$20,IF(AND(I28<>\"\",J28=\"\",I28>=Personalstamm!$D$19),Personalstamm!$E$19,IF(AND(I28<>\"\",J28<Personalstamm!$E$20,I28>=Personalstamm!$D$20),Personalstamm!$E$20-J28,IF(AND(I28<>\"\",J28<Personalstamm!E$19,I28>=Personalstamm!$D$19),Personalstamm!$E$19-J28,0)))))","v":""},"","",{"$f":"IF(OR(M28=\"\",M28=\"Bitte auswählen\"),\"\",IF(M28=\"Feiertag\",T28*U28,IF(M28=\"Gleittag\",0,VLOOKUP(B28,Personalstamm!$D$8:$F$14,3,FALSE))))","v":""},{"$f":"VLOOKUP(B28,Personalstamm!$D$8:$E$14,2,FALSE)","v":{"v":8,"d":"8.00"}},"",{"v":0,"d":"0.00"},null,{"$f":"IF(COUNTIF(Allgemein!$H$8:$H$45,A28)>0,\"Feiertag\",\"\")","v":""},{"$f":"IFERROR(VLOOKUP(A28,Allgemein!$H$8:$I$45,2,FALSE),\"\")","v":""},{"$f":"VLOOKUP(B28,Personalstamm!$D$8:$F$14,3,FALSE)","v":{"v":8,"d":"8.00"}},"",""]
["2026-06-20","Samstag","Wochenende",{"$nulls":5},"","",{"$f":"IF(I29=\"\",\"\",IF(AND(I29<>\"\",J29=\"\",I29>=Personalstamm!$D$20),Personalstamm!$E$20,IF(AND(I29<>\"\",J29=\"\",I29>=Personalstamm!$D$19),Personalstamm!$E$19,IF(AND(I29<>\"\",J29<Personalstamm!$E$20,I29>=Personalstamm!$D$20),Personalstamm!$E$20-J29,IF(AND(I29<>\"\",J29<Personalstamm!E$19,I29>=Personalstamm!$D$19),Personalstamm!$E$19-J29,0)))))","v":""},"","",{"$f":"IF(OR(M29=\"\",M29=\"Bitte auswählen\"),\"\",IF(M29=\"Feiertag\",T29*U29,IF(M29=\"Gleittag\",0,VLOOKUP(B29,Personalstamm!$D$8:$F$14,3,FALSE))))","v":""},{"$f":"VLOOKUP(B29,Personalstamm!$D$8:$E$14,2,FALSE)","v":{"v":0,"d":"0.00"}},"",{"v":0,"d":"0.00"},null,{"$f":"IF(COUNTIF(Allgemein!$H$8:$H$45,A29)>0,\"Feiertag\",\"\")","v":""},{"$f":"IFERROR(VLOOKUP(A29,Allgemein!$H$8:$I$45,2,FALSE),\"\")","v":""},{"$f":"VLOOKUP(B29,Personalstamm!$D$8:$F$14,3,FALSE)","v":{"v":0,"d":"0.00"}},"",""]
["2026-06-21","Sonntag","Wochenende",{"$nulls":5},"","",{"$f":"IF(I30=\"\",\"\",IF(AND(I30<>\"\",J30=\"\",I30>=Personalstamm!$D$20),Personalstamm!$E$20,IF(AND(I30<>\"\",J30=\"\",I30>=Personalstamm!$D$19),Personalstamm!$E$19,IF(AND(I30<>\"\",J30<Personalstamm!$E$20,I30>=Personalstamm!$D$20),Personalstamm!$E$20-J30,IF(AND(I30<>\"\",J30<Personalstamm!E$19,I30>=Personalstamm!$D$19),Personalstamm!$E$19-J30,0)))))","v":""},"","",{"$f":"IF(OR(M30=\"\",M30=\"Bitte auswählen\"),\"\",IF(M30=\"Feiertag\",T30*U30,IF(M30=\"Gleittag\",0,VLOOKUP(B30,Personalstamm!$D$8:$F$14,3,FALSE))))","v":""},{"$f":"VLOOKUP(B30,Personalstamm!$D$8:$E$14,2,FALSE)","v":{"v":0,"d":"0.00"}},"",{"v":0,"d":"0.00"},null,{"$f":"IF(COUNTIF(Allgemein!$H$8:$H$45,A30)>0,\"Feiertag\",\"\")","v":""},{"$f":"IFERROR(VLOOKUP(A30,Allgemein!$H$8:$I$45,2,FALSE),\"\")","v":""},{"$f":"VLOOKUP(B30,Personalstamm!$D$8:$F$14,3,FALSE)","v":{"v":0,"d":"0.00"}},"",""]
["2026-06-22","Montag","Bitte auswählen",{"$nulls":5},"","",{"$f":"IF(I31=\"\",\"\",IF(AND(I31<>\"\",J31=\"\",I31>=Personalstamm!$D$20),Personalstamm!$E$20,IF(AND(I31<>\"\",J31=\"\",I31>=Personalstamm!$D$19),Personalstamm!$E$19,IF(AND(I31<>\"\",J31<Personalstamm!$E$20,I31>=Personalstamm!$D$20),Personalstamm!$E$20-J31,IF(AND(I31<>\"\",J31<Personalstamm!E$19,I31>=Personalstamm!$D$19),Personalstamm!$E$19-J31,0)))))","v":""},"","",{"$f":"IF(OR(M31=\"\",M31=\"Bitte auswählen\"),\"\",IF(M31=\"Feiertag\",T31*U31,IF(M31=\"Gleittag\",0,VLOOKUP(B31,Personalstamm!$D$8:$F$14,3,FALSE))))","v":""},{"$f":"VLOOKUP(B31,Personalstamm!$D$8:$E$14,2,FALSE)","v":{"v":8,"d":"8.00"}},"",{"v":0,"d":"0.00"},null,{"$f":"IF(COUNTIF(Allgemein!$H$8:$H$45,A31)>0,\"Feiertag\",\"\")","v":""},{"$f":"IFERROR(VLOOKUP(A31,Allgemein!$H$8:$I$45,2,FALSE),\"\")","v":""},{"$f":"VLOOKUP(B31,Personalstamm!$D$8:$F$14,3,FALSE)","v":{"v":8,"d":"8.00"}},"",""]
["2026-06-23","Dienstag","Bitte auswählen",{"$nulls":5},"","",{"$f":"IF(I32=\"\",\"\",IF(AND(I32<>\"\",J32=\"\",I32>=Personalstamm!$D$20),Personalstamm!$E$20,IF(AND(I32<>\"\",J32=\"\",I32>=Personalstamm!$D$19),Personalstamm!$E$19,IF(AND(I32<>\"\",J32<Personalstamm!$E$20,I32>=Personalstamm!$D$20),Personalstamm!$E$20-J32,IF(AND(I32<>\"\",J32<Personalstamm!E$19,I32>=Personalstamm!$D$19),Personalstamm!$E$19-J32,0)))))","v":""},"","",{"$f":"IF(OR(M32=\"\",M32=\"Bitte auswählen\"),\"\",IF(M32=\"Feiertag\",T32*U32,IF(M32=\"Gleittag\",0,VLOOKUP(B32,Personalstamm!$D$8:$F$14,3,FALSE))))","v":""},{"$f":"VLOOKUP(B32,Personalstamm!$D$8:$E$14,2,FALSE)","v":{"v":8,"d":"8.00"}},"",{"v":0,"d":"0.00"},null,{"$f":"IF(COUNTIF(Allgemein!$H$8:$H$45,A32)>0,\"Feiertag\",\"\")","v":""},{"$f":"IFERROR(VLOOKUP(A32,Allgemein!$H$8:$I$45,2,FALSE),\"\")","v":""},{"$f":"VLOOKUP(B32,Personalstamm!$D$8:$F$14,3,FALSE)","v":{"v":8,"d":"8.00"}},"",""]
["2026-06-24","Mittwoch","Bitte auswählen",{"$nulls":5},"","",{"$f":"IF(I33=\"\",\"\",IF(AND(I33<>\"\",J33=\"\",I33>=Personalstamm!$D$20),Personalstamm!$E$20,IF(AND(I33<>\"\",J33=\"\",I33>=Personalstamm!$D$19),Personalstamm!$E$19,IF(AND(I33<>\"\",J33<Personalstamm!$E$20,I33>=Personalstamm!$D$20),Personalstamm!$E$20-J33,IF(AND(I33<>\"\",J33<Personalstamm!E$19,I33>=Personalstamm!$D$19),Personalstamm!$E$19-J33,0)))))","v":""},"","",{"$f":"IF(OR(M33=\"\",M33=\"Bitte auswählen\"),\"\",IF(M33=\"Feiertag\",T33*U33,IF(M33=\"Gleittag\",0,VLOOKUP(B33,Personalstamm!$D$8:$F$14,3,FALSE))))","v":""},{"$f":"VLOOKUP(B33,Personalstamm!$D$8:$E$14,2,FALSE)","v":{"v":8,"d":"8.00"}},"",{"v":0,"d":"0.00"},null,{"$f":"IF(COUNTIF(Allgemein!$H$8:$H$45,A33)>0,\"Feiertag\",\"\")","v":""},{"$f":"IFERROR(VLOOKUP(A33,Allgemein!$H$8:$I$45,2,FALSE),\"\")","v":""},{"$f":"VLOOKUP(B33,Personalstamm!$D$8:$F$14,3,FALSE)","v":{"v":8,"d":"8.00"}},"",""]
["2026-06-25","Donnerstag","Bitte auswählen",{"$nulls":5},"","",{"$f":"IF(I34=\"\",\"\",IF(AND(I34<>\"\",J34=\"\",I34>=Personalstamm!$D$20),Personalstamm!$E$20,IF(AND(I34<>\"\",J34=\"\",I34>=Personalstamm!$D$19),Personalstamm!$E$19,IF(AND(I34<>\"\",J34<Personalstamm!$E$20,I34>=Personalstamm!$D$20),Personalstamm!$E$20-J34,IF(AND(I34<>\"\",J34<Personalstamm!E$19,I34>=Personalstamm!$D$19),Personalstamm!$E$19-J34,0)))))","v":""},"","",{"$f":"IF(OR(M34=\"\",M34=\"Bitte auswählen\"),\"\",IF(M34=\"Feiertag\",T34*U34,IF(M34=\"Gleittag\",0,VLOOKUP(B34,Personalstamm!$D$8:$F$14,3,FALSE))))","v":""},{"$f":"VLOOKUP(B34,Personalstamm!$D$8:$E$14,2,FALSE)","v":{"v":8,"d":"8.00"}},"",{"v":0,"d":"0.00"},null,{"$f":"IF(COUNTIF(Allgemein!$H$8:$H$45,A34)>0,\"Feiertag\",\"\")","v":""},{"$f":"IFERROR(VLOOKUP(A34,Allgemein!$H$8:$I$45,2,FALSE),\"\")","v":""},{"$f":"VLOOKUP(B34,Personalstamm!$D$8:$F$14,3,FALSE)","v":{"v":8,"d":"8.00"}},"",""]
["2026-06-26","Freitag","Bitte auswählen",{"$nulls":5},"","",{"$f":"IF(I35=\"\",\"\",IF(AND(I35<>\"\",J35=\"\",I35>=Personalstamm!$D$20),Personalstamm!$E$20,IF(AND(I35<>\"\",J35=\"\",I35>=Personalstamm!$D$19),Personalstamm!$E$19,IF(AND(I35<>\"\",J35<Personalstamm!$E$20,I35>=Personalstamm!$D$20),Personalstamm!$E$20-J35,IF(AND(I35<>\"\",J35<Personalstamm!E$19,I35>=Personalstamm!$D$19),Personalstamm!$E$19-J35,0)))))","v":""},"","",{"$f":"IF(OR(M35=\"\",M35=\"Bitte auswählen\"),\"\",IF(M35=\"Feiertag\",T35*U35,IF(M35=\"Gleittag\",0,VLOOKUP(B35,Personalstamm!$D$8:$F$14,3,FALSE))))","v":""},{"$f":"VLOOKUP(B35,Personalstamm!$D$8:$E$14,2,FALSE)","v":{"v":8,"d":"8.00"}},"",{"v":0,"d":"0.00"},null,{"$f":"IF(COUNTIF(Allgemein!$H$8:$H$45,A35)>0,\"Feiertag\",\"\")","v":""},{"$f":"IFERROR(VLOOKUP(A35,Allgemein!$H$8:$I$45,2,FALSE),\"\")","v":""},{"$f":"VLOOKUP(B35,Personalstamm!$D$8:$F$14,3,FALSE)","v":{"v":8,"d":"8.00"}},"",""]
["2026-06-27","Samstag","Wochenende",{"$nulls":5},"","",{"$f":"IF(I36=\"\",\"\",IF(AND(I36<>\"\",J36=\"\",I36>=Personalstamm!$D$20),Personalstamm!$E$20,IF(AND(I36<>\"\",J36=\"\",I36>=Personalstamm!$D$19),Personalstamm!$E$19,IF(AND(I36<>\"\",J36<Personalstamm!$E$20,I36>=Personalstamm!$D$20),Personalstamm!$E$20-J36,IF(AND(I36<>\"\",J36<Personalstamm!E$19,I36>=Personalstamm!$D$19),Personalstamm!$E$19-J36,0)))))","v":""},"","",{"$f":"IF(OR(M36=\"\",M36=\"Bitte auswählen\"),\"\",IF(M36=\"Feiertag\",T36*U36,IF(M36=\"Gleittag\",0,VLOOKUP(B36,Personalstamm!$D$8:$F$14,3,FALSE))))","v":""},{"$f":"VLOOKUP(B36,Personalstamm!$D$8:$E$14,2,FALSE)","v":{"v":0,"d":"0.00"}},"",{"v":0,"d":"0.00"},null,{"$f":"IF(COUNTIF(Allgemein!$H$8:$H$45,A36)>0,\"Feiertag\",\"\")","v":""},{"$f":"IFERROR(VLOOKUP(A36,Allgemein!$H$8:$I$45,2,FALSE),\"\")","v":""},{"$f":"VLOOKUP(B36,Personalstamm!$D$8:$F$14,3,FALSE)","v":{"v":0,"d":"0.00"}},"",""]
["2026-06-28","Sonntag","Wochenende",{"$nulls":5},"","",{"$f":"IF(I37=\"\",\"\",IF(AND(I37<>\"\",J37=\"\",I37>=Personalstamm!$D$20),Personalstamm!$E$20,IF(AND(I37<>\"\",J37=\"\",I37>=Personalstamm!$D$19),Personalstamm!$E$19,IF(AND(I37<>\"\",J37<Personalstamm!$E$20,I37>=Personalstamm!$D$20),Personalstamm!$E$20-J37,IF(AND(I37<>\"\",J37<Personalstamm!E$19,I37>=Personalstamm!$D$19),Personalstamm!$E$19-J37,0)))))","v":""},"","",{"$f":"IF(OR(M37=\"\",M37=\"Bitte auswählen\"),\"\",IF(M37=\"Feiertag\",T37*U37,IF(M37=\"Gleittag\",0,VLOOKUP(B37,Personalstamm!$D$8:$F$14,3,FALSE))))","v":""},{"$f":"VLOOKUP(B37,Personalstamm!$D$8:$E$14,2,FALSE)","v":{"v":0,"d":"0.00"}},"",{"v":0,"d":"0.00"},null,{"$f":"IF(COUNTIF(Allgemein!$H$8:$H$45,A37)>0,\"Feiertag\",\"\")","v":""},{"$f":"IFERROR(VLOOKUP(A37,Allgemein!$H$8:$I$45,2,FALSE),\"\")","v":""},{"$f":"VLOOKUP(B37,Personalstamm!$D$8:$F$14,3,FALSE)","v":{"v":0,"d":"0.00"}},"",""]
["2026-06-29","Montag","Bitte auswählen",{"$nulls":5},"","",{"$f":"IF(I38=\"\",\"\",IF(AND(I38<>\"\",J38=\"\",I38>=Personalstamm!$D$20),Personalstamm!$E$20,IF(AND(I38<>\"\",J38=\"\",I38>=Personalstamm!$D$19),Personalstamm!$E$19,IF(AND(I38<>\"\",J38<Personalstamm!$E$20,I38>=Personalstamm!$D$20),Personalstamm!$E$20-J38,IF(AND(I38<>\"\",J38<Personalstamm!E$19,I38>=Personalstamm!$D$19),Personalstamm!$E$19-J38,0)))))","v":""},"","",{"$f":"IF(OR(M38=\"\",M38=\"Bitte auswählen\"),\"\",IF(M38=\"Feiertag\",T38*U38,IF(M38=\"Gleittag\",0,VLOOKUP(B38,Personalstamm!$D$8:$F$14,3,FALSE))))","v":""},{"$f":"VLOOKUP(B38,Personalstamm!$D$8:$E$14,2,FALSE)","v":{"v":8,"d":"8.00"}},"",{"v":0,"d":"0.00"},null,{"$f":"IF(COUNTIF(Allgemein!$H$8:$H$45,A38)>0,\"Feiertag\",\"\")","v":""},{"$f":"IFERROR(VLOOKUP(A38,Allgemein!$H$8:$I$45,2,FALSE),\"\")","v":""},{"$f":"VLOOKUP(B38,Personalstamm!$D$8:$F$14,3,FALSE)","v":{"v":8,"d":"8.00"}},"",""]
["2026-06-30","Dienstag","Bitte auswählen",{"$nulls":5},"","",{"$f":"IF(I39=\"\",\"\",IF(AND(I39<>\"\",J39=\"\",I39>=Personalstamm!$D$20),Personalstamm!$E$20,IF(AND(I39<>\"\",J39=\"\",I39>=Personalstamm!$D$19),Personalstamm!$E$19,IF(AND(I39<>\"\",J39<Personalstamm!$E$20,I39>=Personalstamm!$D$20),Personalstamm!$E$20-J39,IF(AND(I39<>\"\",J39<Personalstamm!E$19,I39>=Personalstamm!$D$19),Personalstamm!$E$19-J39,0)))))","v":""},"","",{"$f":"IF(OR(M39=\"\",M39=\"Bitte auswählen\"),\"\",IF(M39=\"Feiertag\",T39*U39,IF(M39=\"Gleittag\",0,VLOOKUP(B39,Personalstamm!$D$8:$F$14,3,FALSE))))","v":""},{"$f":"VLOOKUP(B39,Personalstamm!$D$8:$E$14,2,FALSE)","v":{"v":8,"d":"8.00"}},"",{"v":0,"d":"0.00"},null,{"$f":"IF(COUNTIF(Allgemein!$H$8:$H$45,A39)>0,\"Feiertag\",\"\")","v":""},{"$f":"IFERROR(VLOOKUP(A39,Allgemein!$H$8:$I$45,2,FALSE),\"\")","v":""},{"$f":"VLOOKUP(B39,Personalstamm!$D$8:$F$14,3,FALSE)","v":{"v":8,"d":"8.00"}},"",""]
["Summe",{"$nulls":7},{"$f":"SUM(I10:I39)","v":{"v":0,"d":"0.00"}},{"$f":"SUM(J10:J39)","v":{"v":0,"d":"0.00"}},{"$f":"SUM(K10:K39)","v":{"v":0,"d":"0.00"}},{"$f":"SUM(L10:L39)","v":{"v":0,"d":"0.00"}},null,{"$f":"SUM(N10:N39)","v":{"v":8,"d":"8.00"}},{"$f":"SUM(O10:O39)","v":{"v":176,"d":"176.00"}},{"$f":"SUM(P10:P39)","v":{"v":0,"d":"0.00"}}]
[]
["Art","Anzahl Tage",null,"Fehlzeitenart","Anzahl Tage","Anzahl Stunden",null,"Urlaub genommen","Urlaub geplant"]
["Monat",{"$f":"COUNTIF($C$10:$C$39,\"*\")","v":{"v":30,"d":"30.00"}},null,"Urlaub",{"$f":"COUNTIF($M$10:$M$39,Allgemein!$I$50)","v":{"v":0,"d":"0.00"}},{"$f":"SUMIF($M$10:$M$39,Allgemein!$I$50,$N$10:$N$39)","v":{"v":0,"d":"0.00"}},null,{"$f":"COUNTIFS($A$10:$A$39,\"<\"&TODAY(),$M$10:$M$39,\"Urlaub\")","v":{"v":0,"d":"0.00"}},{"$f":"COUNTIFS($A$10:$A$39,\">=\"&TODAY(),$M$10:$M$39,\"Urlaub\")","v":{"v":0,"d":"0.00"}}]
["Anwesenheit",{"$f":"COUNTIF($C$10:$C$39,Allgemein!$G$50)","v":{"v":0,"d":"0.00"}},null,"Krankheit",{"$f":"COUNTIF($M$10:$M$39,Allgemein!$I$51)","v":{"v":0,"d":"0.00"}},{"$f":"SUMIF($M$10:$M$39,Allgemein!$I$51,$N$10:$N$39)","v":{"v":0,"d":"0.00"}}]
["Fehlzeit",{"$f":"COUNTIF($C$10:$C$39,Allgemein!$G$51)","v":{"v":1,"d":"1.00"}},null,"Kurzarbeit",{"$f":"COUNTIF($M$10:$M$39,Allgemein!$I$52)","v":{"v":0,"d":"0.00"}},{"$f":"SUMIF($M$10:$M$39,Allgemein!$I$52,$N$10:$N$39)","v":{"v":0,"d":"0.00"}}]
["Wochenende",{"$f":"COUNTIF($C$10:$C$39,Allgemein!$G$52)","v":{"v":8,"d":"8.00"}},null,"Mutterschutz",{"$f":"COUNTIF($M$10:$M$39,Allgemein!$I$53)","v":{"v":0,"d":"0.00"}},{"$f":"SUMIF($M$10:$M$39,Allgemein!$I$53,$N$10:$N$39)","v":{"v":0,"d":"0.00"}}]
["Undefiniert",{"$f":"COUNTIF($C$10:$C$39,Allgemein!$G$49)","v":{"v":21,"d":"21.00"}},null,"Fortbildung",{"$f":"COUNTIF($M$10:$M$39,Allgemein!$I$54)","v":{"v":0,"d":"0.00"}},{"$f":"SUMIF($M$10:$M$39,Allgemein!$I$54,$N$10:$N$39)","v":{"v":0,"d":"0.00"}}]
[{"$nulls":3},"Elternzeit",{"$f":"COUNTIF($M$10:$M$39,Allgemein!$I$55)","v":{"v":0,"d":"0.00"}},{"$f":"SUMIF($M$10:$M$39,Allgemein!$I$55,$N$10:$N$39)","v":{"v":0,"d":"0.00"}}]
[{"$nulls":3},"Gleittag",{"$f":"COUNTIF($M$10:$M$39,Allgemein!$I$56)","v":{"v":0,"d":"0.00"}},{"$f":"SUMIF($M$10:$M$39,Allgemein!$I$56,$V$10:$V$39)","v":{"v":0,"d":"0.00"}}]
[{"$nulls":3},"Schule",{"$f":"COUNTIF($M$10:$M$39,Allgemein!$I$57)","v":{"v":0,"d":"0.00"}},{"$f":"SUMIF($M$10:$M$39,Allgemein!$I$57,$N$10:$N$39)","v":{"v":0,"d":"0.00"}}]
[{"$nulls":3},"Feiertag",{"$f":"COUNTIF($M$10:$M$39,Allgemein!$I$58)","v":{"v":1,"d":"1.00"}},{"$f":"SUMIF($M$10:$M$39,Allgemein!$I$58,$N$10:$N$39)","v":{"v":8,"d":"8.00"}}]
[{"$nulls":3},"Undefiniert",{"$f":"COUNTIF($M$10:$M$39,Allgemein!$I$49)","v":{"v":0,"d":"0.00"}},{"$f":"SUMIF($M$10:$M$39,Allgemein!$I$49,$N$10:$N$39)","v":{"v":0,"d":"0.00"}}]

{"sheet":"Jul.","index":11,"n_rows":53,"n_cols":23,"rows_kept":53}
[]
[]
[]
[]
[]
["Urlaubsvortrag",{"$f":"Jun.!$F$6","v":{"v":30,"d":"30.00"}},"Urlaub genommen",{"$f":"$H$44","v":{"v":0,"d":"0.00"}},"Resturlaub",{"$f":"$B$6-$D$6","v":{"v":30,"d":"30.00"}}]
["Saldovortrag",{"$f":"Jun.!$F$7","v":{"v":0,"d":"0.00"}},"Saldoänderung",{"$f":"$P$41","v":{"v":0,"d":"0.00"}},"Kumulierter Saldo",{"$f":"$B$7+$D$7","v":{"v":0,"d":"0.00"}}]
[]
["Datum","Wochentag","Art","Arbeitsort","Von Uhrzeit","Bis Uhrzeit","Von Uhrzeit","Bis Uhrzeit","Bruttoarbeitszeit","Geb. Pause","Mindestpause","Nettoarbeitszeit","Fehlzeitenart","Fehlstunden","Sollstunden","Tagessaldo","Kumulierter Saldo",null,"Feiertag","Feiertag Anteil Tag","FZ-Gutschrift","Gleittag","Ausgewertet"]
["2026-07-01",{"$f":"TEXT(A10,\"tttt\")","v":"Mittwoch"},{"$f":"IF(AND(S10=\"Feiertag\",T10>0),\"Fehlzeit\",IF(OR(B10=\"Samstag\",B10=\"Sonntag\"),\"Wochenende\",\"Bitte auswählen\"))","v":"Bitte auswählen"},{"$nulls":5},{"$f":"IF(AND(OR(C10=\"Anwesenheit\",C10=\"Wochenende\"),E10<>\"\",F10<>\"\",W10=\"Ja\"),((F10-E10)+(H10-G10))*24,\"\")","v":""},{"$f":"IF(I10=\"\",\"\",IF(AND(G10<>\"\",H10<>\"\"),(G10-F10)*24,0))","v":""},{"$f":"IF(I10=\"\",\"\",IF(AND(I10<>\"\",J10=\"\",I10>=Personalstamm!$D$20),Personalstamm!$E$20,IF(AND(I10<>\"\",J10=\"\",I10>=Personalstamm!$D$19),Personalstamm!$E$19,IF(AND(I10<>\"\",J10<Personalstamm!$E$20,I10>=Personalstamm!$D$20),Personalstamm!$E$20-J10,IF(AND(I10<>\"\",J10<Personalstamm!E$19,I10>=Personalstamm!$D$19),Personalstamm!$E$19-J10,0)))))","v":""},{"$f":"IF(I10<>\"\",I10-K10,\"\")","v":""},{"$f":"IF(AND(S10=\"Feiertag\",T10>0),\"Feiertag\",IF(C10=\"Fehlzeit\",\"Bitte auswählen\",\"\"))","v":""},{"$f":"IF(OR(M10=\"\",M10=\"Bitte auswählen\"),\"\",IF(M10=\"Feiertag\",T10*U10,IF(M10=\"Gleittag\",0,VLOOKUP(B10,Personalstamm!$D$8:$F$14,3,FALSE))))","v":""},{"$f":"VLOOKUP(B10,Personalstamm!$D$8:$E$14,2,FALSE)","v":{"v":8,"d":"8.00"}},{"$f":"IF(AND(OR(C10=\"Anwesenheit\",C10=\"Wochenende\"),L10<>\"\"),L10-O10,IF(AND(C10=\"Fehlzeit\",N10<>\"\",W10=\"Ja\"),N10-O10,IF(W10=\"Ja\",-O10,\"\")))","v":""},{"$f":"IF(P10=\"\",B7,B7+P10)","v":{"v":0,"d":"0.00"}},null,{"$f":"IF(COUNTIF(Allgemein!$H$8:$H$45,A10)>0,\"Feiertag\",\"\")","v":""},{"$f":"IFERROR(VLOOKUP(A10,Allgemein!$H$8:$I$45,2,FALSE),\"\")","v":""},{"$f":"VLOOKUP(B10,Personalstamm!$D$8:$F$14,3,FALSE)","v":{"v":8,"d":"8.00"}},{"$f":"IF(M10=\"Gleittag\",ABS(P10),\"\")","v":""},{"$f":"IF(A10<=TODAY(),\"Ja\",\"\")","v":""}]
["2026-07-02",{"$f":"TEXT(A11,\"tttt\")","v":"Donnerstag"},"Bitte auswählen",{"$nulls":5},{"$f":"IF(AND(OR(C11=\"Anwesenheit\",C11=\"Wochenende\"),E11<>\"\",F11<>\"\",W11=\"Ja\"),((F11-E11)+(H11-G11))*24,\"\")","v":""},{"$f":"IF(I11=\"\",\"\",IF(AND(G11<>\"\",H11<>\"\"),(G11-F11)*24,0))","v":""},{"$f":"IF(I11=\"\",\"\",IF(AND(I11<>\"\",J11=\"\",I11>=Personalstamm!$D$20),Personalstamm!$E$20,IF(AND(I11<>\"\",J11=\"\",I11>=Personalstamm!$D$19),Personalstamm!$E$19,IF(AND(I11<>\"\",J11<Personalstamm!$E$20,I11>=Personalstamm!$D$20),Personalstamm!$E$20-J11,IF(AND(I11<>\"\",J11<Personalstamm!E$19,I11>=Personalstamm!$D$19),Personalstamm!$E$19-J11,0)))))","v":""},{"$f":"IF(I11<>\"\",I11-K11,\"\")","v":""},"",{"$f":"IF(OR(M11=\"\",M11=\"Bitte auswählen\"),\"\",IF(M11=\"Feiertag\",T11*U11,IF(M11=\"Gleittag\",0,VLOOKUP(B11,Personalstamm!$D$8:$F$14,3,FALSE))))","v":""},{"$f":"VLOOKUP(B11,Personalstamm!$D$8:$E$14,2,FALSE)","v":{"v":8,"d":"8.00"}},{"$f":"IF(AND(OR(C11=\"Anwesenheit\",C11=\"Wochenende\"),L11<>\"\"),L11-O11,IF(AND(C11=\"Fehlzeit\",N11<>\"\",W11=\"Ja\"),N11-O11,IF(W11=\"Ja\",-O11,\"\")))","v":""},{"$f":"IF(P11=\"\",Q10,Q10+P11)","v":{"v":0,"d":"0.00"}},null,{"$f":"IF(COUNTIF(Allgemein!$H$8:$H$45,A11)>0,\"Feiertag\",\"\")","v":""},{"$f":"IFERROR(VLOOKUP(A11,Allgemein!$H$8:$I$45,2,FALSE),\"\")","v":""},{"$f":"VLOOKUP(B11,Personalstamm!$D$8:$F$14,3,FALSE)","v":{"v":8,"d":"8.00"}},{"$f":"IF(M11=\"Gleittag\",ABS(P11),\"\")","v":""},{"$f":"IF(A11<=TODAY(),\"Ja\",\"\")","v":""}]
["2026-07-03","Freitag","Bitte auswählen",{"$nulls":5},"","",{"$f":"IF(I12=\"\",\"\",IF(AND(I12<>\"\",J12=\"\",I12>=Personalstamm!$D$20),Personalstamm!$E$20,IF(AND(I12<>\"\",J12=\"\",I12>=Personalstamm!$D$19),Personalstamm!$E$19,IF(AND(I12<>\"\",J12<Personalstamm!$E$20,I12>=Personalstamm!$D$20),Personalstamm!$E$20-J12,IF(AND(I12<>\"\",J12<Personalstamm!E$19,I12>=Personalstamm!$D$19),Personalstamm!$E$19-J12,0)))))","v":""},"","",{"$f":"IF(OR(M12=\"\",M12=\"Bitte auswählen\"),\"\",IF(M12=\"Feiertag\",T12*U12,IF(M12=\"Gleittag\",0,VLOOKUP(B12,Personalstamm!$D$8:$F$14,3,FALSE))))","v":""},{"$f":"VLOOKUP(B12,Personalstamm!$D$8:$E$14,2,FALSE)","v":{"v":8,"d":"8.00"}},"",{"$f":"IF(P12=\"\",Q11,Q11+P12)","v":{"v":0,"d":"0.00"}},null,{"$f":"IF(COUNTIF(Allgemein!$H$8:$H$45,A12)>0,\"Feiertag\",\"\")","v":""},{"$f":"IFERROR(VLOOKUP(A12,Allgemein!$H$8:$I$45,2,FALSE),\"\")","v":""},{"$f":"VLOOKUP(B12,Personalstamm!$D$8:$F$14,3,FALSE)","v":{"v":8,"d":"8.00"}},"",""]
["2026-07-04","Samstag","Wochenende",{"$nulls":5},"","",{"$f":"IF(I13=\"\",\"\",IF(AND(I13<>\"\",J13=\"\",I13>=Personalstamm!$D$20),Personalstamm!$E$20,IF(AND(I13<>\"\",J13=\"\",I13>=Personalstamm!$D$19),Personalstamm!$E$19,IF(AND(I13<>\"\",J13<Personalstamm!$E$20,I13>=Personalstamm!$D$20),Personalstamm!$E$20-J13,IF(AND(I13<>\"\",J13<Personalstamm!E$19,I13>=Personalstamm!$D$19),Personalstamm!$E$19-J13,0)))))","v":""},"","",{"$f":"IF(OR(M13=\"\",M13=\"Bitte auswählen\"),\"\",IF(M13=\"Feiertag\",T13*U13,IF(M13=\"Gleittag\",0,VLOOKUP(B13,Personalstamm!$D$8:$F$14,3,FALSE))))","v":""},{"$f":"VLOOKUP(B13,Personalstamm!$D$8:$E$14,2,FALSE)","v":{"v":0,"d":"0.00"}},"",{"v":0,"d":"0.00"},null,{"$f":"IF(COUNTIF(Allgemein!$H$8:$H$45,A13)>0,\"Feiertag\",\"\")","v":""},{"$f":"IFERROR(VLOOKUP(A13,Allgemein!$H$8:$I$45,2,FALSE),\"\")","v":""},{"$f":"VLOOKUP(B13,Personalstamm!$D$8:$F$14,3,FALSE)","v":{"v":0,"d":"0.00"}},"",""]
["2026-07-05","Sonntag","Wochenende",{"$nulls":5},"","",{"$f":"IF(I14=\"\",\"\",IF(AND(I14<>\"\",J14=\"\",I14>=Personalstamm!$D$20),Personalstamm!$E$20,IF(AND(I14<>\"\",J14=\"\",I14>=Personalstamm!$D$19),Personalstamm!$E$19,IF(AND(I14<>\"\",J14<Personalstamm!$E$20,I14>=Personalstamm!$D$20),Personalstamm!$E$20-J14,IF(AND(I14<>\"\",J14<Personalstamm!E$19,I14>=Personalstamm!$D$19),Personalstamm!$E$19-J14,0)))))","v":""},"","",{"$f":"IF(OR(M14=\"\",M14=\"Bitte auswählen\"),\"\",IF(M14=\"Feiertag\",T14*U14,IF(M14=\"Gleittag\",0,VLOOKUP(B14,Personalstamm!$D$8:$F$14,3,FALSE))))","v":""},{"$f":"VLOOKUP(B14,Personalstamm!$D$8:$E$14,2,FALSE)","v":{"v":0,"d":"0.00"}},"",{"v":0,"d":"0.00"},null,{"$f":"IF(COUNTIF(Allgemein!$H$8:$H$45,A14)>0,\"Feiertag\",\"\")","v":""},{"$f":"IFERROR(VLOOKUP(A14,Allgemein!$H$8:$I$45,2,FALSE),\"\")","v":""},{"$f":"VLOOKUP(B14,Personalstamm!$D$8:$F$14,3,FALSE)","v":{"v":0,"d":"0.00"}},"",""]
["2026-07-06","Montag","Bitte auswählen",{"$nulls":5},"","",{"$f":"IF(I15=\"\",\"\",IF(AND(I15<>\"\",J15=\"\",I15>=Personalstamm!$D$20),Personalstamm!$E$20,IF(AND(I15<>\"\",J15=\"\",I15>=Personalstamm!$D$19),Personalstamm!$E$19,IF(AND(I15<>\"\",J15<Personalstamm!$E$20,I15>=Personalstamm!$D$20),Personalstamm!$E$20-J15,IF(AND(I15<>\"\",J15<Personalstamm!E$19,I15>=Personalstamm!$D$19),Personalstamm!$E$19-J15,0)))))","v":""},"","",{"$f":"IF(OR(M15=\"\",M15=\"Bitte auswählen\"),\"\",IF(M15=\"Feiertag\",T15*U15,IF(M15=\"Gleittag\",0,VLOOKUP(B15,Personalstamm!$D$8:$F$14,3,FALSE))))","v":""},{"$f":"VLOOKUP(B15,Personalstamm!$D$8:$E$14,2,FALSE)","v":{"v":8,"d":"8.00"}},"",{"v":0,"d":"0.00"},null,{"$f":"IF(COUNTIF(Allgemein!$H$8:$H$45,A15)>0,\"Feiertag\",\"\")","v":""},{"$f":"IFERROR(VLOOKUP(A15,Allgemein!$H$8:$I$45,2,FALSE),\"\")","v":""},{"$f":"VLOOKUP(B15,Personalstamm!$D$8:$F$14,3,FALSE)","v":{"v":8,"d":"8.00"}},"",""]
["2026-07-07","Dienstag","Bitte auswählen",{"$nulls":5},"","",{"$f":"IF(I16=\"\",\"\",IF(AND(I16<>\"\",J16=\"\",I16>=Personalstamm!$D$20),Personalstamm!$E$20,IF(AND(I16<>\"\",J16=\"\",I16>=Personalstamm!$D$19),Personalstamm!$E$19,IF(AND(I16<>\"\",J16<Personalstamm!$E$20,I16>=Personalstamm!$D$20),Personalstamm!$E$20-J16,IF(AND(I16<>\"\",J16<Personalstamm!E$19,I16>=Personalstamm!$D$19),Personalstamm!$E$19-J16,0)))))","v":""},"","",{"$f":"IF(OR(M16=\"\",M16=\"Bitte auswählen\"),\"\",IF(M16=\"Feiertag\",T16*U16,IF(M16=\"Gleittag\",0,VLOOKUP(B16,Personalstamm!$D$8:$F$14,3,FALSE))))","v":""},{"$f":"VLOOKUP(B16,Personalstamm!$D$8:$E$14,2,FALSE)","v":{"v":8,"d":"8.00"}},"",{"v":0,"d":"0.00"},null,{"$f":"IF(COUNTIF(Allgemein!$H$8:$H$45,A16)>0,\"Feiertag\",\"\")","v":""},{"$f":"IFERROR(VLOOKUP(A16,Allgemein!$H$8:$I$45,2,FALSE),\"\")","v":""},{"$f":"VLOOKUP(B16,Personalstamm!$D$8:$F$14,3,FALSE)","v":{"v":8,"d":"8.00"}},"",""]
["2026-07-08","Mittwoch","Bitte auswählen",{"$nulls":5},"","",{"$f":"IF(I17=\"\",\"\",IF(AND(I17<>\"\",J17=\"\",I17>=Personalstamm!$D$20),Personalstamm!$E$20,IF(AND(I17<>\"\",J17=\"\",I17>=Personalstamm!$D$19),Personalstamm!$E$19,IF(AND(I17<>\"\",J17<Personalstamm!$E$20,I17>=Personalstamm!$D$20),Personalstamm!$E$20-J17,IF(AND(I17<>\"\",J17<Personalstamm!E$19,I17>=Personalstamm!$D$19),Personalstamm!$E$19-J17,0)))))","v":""},"","",{"$f":"IF(OR(M17=\"\",M17=\"Bitte auswählen\"),\"\",IF(M17=\"Feiertag\",T17*U17,IF(M17=\"Gleittag\",0,VLOOKUP(B17,Personalstamm!$D$8:$F$14,3,FALSE))))","v":""},{"$f":"VLOOKUP(B17,Personalstamm!$D$8:$E$14,2,FALSE)","v":{"v":8,"d":"8.00"}},"",{"v":0,"d":"0.00"},null,{"$f":"IF(COUNTIF(Allgemein!$H$8:$H$45,A17)>0,\"Feiertag\",\"\")","v":""},{"$f":"IFERROR(VLOOKUP(A17,Allgemein!$H$8:$I$45,2,FALSE),\"\")","v":""},{"$f":"VLOOKUP(B17,Personalstamm!$D$8:$F$14,3,FALSE)","v":{"v":8,"d":"8.00"}},"",""]
["2026-07-09","Donnerstag","Bitte auswählen",{"$nulls":5},"","",{"$f":"IF(I18=\"\",\"\",IF(AND(I18<>\"\",J18=\"\",I18>=Personalstamm!$D$20),Personalstamm!$E$20,IF(AND(I18<>\"\",J18=\"\",I18>=Personalstamm!$D$19),Personalstamm!$E$19,IF(AND(I18<>\"\",J18<Personalstamm!$E$20,I18>=Personalstamm!$D$20),Personalstamm!$E$20-J18,IF(AND(I18<>\"\",J18<Personalstamm!E$19,I18>=Personalstamm!$D$19),Personalstamm!$E$19-J18,0)))))","v":""},"","",{"$f":"IF(OR(M18=\"\",M18=\"Bitte auswählen\"),\"\",IF(M18=\"Feiertag\",T18*U18,IF(M18=\"Gleittag\",0,VLOOKUP(B18,Personalstamm!$D$8:$F$14,3,FALSE))))","v":""},{"$f":"VLOOKUP(B18,Personalstamm!$D$8:$E$14,2,FALSE)","v":{"v":8,"d":"8.00"}},"",{"v":0,"d":"0.00"},null,{"$f":"IF(COUNTIF(Allgemein!$H$8:$H$45,A18)>0,\"Feiertag\",\"\")","v":""},{"$f":"IFERROR(VLOOKUP(A18,Allgemein!$H$8:$I$45,2,FALSE),\"\")","v":""},{"$f":"VLOOKUP(B18,Personalstamm!$D$8:$F$14,3,FALSE)","v":{"v":8,"d":"8.00"}},"",""]
["2026-07-10","Freitag","Bitte auswählen",{"$nulls":5},"","",{"$f":"IF(I19=\"\",\"\",IF(AND(I19<>\"\",J19=\"\",I19>=Personalstamm!$D$20),Personalstamm!$E$20,IF(AND(I19<>\"\",J19=\"\",I19>=Personalstamm!$D$19),Personalstamm!$E$19,IF(AND(I19<>\"\",J19<Personalstamm!$E$20,I19>=Personalstamm!$D$20),Personalstamm!$E$20-J19,IF(AND(I19<>\"\",J19<Personalstamm!E$19,I19>=Personalstamm!$D$19),Personalstamm!$E$19-J19,0)))))","v":""},"","",{"$f":"IF(OR(M19=\"\",M19=\"Bitte auswählen\"),\"\",IF(M19=\"Feiertag\",T19*U19,IF(M19=\"Gleittag\",0,VLOOKUP(B19,Personalstamm!$D$8:$F$14,3,FALSE))))","v":""},{"$f":"VLOOKUP(B19,Personalstamm!$D$8:$E$14,2,FALSE)","v":{"v":8,"d":"8.00"}},"",{"v":0,"d":"0.00"},null,{"$f":"IF(COUNTIF(Allgemein!$H$8:$H$45,A19)>0,\"Feiertag\",\"\")","v":""},{"$f":"IFERROR(VLOOKUP(A19,Allgemein!$H$8:$I$45,2,FALSE),\"\")","v":""},{"$f":"VLOOKUP(B19,Personalstamm!$D$8:$F$14,3,FALSE)","v":{"v":8,"d":"8.00"}},"",""]
["2026-07-11","Samstag","Wochenende",{"$nulls":5},"","",{"$f":"IF(I20=\"\",\"\",IF(AND(I20<>\"\",J20=\"\",I20>=Personalstamm!$D$20),Personalstamm!$E$20,IF(AND(I20<>\"\",J20=\"\",I20>=Personalstamm!$D$19),Personalstamm!$E$19,IF(AND(I20<>\"\",J20<Personalstamm!$E$20,I20>=Personalstamm!$D$20),Personalstamm!$E$20-J20,IF(AND(I20<>\"\",J20<Personalstamm!E$19,I20>=Personalstamm!$D$19),Personalstamm!$E$19-J20,0)))))","v":""},"","",{"$f":"IF(OR(M20=\"\",M20=\"Bitte auswählen\"),\"\",IF(M20=\"Feiertag\",T20*U20,IF(M20=\"Gleittag\",0,VLOOKUP(B20,Personalstamm!$D$8:$F$14,3,FALSE))))","v":""},{"$f":"VLOOKUP(B20,Personalstamm!$D$8:$E$14,2,FALSE)","v":{"v":0,"d":"0.00"}},"",{"v":0,"d":"0.00"},null,{"$f":"IF(COUNTIF(Allgemein!$H$8:$H$45,A20)>0,\"Feiertag\",\"\")","v":""},{"$f":"IFERROR(VLOOKUP(A20,Allgemein!$H$8:$I$45,2,FALSE),\"\")","v":""},{"$f":"VLOOKUP(B20,Personalstamm!$D$8:$F$14,3,FALSE)","v":{"v":0,"d":"0.00"}},"",""]
["2026-07-12","Sonntag","Wochenende",{"$nulls":5},"","",{"$f":"IF(I21=\"\",\"\",IF(AND(I21<>\"\",J21=\"\",I21>=Personalstamm!$D$20),Personalstamm!$E$20,IF(AND(I21<>\"\",J21=\"\",I21>=Personalstamm!$D$19),Personalstamm!$E$19,IF(AND(I21<>\"\",J21<Personalstamm!$E$20,I21>=Personalstamm!$D$20),Personalstamm!$E$20-J21,IF(AND(I21<>\"\",J21<Personalstamm!E$19,I21>=Personalstamm!$D$19),Personalstamm!$E$19-J21,0)))))","v":""},"","",{"$f":"IF(OR(M21=\"\",M21=\"Bitte auswählen\"),\"\",IF(M21=\"Feiertag\",T21*U21,IF(M21=\"Gleittag\",0,VLOOKUP(B21,Personalstamm!$D$8:$F$14,3,FALSE))))","v":""},{"$f":"VLOOKUP(B21,Personalstamm!$D$8:$E$14,2,FALSE)","v":{"v":0,"d":"0.00"}},"",{"v":0,"d":"0.00"},null,{"$f":"IF(COUNTIF(Allgemein!$H$8:$H$45,A21)>0,\"Feiertag\",\"\")","v":""},{"$f":"IFERROR(VLOOKUP(A21,Allgemein!$H$8:$I$45,2,FALSE),\"\")","v":""},{"$f":"VLOOKUP(B21,Personalstamm!$D$8:$F$14,3,FALSE)","v":{"v":0,"d":"0.00"}},"",""]
["2026-07-13","Montag","Bitte auswählen",{"$nulls":5},"","",{"$f":"IF(I22=\"\",\"\",IF(AND(I22<>\"\",J22=\"\",I22>=Personalstamm!$D$20),Personalstamm!$E$20,IF(AND(I22<>\"\",J22=\"\",I22>=Personalstamm!$D$19),Personalstamm!$E$19,IF(AND(I22<>\"\",J22<Personalstamm!$E$20,I22>=Personalstamm!$D$20),Personalstamm!$E$20-J22,IF(AND(I22<>\"\",J22<Personalstamm!E$19,I22>=Personalstamm!$D$19),Personalstamm!$E$19-J22,0)))))","v":""},"","",{"$f":"IF(OR(M22=\"\",M22=\"Bitte auswählen\"),\"\",IF(M22=\"Feiertag\",T22*U22,IF(M22=\"Gleittag\",0,VLOOKUP(B22,Personalstamm!$D$8:$F$14,3,FALSE))))","v":""},{"$f":"VLOOKUP(B22,Personalstamm!$D$8:$E$14,2,FALSE)","v":{"v":8,"d":"8.00"}},"",{"v":0,"d":"0.00"},null,{"$f":"IF(COUNTIF(Allgemein!$H$8:$H$45,A22)>0,\"Feiertag\",\"\")","v":""},{"$f":"IFERROR(VLOOKUP(A22,Allgemein!$H$8:$I$45,2,FALSE),\"\")","v":""},{"$f":"VLOOKUP(B22,Personalstamm!$D$8:$F$14,3,FALSE)","v":{"v":8,"d":"8.00"}},"",""]
["2026-07-14","Dienstag","Bitte auswählen",{"$nulls":5},"","",{"$f":"IF(I23=\"\",\"\",IF(AND(I23<>\"\",J23=\"\",I23>=Personalstamm!$D$20),Personalstamm!$E$20,IF(AND(I23<>\"\",J23=\"\",I23>=Personalstamm!$D$19),Personalstamm!$E$19,IF(AND(I23<>\"\",J23<Personalstamm!$E$20,I23>=Personalstamm!$D$20),Personalstamm!$E$20-J23,IF(AND(I23<>\"\",J23<Personalstamm!E$19,I23>=Personalstamm!$D$19),Personalstamm!$E$19-J23,0)))))","v":""},"","",{"$f":"IF(OR(M23=\"\",M23=\"Bitte auswählen\"),\"\",IF(M23=\"Feiertag\",T23*U23,IF(M23=\"Gleittag\",0,VLOOKUP(B23,Personalstamm!$D$8:$F$14,3,FALSE))))","v":""},{"$f":"VLOOKUP(B23,Personalstamm!$D$8:$E$14,2,FALSE)","v":{"v":8,"d":"8.00"}},"",{"v":0,"d":"0.00"},null,{"$f":"IF(COUNTIF(Allgemein!$H$8:$H$45,A23)>0,\"Feiertag\",\"\")","v":""},{"$f":"IFERROR(VLOOKUP(A23,Allgemein!$H$8:$I$45,2,FALSE),\"\")","v":""},{"$f":"VLOOKUP(B23,Personalstamm!$D$8:$F$14,3,FALSE)","v":{"v":8,"d":"8.00"}},"",""]
["2026-07-15","Mittwoch","Bitte auswählen",{"$nulls":5},"","",{"$f":"IF(I24=\"\",\"\",IF(AND(I24<>\"\",J24=\"\",I24>=Personalstamm!$D$20),Personalstamm!$E$20,IF(AND(I24<>\"\",J24=\"\",I24>=Personalstamm!$D$19),Personalstamm!$E$19,IF(AND(I24<>\"\",J24<Personalstamm!$E$20,I24>=Personalstamm!$D$20),Personalstamm!$E$20-J24,IF(AND(I24<>\"\",J24<Personalstamm!E$19,I24>=Personalstamm!$D$19),Personalstamm!$E$19-J24,0)))))","v":""},"","",{"$f":"IF(OR(M24=\"\",M24=\"Bitte auswählen\"),\"\",IF(M24=\"Feiertag\",T24*U24,IF(M24=\"Gleittag\",0,VLOOKUP(B24,Personalstamm!$D$8:$F$14,3,FALSE))))","v":""},{"$f":"VLOOKUP(B24,Personalstamm!$D$8:$E$14,2,FALSE)","v":{"v":8,"d":"8.00"}},"",{"v":0,"d":"0.00"},null,{"$f":"IF(COUNTIF(Allgemein!$H$8:$H$45,A24)>0,\"Feiertag\",\"\")","v":""},{"$f":"IFERROR(VLOOKUP(A24,Allgemein!$H$8:$I$45,2,FALSE),\"\")","v":""},{"$f":"VLOOKUP(B24,Personalstamm!$D$8:$F$14,3,FALSE)","v":{"v":8,"d":"8.00"}},"",""]
["2026-07-16","Donnerstag","Bitte auswählen",{"$nulls":5},"","",{"$f":"IF(I25=\"\",\"\",IF(AND(I25<>\"\",J25=\"\",I25>=Personalstamm!$D$20),Personalstamm!$E$20,IF(AND(I25<>\"\",J25=\"\",I25>=Personalstamm!$D$19),Personalstamm!$E$19,IF(AND(I25<>\"\",J25<Personalstamm!$E$20,I25>=Personalstamm!$D$20),Personalstamm!$E$20-J25,IF(AND(I25<>\"\",J25<Personalstamm!E$19,I25>=Personalstamm!$D$19),Personalstamm!$E$19-J25,0)))))","v":""},"","",{"$f":"IF(OR(M25=\"\",M25=\"Bitte auswählen\"),\"\",IF(M25=\"Feiertag\",T25*U25,IF(M25=\"Gleittag\",0,VLOOKUP(B25,Personalstamm!$D$8:$F$14,3,FALSE))))","v":""},{"$f":"VLOOKUP(B25,Personalstamm!$D$8:$E$14,2,FALSE)","v":{"v":8,"d":"8.00"}},"",{"v":0,"d":"0.00"},null,{"$f":"IF(COUNTIF(Allgemein!$H$8:$H$45,A25)>0,\"Feiertag\",\"\")","v":""},{"$f":"IFERROR(VLOOKUP(A25,Allgemein!$H$8:$I$45,2,FALSE),\"\")","v":""},{"$f":"VLOOKUP(B25,Personalstamm!$D$8:$F$14,3,FALSE)","v":{"v":8,"d":"8.00"}},"",""]
["2026-07-17","Freitag","Bitte auswählen",{"$nulls":5},"","",{"$f":"IF(I26=\"\",\"\",IF(AND(I26<>\"\",J26=\"\",I26>=Personalstamm!$D$20),Personalstamm!$E$20,IF(AND(I26<>\"\",J26=\"\",I26>=Personalstamm!$D$19),Personalstamm!$E$19,IF(AND(I26<>\"\",J26<Personalstamm!$E$20,I26>=Personalstamm!$D$20),Personalstamm!$E$20-J26,IF(AND(I26<>\"\",J26<Personalstamm!E$19,I26>=Personalstamm!$D$19),Personalstamm!$E$19-J26,0)))))","v":""},"","",{"$f":"IF(OR(M26=\"\",M26=\"Bitte auswählen\"),\"\",IF(M26=\"Feiertag\",T26*U26,IF(M26=\"Gleittag\",0,VLOOKUP(B26,Personalstamm!$D$8:$F$14,3,FALSE))))","v":""},{"$f":"VLOOKUP(B26,Personalstamm!$D$8:$E$14,2,FALSE)","v":{"v":8,"d":"8.00"}},"",{"v":0,"d":"0.00"},null,{"$f":"IF(COUNTIF(Allgemein!$H$8:$H$45,A26)>0,\"Feiertag\",\"\")","v":""},{"$f":"IFERROR(VLOOKUP(A26,Allgemein!$H$8:$I$45,2,FALSE),\"\")","v":""},{"$f":"VLOOKUP(B26,Personalstamm!$D$8:$F$14,3,FALSE)","v":{"v":8,"d":"8.00"}},"",""]
["2026-07-18","Samstag","Wochenende",{"$nulls":5},"","",{"$f":"IF(I27=\"\",\"\",IF(AND(I27<>\"\",J27=\"\",I27>=Personalstamm!$D$20),Personalstamm!$E$20,IF(AND(I27<>\"\",J27=\"\",I27>=Personalstamm!$D$19),Personalstamm!$E$19,IF(AND(I27<>\"\",J27<Personalstamm!$E$20,I27>=Personalstamm!$D$20),Personalstamm!$E$20-J27,IF(AND(I27<>\"\",J27<Personalstamm!E$19,I27>=Personalstamm!$D$19),Personalstamm!$E$19-J27,0)))))","v":""},"","",{"$f":"IF(OR(M27=\"\",M27=\"Bitte auswählen\"),\"\",IF(M27=\"Feiertag\",T27*U27,IF(M27=\"Gleittag\",0,VLOOKUP(B27,Personalstamm!$D$8:$F$14,3,FALSE))))","v":""},{"$f":"VLOOKUP(B27,Personalstamm!$D$8:$E$14,2,FALSE)","v":{"v":0,"d":"0.00"}},"",{"v":0,"d":"0.00"},null,{"$f":"IF(COUNTIF(Allgemein!$H$8:$H$45,A27)>0,\"Feiertag\",\"\")","v":""},{"$f":"IFERROR(VLOOKUP(A27,Allgemein!$H$8:$I$45,2,FALSE),\"\")","v":""},{"$f":"VLOOKUP(B27,Personalstamm!$D$8:$F$14,3,FALSE)","v":{"v":0,"d":"0.00"}},"",""]
["2026-07-19","Sonntag","Wochenende",{"$nulls":5},"","",{"$f":"IF(I28=\"\",\"\",IF(AND(I28<>\"\",J28=\"\",I28>=Personalstamm!$D$20),Personalstamm!$E$20,IF(AND(I28<>\"\",J28=\"\",I28>=Personalstamm!$D$19),Personalstamm!$E$19,IF(AND(I28<>\"\",J28<Personalstamm!$E$20,I28>=Personalstamm!$D$20),Personalstamm!$E$20-J28,IF(AND(I28<>\"\",J28<Personalstamm!E$19,I28>=Personalstamm!$D$19),Personalstamm!$E$19-J28,0)))))","v":""},"","",{"$f":"IF(OR(M28=\"\",M28=\"Bitte auswählen\"),\"\",IF(M28=\"Feiertag\",T28*U28,IF(M28=\"Gleittag\",0,VLOOKUP(B28,Personalstamm!$D$8:$F$14,3,FALSE))))","v":""},{"$f":"VLOOKUP(B28,Personalstamm!$D$8:$E$14,2,FALSE)","v":{"v":0,"d":"0.00"}},"",{"v":0,"d":"0.00"},null,{"$f":"IF(COUNTIF(Allgemein!$H$8:$H$45,A28)>0,\"Feiertag\",\"\")","v":""},{"$f":"IFERROR(VLOOKUP(A28,Allgemein!$H$8:$I$45,2,FALSE),\"\")","v":""},{"$f":"VLOOKUP(B28,Personalstamm!$D$8:$F$14,3,FALSE)","v":{"v":0,"d":"0.00"}},"",""]
["2026-07-20","Montag","Bitte auswählen",{"$nulls":5},"","",{"$f":"IF(I29=\"\",\"\",IF(AND(I29<>\"\",J29=\"\",I29>=Personalstamm!$D$20),Personalstamm!$E$20,IF(AND(I29<>\"\",J29=\"\",I29>=Personalstamm!$D$19),Personalstamm!$E$19,IF(AND(I29<>\"\",J29<Personalstamm!$E$20,I29>=Personalstamm!$D$20),Personalstamm!$E$20-J29,IF(AND(I29<>\"\",J29<Personalstamm!E$19,I29>=Personalstamm!$D$19),Personalstamm!$E$19-J29,0)))))","v":""},"","",{"$f":"IF(OR(M29=\"\",M29=\"Bitte auswählen\"),\"\",IF(M29=\"Feiertag\",T29*U29,IF(M29=\"Gleittag\",0,VLOOKUP(B29,Personalstamm!$D$8:$F$14,3,FALSE))))","v":""},{"$f":"VLOOKUP(B29,Personalstamm!$D$8:$E$14,2,FALSE)","v":{"v":8,"d":"8.00"}},"",{"v":0,"d":"0.00"},null,{"$f":"IF(COUNTIF(Allgemein!$H$8:$H$45,A29)>0,\"Feiertag\",\"\")","v":""},{"$f":"IFERROR(VLOOKUP(A29,Allgemein!$H$8:$I$45,2,FALSE),\"\")","v":""},{"$f":"VLOOKUP(B29,Personalstamm!$D$8:$F$14,3,FALSE)","v":{"v":8,"d":"8.00"}},"",""]
["2026-07-21","Dienstag","Bitte auswählen",{"$nulls":5},"","",{"$f":"IF(I30=\"\",\"\",IF(AND(I30<>\"\",J30=\"\",I30>=Personalstamm!$D$20),Personalstamm!$E$20,IF(AND(I30<>\"\",J30=\"\",I30>=Personalstamm!$D$19),Personalstamm!$E$19,IF(AND(I30<>\"\",J30<Personalstamm!$E$20,I30>=Personalstamm!$D$20),Personalstamm!$E$20-J30,IF(AND(I30<>\"\",J30<Personalstamm!E$19,I30>=Personalstamm!$D$19),Personalstamm!$E$19-J30,0)))))","v":""},"","",{"$f":"IF(OR(M30=\"\",M30=\"Bitte auswählen\"),\"\",IF(M30=\"Feiertag\",T30*U30,IF(M30=\"Gleittag\",0,VLOOKUP(B30,Personalstamm!$D$8:$F$14,3,FALSE))))","v":""},{"$f":"VLOOKUP(B30,Personalstamm!$D$8:$E$14,2,FALSE)","v":{"v":8,"d":"8.00"}},"",{"v":0,"d":"0.00"},null,{"$f":"IF(COUNTIF(Allgemein!$H$8:$H$45,A30)>0,\"Feiertag\",\"\")","v":""},{"$f":"IFERROR(VLOOKUP(A30,Allgemein!$H$8:$I$45,2,FALSE),\"\")","v":""},{"$f":"VLOOKUP(B30,Personalstamm!$D$8:$F$14,3,FALSE)","v":{"v":8,"d":"8.00"}},"",""]
["2026-07-22","Mittwoch","Bitte auswählen",{"$nulls":5},"","",{"$f":"IF(I31=\"\",\"\",IF(AND(I31<>\"\",J31=\"\",I31>=Personalstamm!$D$20),Personalstamm!$E$20,IF(AND(I31<>\"\",J31=\"\",I31>=Personalstamm!$D$19),Personalstamm!$E$19,IF(AND(I31<>\"\",J31<Personalstamm!$E$20,I31>=Personalstamm!$D$20),Personalstamm!$E$20-J31,IF(AND(I31<>\"\",J31<Personalstamm!E$19,I31>=Personalstamm!$D$19),Personalstamm!$E$19-J31,0)))))","v":""},"","",{"$f":"IF(OR(M31=\"\",M31=\"Bitte auswählen\"),\"\",IF(M31=\"Feiertag\",T31*U31,IF(M31=\"Gleittag\",0,VLOOKUP(B31,Personalstamm!$D$8:$F$14,3,FALSE))))","v":""},{"$f":"VLOOKUP(B31,Personalstamm!$D$8:$E$14,2,FALSE)","v":{"v":8,"d":"8.00"}},"",{"v":0,"d":"0.00"},null,{"$f":"IF(COUNTIF(Allgemein!$H$8:$H$45,A31)>0,\"Feiertag\",\"\")","v":""},{"$f":"IFERROR(VLOOKUP(A31,Allgemein!$H$8:$I$45,2,FALSE),\"\")","v":""},{"$f":"VLOOKUP(B31,Personalstamm!$D$8:$F$14,3,FALSE)","v":{"v":8,"d":"8.00"}},"",""]
["2026-07-23","Donnerstag","Bitte auswählen",{"$nulls":5},"","",{"$f":"IF(I32=\"\",\"\",IF(AND(I32<>\"\",J32=\"\",I32>=Personalstamm!$D$20),Personalstamm!$E$20,IF(AND(I32<>\"\",J32=\"\",I32>=Personalstamm!$D$19),Personalstamm!$E$19,IF(AND(I32<>\"\",J32<Personalstamm!$E$20,I32>=Personalstamm!$D$20),Personalstamm!$E$20-J32,IF(AND(I32<>\"\",J32<Personalstamm!E$19,I32>=Personalstamm!$D$19),Personalstamm!$E$19-J32,0)))))","v":""},"","",{"$f":"IF(OR(M32=\"\",M32=\"Bitte auswählen\"),\"\",IF(M32=\"Feiertag\",T32*U32,IF(M32=\"Gleittag\",0,VLOOKUP(B32,Personalstamm!$D$8:$F$14,3,FALSE))))","v":""},{"$f":"VLOOKUP(B32,Personalstamm!$D$8:$E$14,2,FALSE)","v":{"v":8,"d":"8.00"}},"",{"v":0,"d":"0.00"},null,{"$f":"IF(COUNTIF(Allgemein!$H$8:$H$45,A32)>0,\"Feiertag\",\"\")","v":""},{"$f":"IFERROR(VLOOKUP(A32,Allgemein!$H$8:$I$45,2,FALSE),\"\")","v":""},{"$f":"VLOOKUP(B32,Personalstamm!$D$8:$F$14,3,FALSE)","v":{"v":8,"d":"8.00"}},"",""]
["2026-07-24","Freitag","Bitte auswählen",{"$nulls":5},"","",{"$f":"IF(I33=\"\",\"\",IF(AND(I33<>\"\",J33=\"\",I33>=Personalstamm!$D$20),Personalstamm!$E$20,IF(AND(I33<>\"\",J33=\"\",I33>=Personalstamm!$D$19),Personalstamm!$E$19,IF(AND(I33<>\"\",J33<Personalstamm!$E$20,I33>=Personalstamm!$D$20),Personalstamm!$E$20-J33,IF(AND(I33<>\"\",J33<Personalstamm!E$19,I33>=Personalstamm!$D$19),Personalstamm!$E$19-J33,0)))))","v":""},"","",{"$f":"IF(OR(M33=\"\",M33=\"Bitte auswählen\"),\"\",IF(M33=\"Feiertag\",T33*U33,IF(M33=\"Gleittag\",0,VLOOKUP(B33,Personalstamm!$D$8:$F$14,3,FALSE))))","v":""},{"$f":"VLOOKUP(B33,Personalstamm!$D$8:$E$14,2,FALSE)","v":{"v":8,"d":"8.00"}},"",{"v":0,"d":"0.00"},null,{"$f":"IF(COUNTIF(Allgemein!$H$8:$H$45,A33)>0,\"Feiertag\",\"\")","v":""},{"$f":"IFERROR(VLOOKUP(A33,Allgemein!$H$8:$I$45,2,FALSE),\"\")","v":""},{"$f":"VLOOKUP(B33,Personalstamm!$D$8:$F$14,3,FALSE)","v":{"v":8,"d":"8.00"}},"",""]
["2026-07-25","Samstag","Wochenende",{"$nulls":5},"","",{"$f":"IF(I34=\"\",\"\",IF(AND(I34<>\"\",J34=\"\",I34>=Personalstamm!$D$20),Personalstamm!$E$20,IF(AND(I34<>\"\",J34=\"\",I34>=Personalstamm!$D$19),Personalstamm!$E$19,IF(AND(I34<>\"\",J34<Personalstamm!$E$20,I34>=Personalstamm!$D$20),Personalstamm!$E$20-J34,IF(AND(I34<>\"\",J34<Personalstamm!E$19,I34>=Personalstamm!$D$19),Personalstamm!$E$19-J34,0)))))","v":""},"","",{"$f":"IF(OR(M34=\"\",M34=\"Bitte auswählen\"),\"\",IF(M34=\"Feiertag\",T34*U34,IF(M34=\"Gleittag\",0,VLOOKUP(B34,Personalstamm!$D$8:$F$14,3,FALSE))))","v":""},{"$f":"VLOOKUP(B34,Personalstamm!$D$8:$E$14,2,FALSE)","v":{"v":0,"d":"0.00"}},"",{"v":0,"d":"0.00"},null,{"$f":"IF(COUNTIF(Allgemein!$H$8:$H$45,A34)>0,\"Feiertag\",\"\")","v":""},{"$f":"IFERROR(VLOOKUP(A34,Allgemein!$H$8:$I$45,2,FALSE),\"\")","v":""},{"$f":"VLOOKUP(B34,Personalstamm!$D$8:$F$14,3,FALSE)","v":{"v":0,"d":"0.00"}},"",""]
["2026-07-26","Sonntag","Wochenende",{"$nulls":5},"","",{"$f":"IF(I35=\"\",\"\",IF(AND(I35<>\"\",J35=\"\",I35>=Personalstamm!$D$20),Personalstamm!$E$20,IF(AND(I35<>\"\",J35=\"\",I35>=Personalstamm!$D$19),Personalstamm!$E$19,IF(AND(I35<>\"\",J35<Personalstamm!$E$20,I35>=Personalstamm!$D$20),Personalstamm!$E$20-J35,IF(AND(I35<>\"\",J35<Personalstamm!E$19,I35>=Personalstamm!$D$19),Personalstamm!$E$19-J35,0)))))","v":""},"","",{"$f":"IF(OR(M35=\"\",M35=\"Bitte auswählen\"),\"\",IF(M35=\"Feiertag\",T35*U35,IF(M35=\"Gleittag\",0,VLOOKUP(B35,Personalstamm!$D$8:$F$14,3,FALSE))))","v":""},{"$f":"VLOOKUP(B35,Personalstamm!$D$8:$E$14,2,FALSE)","v":{"v":0,"d":"0.00"}},"",{"v":0,"d":"0.00"},null,{"$f":"IF(COUNTIF(Allgemein!$H$8:$H$45,A35)>0,\"Feiertag\",\"\")","v":""},{"$f":"IFERROR(VLOOKUP(A35,Allgemein!$H$8:$I$45,2,FALSE),\"\")","v":""},{"$f":"VLOOKUP(B35,Personalstamm!$D$8:$F$14,3,FALSE)","v":{"v":0,"d":"0.00"}},"",""]
["2026-07-27","Montag","Bitte auswählen",{"$nulls":5},"","",{"$f":"IF(I36=\"\",\"\",IF(AND(I36<>\"\",J36=\"\",I36>=Personalstamm!$D$20),Personalstamm!$E$20,IF(AND(I36<>\"\",J36=\"\",I36>=Personalstamm!$D$19),Personalstamm!$E$19,IF(AND(I36<>\"\",J36<Personalstamm!$E$20,I36>=Personalstamm!$D$20),Personalstamm!$E$20-J36,IF(AND(I36<>\"\",J36<Personalstamm!E$19,I36>=Personalstamm!$D$19),Personalstamm!$E$19-J36,0)))))","v":""},"","",{"$f":"IF(OR(M36=\"\",M36=\"Bitte auswählen\"),\"\",IF(M36=\"Feiertag\",T36*U36,IF(M36=\"Gleittag\",0,VLOOKUP(B36,Personalstamm!$D$8:$F$14,3,FALSE))))","v":""},{"$f":"VLOOKUP(B36,Personalstamm!$D$8:$E$14,2,FALSE)","v":{"v":8,"d":"8.00"}},"",{"v":0,"d":"0.00"},null,{"$f":"IF(COUNTIF(Allgemein!$H$8:$H$45,A36)>0,\"Feiertag\",\"\")","v":""},{"$f":"IFERROR(VLOOKUP(A36,Allgemein!$H$8:$I$45,2,FALSE),\"\")","v":""},{"$f":"VLOOKUP(B36,Personalstamm!$D$8:$F$14,3,FALSE)","v":{"v":8,"d":"8.00"}},"",""]
["2026-07-28","Dienstag","Bitte auswählen",{"$nulls":5},"","",{"$f":"IF(I37=\"\",\"\",IF(AND(I37<>\"\",J37=\"\",I37>=Personalstamm!$D$20),Personalstamm!$E$20,IF(AND(I37<>\"\",J37=\"\",I37>=Personalstamm!$D$19),Personalstamm!$E$19,IF(AND(I37<>\"\",J37<Personalstamm!$E$20,I37>=Personalstamm!$D$20),Personalstamm!$E$20-J37,IF(AND(I37<>\"\",J37<Personalstamm!E$19,I37>=Personalstamm!$D$19),Personalstamm!$E$19-J37,0)))))","v":""},"","",{"$f":"IF(OR(M37=\"\",M37=\"Bitte auswählen\"),\"\",IF(M37=\"Feiertag\",T37*U37,IF(M37=\"Gleittag\",0,VLOOKUP(B37,Personalstamm!$D$8:$F$14,3,FALSE))))","v":""},{"$f":"VLOOKUP(B37,Personalstamm!$D$8:$E$14,2,FALSE)","v":{"v":8,"d":"8.00"}},"",{"v":0,"d":"0.00"},null,{"$f":"IF(COUNTIF(Allgemein!$H$8:$H$45,A37)>0,\"Feiertag\",\"\")","v":""},{"$f":"IFERROR(VLOOKUP(A37,Allgemein!$H$8:$I$45,2,FALSE),\"\")","v":""},{"$f":"VLOOKUP(B37,Personalstamm!$D$8:$F$14,3,FALSE)","v":{"v":8,"d":"8.00"}},"",""]
["2026-07-29","Mittwoch","Bitte auswählen",{"$nulls":5},"","",{"$f":"IF(I38=\"\",\"\",IF(AND(I38<>\"\",J38=\"\",I38>=Personalstamm!$D$20),Personalstamm!$E$20,IF(AND(I38<>\"\",J38=\"\",I38>=Personalstamm!$D$19),Personalstamm!$E$19,IF(AND(I38<>\"\",J38<Personalstamm!$E$20,I38>=Personalstamm!$D$20),Personalstamm!$E$20-J38,IF(AND(I38<>\"\",J38<Personalstamm!E$19,I38>=Personalstamm!$D$19),Personalstamm!$E$19-J38,0)))))","v":""},"","",{"$f":"IF(OR(M38=\"\",M38=\"Bitte auswählen\"),\"\",IF(M38=\"Feiertag\",T38*U38,IF(M38=\"Gleittag\",0,VLOOKUP(B38,Personalstamm!$D$8:$F$14,3,FALSE))))","v":""},{"$f":"VLOOKUP(B38,Personalstamm!$D$8:$E$14,2,FALSE)","v":{"v":8,"d":"8.00"}},"",{"v":0,"d":"0.00"},null,{"$f":"IF(COUNTIF(Allgemein!$H$8:$H$45,A38)>0,\"Feiertag\",\"\")","v":""},{"$f":"IFERROR(VLOOKUP(A38,Allgemein!$H$8:$I$45,2,FALSE),\"\")","v":""},{"$f":"VLOOKUP(B38,Personalstamm!$D$8:$F$14,3,FALSE)","v":{"v":8,"d":"8.00"}},"",""]
["2026-07-30","Donnerstag","Bitte auswählen",{"$nulls":5},"","",{"$f":"IF(I39=\"\",\"\",IF(AND(I39<>\"\",J39=\"\",I39>=Personalstamm!$D$20),Personalstamm!$E$20,IF(AND(I39<>\"\",J39=\"\",I39>=Personalstamm!$D$19),Personalstamm!$E$19,IF(AND(I39<>\"\",J39<Personalstamm!$E$20,I39>=Personalstamm!$D$20),Personalstamm!$E$20-J39,IF(AND(I39<>\"\",J39<Personalstamm!E$19,I39>=Personalstamm!$D$19),Personalstamm!$E$19-J39,0)))))","v":""},"","",{"$f":"IF(OR(M39=\"\",M39=\"Bitte auswählen\"),\"\",IF(M39=\"Feiertag\",T39*U39,IF(M39=\"Gleittag\",0,VLOOKUP(B39,Personalstamm!$D$8:$F$14,3,FALSE))))","v":""},{"$f":"VLOOKUP(B39,Personalstamm!$D$8:$E$14,2,FALSE)","v":{"v":8,"d":"8.00"}},"",{"v":0,"d":"0.00"},null,{"$f":"IF(COUNTIF(Allgemein!$H$8:$H$45,A39)>0,\"Feiertag\",\"\")","v":""},{"$f":"IFERROR(VLOOKUP(A39,Allgemein!$H$8:$I$45,2,FALSE),\"\")","v":""},{"$f":"VLOOKUP(B39,Personalstamm!$D$8:$F$14,3,FALSE)","v":{"v":8,"d":"8.00"}},"",""]
["2026-07-31","Freitag","Bitte auswählen",{"$nulls":5},"","",{"$f":"IF(I40=\"\",\"\",IF(AND(I40<>\"\",J40=\"\",I40>=Personalstamm!$D$20),Personalstamm!$E$20,IF(AND(I40<>\"\",J40=\"\",I40>=Personalstamm!$D$19),Personalstamm!$E$19,IF(AND(I40<>\"\",J40<Personalstamm!$E$20,I40>=Personalstamm!$D$20),Personalstamm!$E$20-J40,IF(AND(I40<>\"\",J40<Personalstamm!E$19,I40>=Personalstamm!$D$19),Personalstamm!$E$19-J40,0)))))","v":""},"","",{"$f":"IF(OR(M40=\"\",M40=\"Bitte auswählen\"),\"\",IF(M40=\"Feiertag\",T40*U40,IF(M40=\"Gleittag\",0,VLOOKUP(B40,Personalstamm!$D$8:$F$14,3,FALSE))))","v":""},{"$f":"VLOOKUP(B40,Personalstamm!$D$8:$E$14,2,FALSE)","v":{"v":8,"d":"8.00"}},"",{"v":0,"d":"0.00"},null,{"$f":"IF(COUNTIF(Allgemein!$H$8:$H$45,A40)>0,\"Feiertag\",\"\")","v":""},{"$f":"IFERROR(VLOOKUP(A40,Allgemein!$H$8:$I$45,2,FALSE),\"\")","v":""},{"$f":"VLOOKUP(B40,Personalstamm!$D$8:$F$14,3,FALSE)","v":{"v":8,"d":"8.00"}},"",""]
["Summe",{"$nulls":7},{"$f":"SUM(I10:I40)","v":{"v":0,"d":"0.00"}},{"$f":"SUM(J10:J40)","v":{"v":0,"d":"0.00"}},{"$f":"SUM(K10:K40)","v":{"v":0,"d":"0.00"}},{"$f":"SUM(L10:L40)","v":{"v":0,"d":"0.00"}},null,{"$f":"SUM(N10:N40)","v":{"v":0,"d":"0.00"}},{"$f":"SUM(O10:O40)","v":{"v":184,"d":"184.00"}},{"$f":"SUM(P10:P40)","v":{"v":0,"d":"0.00"}}]
[]
["Art","Anzahl Tage",null,"Fehlzeitenart","Anzahl Tage","Anzahl Stunden",null,"Urlaub genommen","Urlaub geplant"]
["Monat",{"$f":"COUNTIF($C$10:$C$40,\"*\")","v":{"v":31,"d":"31.00"}},null,"Urlaub",{"$f":"COUNTIF($M$10:$M$40,Allgemein!$I$50)","v":{"v":0,"d":"0.00"}},{"$f":"SUMIF($M$10:$M$40,Allgemein!$I$50,$N$10:$N$40)","v":{"v":0,"d":"0.00"}},null,{"$f":"COUNTIFS($A$10:$A$40,\"<\"&TODAY(),$M$10:$M$40,\"Urlaub\")","v":{"v":0,"d":"0.00"}},{"$f":"COUNTIFS($A$10:$A$40,\">=\"&TODAY(),$M$10:$M$40,\"Urlaub\")","v":{"v":0,"d":"0.00"}}]
["Anwesenheit",{"$f":"COUNTIF($C$10:$C$40,Allgemein!$G$50)","v":{"v":0,"d":"0.00"}},null,"Krankheit",{"$f":"COUNTIF($M$10:$M$40,Allgemein!$I$51)","v":{"v":0,"d":"0.00"}},{"$f":"SUMIF($M$10:$M$40,Allgemein!$I$51,$N$10:$N$40)","v":{"v":0,"d":"0.00"}}]
["Fehlzeit",{"$f":"COUNTIF($C$10:$C$40,Allgemein!$G$51)","v":{"v":0,"d":"0.00"}},null,"Kurzarbeit",{"$f":"COUNTIF($M$10:$M$40,Allgemein!$I$52)","v":{"v":0,"d":"0.00"}},{"$f":"SUMIF($M$10:$M$40,Allgemein!$I$52,$N$10:$N$40)","v":{"v":0,"d":"0.00"}}]
["Wochenende",{"$f":"COUNTIF($C$10:$C$40,Allgemein!$G$52)","v":{"v":8,"d":"8.00"}},null,"Mutterschutz",{"$f":"COUNTIF($M$10:$M$40,Allgemein!$I$53)","v":{"v":0,"d":"0.00"}},{"$f":"SUMIF($M$10:$M$40,Allgemein!$I$53,$N$10:$N$40)","v":{"v":0,"d":"0.00"}}]
["Undefiniert",{"$f":"COUNTIF($C$10:$C$40,Allgemein!$G$49)","v":{"v":23,"d":"23.00"}},null,"Fortbildung",{"$f":"COUNTIF($M$10:$M$40,Allgemein!$I$54)","v":{"v":0,"d":"0.00"}},{"$f":"SUMIF($M$10:$M$40,Allgemein!$I$54,$N$10:$N$40)","v":{"v":0,"d":"0.00"}}]
[{"$nulls":3},"Elternzeit",{"$f":"COUNTIF($M$10:$M$40,Allgemein!$I$55)","v":{"v":0,"d":"0.00"}},{"$f":"SUMIF($M$10:$M$40,Allgemein!$I$55,$N$10:$N$40)","v":{"v":0,"d":"0.00"}}]
[{"$nulls":3},"Gleittag",{"$f":"COUNTIF($M$10:$M$40,Allgemein!$I$56)","v":{"v":0,"d":"0.00"}},{"$f":"SUMIF($M$10:$M$40,Allgemein!$I$56,$V$10:$V$40)","v":{"v":0,"d":"0.00"}}]
[{"$nulls":3},"Schule",{"$f":"COUNTIF($M$10:$M$40,Allgemein!$I$57)","v":{"v":0,"d":"0.00"}},{"$f":"SUMIF($M$10:$M$40,Allgemein!$I$57,$N$10:$N$40)","v":{"v":0,"d":"0.00"}}]
[{"$nulls":3},"Feiertag",{"$f":"COUNTIF($M$10:$M$40,Allgemein!$I$58)","v":{"v":0,"d":"0.00"}},{"$f":"SUMIF($M$10:$M$40,Allgemein!$I$58,$N$10:$N$40)","v":{"v":0,"d":"0.00"}}]
[{"$nulls":3},"Undefiniert",{"$f":"COUNTIF($M$10:$M$40,Allgemein!$I$49)","v":{"v":0,"d":"0.00"}},{"$f":"SUMIF($M$10:$M$40,Allgemein!$I$49,$N$10:$N$40)","v":{"v":0,"d":"0.00"}}]

{"sheet":"Aug.","index":12,"n_rows":53,"n_cols":23,"rows_kept":53}
[]
[]
[]
[]
[]
["Urlaubsvortrag",{"$f":"Jul.!$F$6","v":{"v":30,"d":"30.00"}},"Urlaub genommen",{"$f":"$H$44","v":{"v":0,"d":"0.00"}},"Resturlaub",{"$f":"$B$6-$D$6","v":{"v":30,"d":"30.00"}}]
["Saldovortrag",{"$f":"Jul.!$F$7","v":{"v":0,"d":"0.00"}},"Saldoänderung",{"$f":"$P$41","v":{"v":0,"d":"0.00"}},"Kumulierter Saldo",{"$f":"$B$7+$D$7","v":{"v":0,"d":"0.00"}}]
[]
["Datum","Wochentag","Art","Arbeitsort","Von Uhrzeit","Bis Uhrzeit","Von Uhrzeit","Bis Uhrzeit","Bruttoarbeitszeit","Geb. Pause","Mindestpause","Nettoarbeitszeit","Fehlzeitenart","Fehlstunden","Sollstunden","Tagessaldo","Kumulierter Saldo",null,"Feiertag","Feiertag Anteil Tag","FZ-Gutschrift","Gleittag","Ausgewertet"]
["2026-08-01",{"$f":"TEXT(A10,\"tttt\")","v":"Samstag"},{"$f":"IF(AND(S10=\"Feiertag\",T10>0),\"Fehlzeit\",IF(OR(B10=\"Samstag\",B10=\"Sonntag\"),\"Wochenende\",\"Bitte auswählen\"))","v":"Wochenende"},{"$nulls":5},{"$f":"IF(AND(OR(C10=\"Anwesenheit\",C10=\"Wochenende\"),E10<>\"\",F10<>\"\",W10=\"Ja\"),((F10-E10)+(H10-G10))*24,\"\")","v":""},{"$f":"IF(I10=\"\",\"\",IF(AND(G10<>\"\",H10<>\"\"),(G10-F10)*24,0))","v":""},{"$f":"IF(I10=\"\",\"\",IF(AND(I10<>\"\",J10=\"\",I10>=Personalstamm!$D$20),Personalstamm!$E$20,IF(AND(I10<>\"\",J10=\"\",I10>=Personalstamm!$D$19),Personalstamm!$E$19,IF(AND(I10<>\"\",J10<Personalstamm!$E$20,I10>=Personalstamm!$D$20),Personalstamm!$E$20-J10,IF(AND(I10<>\"\",J10<Personalstamm!E$19,I10>=Personalstamm!$D$19),Personalstamm!$E$19-J10,0)))))","v":""},{"$f":"IF(I10<>\"\",I10-K10,\"\")","v":""},{"$f":"IF(AND(S10=\"Feiertag\",T10>0),\"Feiertag\",IF(C10=\"Fehlzeit\",\"Bitte auswählen\",\"\"))","v":""},{"$f":"IF(OR(M10=\"\",M10=\"Bitte auswählen\"),\"\",IF(M10=\"Feiertag\",T10*U10,IF(M10=\"Gleittag\",0,VLOOKUP(B10,Personalstamm!$D$8:$F$14,3,FALSE))))","v":""},{"$f":"VLOOKUP(B10,Personalstamm!$D$8:$E$14,2,FALSE)","v":{"v":0,"d":"0.00"}},{"$f":"IF(AND(OR(C10=\"Anwesenheit\",C10=\"Wochenende\"),L10<>\"\"),L10-O10,IF(AND(C10=\"Fehlzeit\",N10<>\"\",W10=\"Ja\"),N10-O10,IF(W10=\"Ja\",-O10,\"\")))","v":""},{"$f":"IF(P10=\"\",B7,B7+P10)","v":{"v":0,"d":"0.00"}},null,{"$f":"IF(COUNTIF(Allgemein!$H$8:$H$45,A10)>0,\"Feiertag\",\"\")","v":""},{"$f":"IFERROR(VLOOKUP(A10,Allgemein!$H$8:$I$45,2,FALSE),\"\")","v":""},{"$f":"VLOOKUP(B10,Personalstamm!$D$8:$F$14,3,FALSE)","v":{"v":0,"d":"0.00"}},{"$f":"IF(M10=\"Gleittag\",ABS(P10),\"\")","v":""},{"$f":"IF(A10<=TODAY(),\"Ja\",\"\")","v":""}]
["2026-08-02",{"$f":"TEXT(A11,\"tttt\")","v":"Sonntag"},{"$f":"IF(AND(S11=\"Feiertag\",T11>0),\"Fehlzeit\",IF(OR(B11=\"Samstag\",B11=\"Sonntag\"),\"Wochenende\",\"Bitte auswählen\"))","v":"Wochenende"},{"$nulls":5},{"$f":"IF(AND(OR(C11=\"Anwesenheit\",C11=\"Wochenende\"),E11<>\"\",F11<>\"\",W11=\"Ja\"),((F11-E11)+(H11-G11))*24,\"\")","v":""},{"$f":"IF(I11=\"\",\"\",IF(AND(G11<>\"\",H11<>\"\"),(G11-F11)*24,0))","v":""},{"$f":"IF(I11=\"\",\"\",IF(AND(I11<>\"\",J11=\"\",I11>=Personalstamm!$D$20),Personalstamm!$E$20,IF(AND(I11<>\"\",J11=\"\",I11>=Personalstamm!$D$19),Personalstamm!$E$19,IF(AND(I11<>\"\",J11<Personalstamm!$E$20,I11>=Personalstamm!$D$20),Personalstamm!$E$20-J11,IF(AND(I11<>\"\",J11<Personalstamm!E$19,I11>=Personalstamm!$D$19),Personalstamm!$E$19-J11,0)))))","v":""},{"$f":"IF(I11<>\"\",I11-K11,\"\")","v":""},{"$f":"IF(AND(S11=\"Feiertag\",T11>0),\"Feiertag\",IF(C11=\"Fehlzeit\",\"Bitte auswählen\",\"\"))","v":""},{"$f":"IF(OR(M11=\"\",M11=\"Bitte auswählen\"),\"\",IF(M11=\"Feiertag\",T11*U11,IF(M11=\"Gleittag\",0,VLOOKUP(B11,Personalstamm!$D$8:$F$14,3,FALSE))))","v":""},{"$f":"VLOOKUP(B11,Personalstamm!$D$8:$E$14,2,FALSE)","v":{"v":0,"d":"0.00"}},{"$f":"IF(AND(OR(C11=\"Anwesenheit\",C11=\"Wochenende\"),L11<>\"\"),L11-O11,IF(AND(C11=\"Fehlzeit\",N11<>\"\",W11=\"Ja\"),N11-O11,IF(W11=\"Ja\",-O11,\"\")))","v":""},{"$f":"IF(P11=\"\",Q10,Q10+P11)","v":{"v":0,"d":"0.00"}},null,{"$f":"IF(COUNTIF(Allgemein!$H$8:$H$45,A11)>0,\"Feiertag\",\"\")","v":""},{"$f":"IFERROR(VLOOKUP(A11,Allgemein!$H$8:$I$45,2,FALSE),\"\")","v":""},{"$f":"VLOOKUP(B11,Personalstamm!$D$8:$F$14,3,FALSE)","v":{"v":0,"d":"0.00"}},{"$f":"IF(M11=\"Gleittag\",ABS(P11),\"\")","v":""},{"$f":"IF(A11<=TODAY(),\"Ja\",\"\")","v":""}]
["2026-08-03","Montag","Bitte auswählen",{"$nulls":5},"","",{"$f":"IF(I12=\"\",\"\",IF(AND(I12<>\"\",J12=\"\",I12>=Personalstamm!$D$20),Personalstamm!$E$20,IF(AND(I12<>\"\",J12=\"\",I12>=Personalstamm!$D$19),Personalstamm!$E$19,IF(AND(I12<>\"\",J12<Personalstamm!$E$20,I12>=Personalstamm!$D$20),Personalstamm!$E$20-J12,IF(AND(I12<>\"\",J12<Personalstamm!E$19,I12>=Personalstamm!$D$19),Personalstamm!$E$19-J12,0)))))","v":""},"","",{"$f":"IF(OR(M12=\"\",M12=\"Bitte auswählen\"),\"\",IF(M12=\"Feiertag\",T12*U12,IF(M12=\"Gleittag\",0,VLOOKUP(B12,Personalstamm!$D$8:$F$14,3,FALSE))))","v":""},{"$f":"VLOOKUP(B12,Personalstamm!$D$8:$E$14,2,FALSE)","v":{"v":8,"d":"8.00"}},"",{"$f":"IF(P12=\"\",Q11,Q11+P12)","v":{"v":0,"d":"0.00"}},null,{"$f":"IF(COUNTIF(Allgemein!$H$8:$H$45,A12)>0,\"Feiertag\",\"\")","v":""},{"$f":"IFERROR(VLOOKUP(A12,Allgemein!$H$8:$I$45,2,FALSE),\"\")","v":""},{"$f":"VLOOKUP(B12,Personalstamm!$D$8:$F$14,3,FALSE)","v":{"v":8,"d":"8.00"}},"",""]
["2026-08-04","Dienstag","Bitte auswählen",{"$nulls":5},"","",{"$f":"IF(I13=\"\",\"\",IF(AND(I13<>\"\",J13=\"\",I13>=Personalstamm!$D$20),Personalstamm!$E$20,IF(AND(I13<>\"\",J13=\"\",I13>=Personalstamm!$D$19),Personalstamm!$E$19,IF(AND(I13<>\"\",J13<Personalstamm!$E$20,I13>=Personalstamm!$D$20),Personalstamm!$E$20-J13,IF(AND(I13<>\"\",J13<Personalstamm!E$19,I13>=Personalstamm!$D$19),Personalstamm!$E$19-J13,0)))))","v":""},"","",{"$f":"IF(OR(M13=\"\",M13=\"Bitte auswählen\"),\"\",IF(M13=\"Feiertag\",T13*U13,IF(M13=\"Gleittag\",0,VLOOKUP(B13,Personalstamm!$D$8:$F$14,3,FALSE))))","v":""},{"$f":"VLOOKUP(B13,Personalstamm!$D$8:$E$14,2,FALSE)","v":{"v":8,"d":"8.00"}},"",{"v":0,"d":"0.00"},null,{"$f":"IF(COUNTIF(Allgemein!$H$8:$H$45,A13)>0,\"Feiertag\",\"\")","v":""},{"$f":"IFERROR(VLOOKUP(A13,Allgemein!$H$8:$I$45,2,FALSE),\"\")","v":""},{"$f":"VLOOKUP(B13,Personalstamm!$D$8:$F$14,3,FALSE)","v":{"v":8,"d":"8.00"}},"",""]
["2026-08-05","Mittwoch","Bitte auswählen",{"$nulls":5},"","",{"$f":"IF(I14=\"\",\"\",IF(AND(I14<>\"\",J14=\"\",I14>=Personalstamm!$D$20),Personalstamm!$E$20,IF(AND(I14<>\"\",J14=\"\",I14>=Personalstamm!$D$19),Personalstamm!$E$19,IF(AND(I14<>\"\",J14<Personalstamm!$E$20,I14>=Personalstamm!$D$20),Personalstamm!$E$20-J14,IF(AND(I14<>\"\",J14<Personalstamm!E$19,I14>=Personalstamm!$D$19),Personalstamm!$E$19-J14,0)))))","v":""},"","",{"$f":"IF(OR(M14=\"\",M14=\"Bitte auswählen\"),\"\",IF(M14=\"Feiertag\",T14*U14,IF(M14=\"Gleittag\",0,VLOOKUP(B14,Personalstamm!$D$8:$F$14,3,FALSE))))","v":""},{"$f":"VLOOKUP(B14,Personalstamm!$D$8:$E$14,2,FALSE)","v":{"v":8,"d":"8.00"}},"",{"v":0,"d":"0.00"},null,{"$f":"IF(COUNTIF(Allgemein!$H$8:$H$45,A14)>0,\"Feiertag\",\"\")","v":""},{"$f":"IFERROR(VLOOKUP(A14,Allgemein!$H$8:$I$45,2,FALSE),\"\")","v":""},{"$f":"VLOOKUP(B14,Personalstamm!$D$8:$F$14,3,FALSE)","v":{"v":8,"d":"8.00"}},"",""]
["2026-08-06","Donnerstag","Bitte auswählen",{"$nulls":5},"","",{"$f":"IF(I15=\"\",\"\",IF(AND(I15<>\"\",J15=\"\",I15>=Personalstamm!$D$20),Personalstamm!$E$20,IF(AND(I15<>\"\",J15=\"\",I15>=Personalstamm!$D$19),Personalstamm!$E$19,IF(AND(I15<>\"\",J15<Personalstamm!$E$20,I15>=Personalstamm!$D$20),Personalstamm!$E$20-J15,IF(AND(I15<>\"\",J15<Personalstamm!E$19,I15>=Personalstamm!$D$19),Personalstamm!$E$19-J15,0)))))","v":""},"","",{"$f":"IF(OR(M15=\"\",M15=\"Bitte auswählen\"),\"\",IF(M15=\"Feiertag\",T15*U15,IF(M15=\"Gleittag\",0,VLOOKUP(B15,Personalstamm!$D$8:$F$14,3,FALSE))))","v":""},{"$f":"VLOOKUP(B15,Personalstamm!$D$8:$E$14,2,FALSE)","v":{"v":8,"d":"8.00"}},"",{"v":0,"d":"0.00"},null,{"$f":"IF(COUNTIF(Allgemein!$H$8:$H$45,A15)>0,\"Feiertag\",\"\")","v":""},{"$f":"IFERROR(VLOOKUP(A15,Allgemein!$H$8:$I$45,2,FALSE),\"\")","v":""},{"$f":"VLOOKUP(B15,Personalstamm!$D$8:$F$14,3,FALSE)","v":{"v":8,"d":"8.00"}},"",""]
["2026-08-07","Freitag","Bitte auswählen",{"$nulls":5},"","",{"$f":"IF(I16=\"\",\"\",IF(AND(I16<>\"\",J16=\"\",I16>=Personalstamm!$D$20),Personalstamm!$E$20,IF(AND(I16<>\"\",J16=\"\",I16>=Personalstamm!$D$19),Personalstamm!$E$19,IF(AND(I16<>\"\",J16<Personalstamm!$E$20,I16>=Personalstamm!$D$20),Personalstamm!$E$20-J16,IF(AND(I16<>\"\",J16<Personalstamm!E$19,I16>=Personalstamm!$D$19),Personalstamm!$E$19-J16,0)))))","v":""},"","",{"$f":"IF(OR(M16=\"\",M16=\"Bitte auswählen\"),\"\",IF(M16=\"Feiertag\",T16*U16,IF(M16=\"Gleittag\",0,VLOOKUP(B16,Personalstamm!$D$8:$F$14,3,FALSE))))","v":""},{"$f":"VLOOKUP(B16,Personalstamm!$D$8:$E$14,2,FALSE)","v":{"v":8,"d":"8.00"}},"",{"v":0,"d":"0.00"},null,{"$f":"IF(COUNTIF(Allgemein!$H$8:$H$45,A16)>0,\"Feiertag\",\"\")","v":""},{"$f":"IFERROR(VLOOKUP(A16,Allgemein!$H$8:$I$45,2,FALSE),\"\")","v":""},{"$f":"VLOOKUP(B16,Personalstamm!$D$8:$F$14,3,FALSE)","v":{"v":8,"d":"8.00"}},"",""]
["2026-08-08","Samstag","Wochenende",{"$nulls":5},"","",{"$f":"IF(I17=\"\",\"\",IF(AND(I17<>\"\",J17=\"\",I17>=Personalstamm!$D$20),Personalstamm!$E$20,IF(AND(I17<>\"\",J17=\"\",I17>=Personalstamm!$D$19),Personalstamm!$E$19,IF(AND(I17<>\"\",J17<Personalstamm!$E$20,I17>=Personalstamm!$D$20),Personalstamm!$E$20-J17,IF(AND(I17<>\"\",J17<Personalstamm!E$19,I17>=Personalstamm!$D$19),Personalstamm!$E$19-J17,0)))))","v":""},"","",{"$f":"IF(OR(M17=\"\",M17=\"Bitte auswählen\"),\"\",IF(M17=\"Feiertag\",T17*U17,IF(M17=\"Gleittag\",0,VLOOKUP(B17,Personalstamm!$D$8:$F$14,3,FALSE))))","v":""},{"$f":"VLOOKUP(B17,Personalstamm!$D$8:$E$14,2,FALSE)","v":{"v":0,"d":"0.00"}},"",{"v":0,"d":"0.00"},null,{"$f":"IF(COUNTIF(Allgemein!$H$8:$H$45,A17)>0,\"Feiertag\",\"\")","v":"Feiertag"},{"$f":"IFERROR(VLOOKUP(A17,Allgemein!$H$8:$I$45,2,FALSE),\"\")","v":{"v":0,"d":"0.00"}},{"$f":"VLOOKUP(B17,Personalstamm!$D$8:$F$14,3,FALSE)","v":{"v":0,"d":"0.00"}},"",""]
["2026-08-09","Sonntag","Wochenende",{"$nulls":5},"","",{"$f":"IF(I18=\"\",\"\",IF(AND(I18<>\"\",J18=\"\",I18>=Personalstamm!$D$20),Personalstamm!$E$20,IF(AND(I18<>\"\",J18=\"\",I18>=Personalstamm!$D$19),Personalstamm!$E$19,IF(AND(I18<>\"\",J18<Personalstamm!$E$20,I18>=Personalstamm!$D$20),Personalstamm!$E$20-J18,IF(AND(I18<>\"\",J18<Personalstamm!E$19,I18>=Personalstamm!$D$19),Personalstamm!$E$19-J18,0)))))","v":""},"","",{"$f":"IF(OR(M18=\"\",M18=\"Bitte auswählen\"),\"\",IF(M18=\"Feiertag\",T18*U18,IF(M18=\"Gleittag\",0,VLOOKUP(B18,Personalstamm!$D$8:$F$14,3,FALSE))))","v":""},{"$f":"VLOOKUP(B18,Personalstamm!$D$8:$E$14,2,FALSE)","v":{"v":0,"d":"0.00"}},"",{"v":0,"d":"0.00"},null,{"$f":"IF(COUNTIF(Allgemein!$H$8:$H$45,A18)>0,\"Feiertag\",\"\")","v":""},{"$f":"IFERROR(VLOOKUP(A18,Allgemein!$H$8:$I$45,2,FALSE),\"\")","v":""},{"$f":"VLOOKUP(B18,Personalstamm!$D$8:$F$14,3,FALSE)","v":{"v":0,"d":"0.00"}},"",""]
["2026-08-10","Montag","Bitte auswählen",{"$nulls":5},"","",{"$f":"IF(I19=\"\",\"\",IF(AND(I19<>\"\",J19=\"\",I19>=Personalstamm!$D$20),Personalstamm!$E$20,IF(AND(I19<>\"\",J19=\"\",I19>=Personalstamm!$D$19),Personalstamm!$E$19,IF(AND(I19<>\"\",J19<Personalstamm!$E$20,I19>=Personalstamm!$D$20),Personalstamm!$E$20-J19,IF(AND(I19<>\"\",J19<Personalstamm!E$19,I19>=Personalstamm!$D$19),Personalstamm!$E$19-J19,0)))))","v":""},"","",{"$f":"IF(OR(M19=\"\",M19=\"Bitte auswählen\"),\"\",IF(M19=\"Feiertag\",T19*U19,IF(M19=\"Gleittag\",0,VLOOKUP(B19,Personalstamm!$D$8:$F$14,3,FALSE))))","v":""},{"$f":"VLOOKUP(B19,Personalstamm!$D$8:$E$14,2,FALSE)","v":{"v":8,"d":"8.00"}},"",{"v":0,"d":"0.00"},null,{"$f":"IF(COUNTIF(Allgemein!$H$8:$H$45,A19)>0,\"Feiertag\",\"\")","v":""},{"$f":"IFERROR(VLOOKUP(A19,Allgemein!$H$8:$I$45,2,FALSE),\"\")","v":""},{"$f":"VLOOKUP(B19,Personalstamm!$D$8:$F$14,3,FALSE)","v":{"v":8,"d":"8.00"}},"",""]
["2026-08-11","Dienstag","Bitte auswählen",{"$nulls":5},"","",{"$f":"IF(I20=\"\",\"\",IF(AND(I20<>\"\",J20=\"\",I20>=Personalstamm!$D$20),Personalstamm!$E$20,IF(AND(I20<>\"\",J20=\"\",I20>=Personalstamm!$D$19),Personalstamm!$E$19,IF(AND(I20<>\"\",J20<Personalstamm!$E$20,I20>=Personalstamm!$D$20),Personalstamm!$E$20-J20,IF(AND(I20<>\"\",J20<Personalstamm!E$19,I20>=Personalstamm!$D$19),Personalstamm!$E$19-J20,0)))))","v":""},"","",{"$f":"IF(OR(M20=\"\",M20=\"Bitte auswählen\"),\"\",IF(M20=\"Feiertag\",T20*U20,IF(M20=\"Gleittag\",0,VLOOKUP(B20,Personalstamm!$D$8:$F$14,3,FALSE))))","v":""},{"$f":"VLOOKUP(B20,Personalstamm!$D$8:$E$14,2,FALSE)","v":{"v":8,"d":"8.00"}},"",{"v":0,"d":"0.00"},null,{"$f":"IF(COUNTIF(Allgemein!$H$8:$H$45,A20)>0,\"Feiertag\",\"\")","v":""},{"$f":"IFERROR(VLOOKUP(A20,Allgemein!$H$8:$I$45,2,FALSE),\"\")","v":""},{"$f":"VLOOKUP(B20,Personalstamm!$D$8:$F$14,3,FALSE)","v":{"v":8,"d":"8.00"}},"",""]
["2026-08-12","Mittwoch","Bitte auswählen",{"$nulls":5},"","",{"$f":"IF(I21=\"\",\"\",IF(AND(I21<>\"\",J21=\"\",I21>=Personalstamm!$D$20),Personalstamm!$E$20,IF(AND(I21<>\"\",J21=\"\",I21>=Personalstamm!$D$19),Personalstamm!$E$19,IF(AND(I21<>\"\",J21<Personalstamm!$E$20,I21>=Personalstamm!$D$20),Personalstamm!$E$20-J21,IF(AND(I21<>\"\",J21<Personalstamm!E$19,I21>=Personalstamm!$D$19),Personalstamm!$E$19-J21,0)))))","v":""},"","",{"$f":"IF(OR(M21=\"\",M21=\"Bitte auswählen\"),\"\",IF(M21=\"Feiertag\",T21*U21,IF(M21=\"Gleittag\",0,VLOOKUP(B21,Personalstamm!$D$8:$F$14,3,FALSE))))","v":""},{"$f":"VLOOKUP(B21,Personalstamm!$D$8:$E$14,2,FALSE)","v":{"v":8,"d":"8.00"}},"",{"v":0,"d":"0.00"},null,{"$f":"IF(COUNTIF(Allgemein!$H$8:$H$45,A21)>0,\"Feiertag\",\"\")","v":""},{"$f":"IFERROR(VLOOKUP(A21,Allgemein!$H$8:$I$45,2,FALSE),\"\")","v":""},{"$f":"VLOOKUP(B21,Personalstamm!$D$8:$F$14,3,FALSE)","v":{"v":8,"d":"8.00"}},"",""]
["2026-08-13","Donnerstag","Bitte auswählen",{"$nulls":5},"","",{"$f":"IF(I22=\"\",\"\",IF(AND(I22<>\"\",J22=\"\",I22>=Personalstamm!$D$20),Personalstamm!$E$20,IF(AND(I22<>\"\",J22=\"\",I22>=Personalstamm!$D$19),Personalstamm!$E$19,IF(AND(I22<>\"\",J22<Personalstamm!$E$20,I22>=Personalstamm!$D$20),Personalstamm!$E$20-J22,IF(AND(I22<>\"\",J22<Personalstamm!E$19,I22>=Personalstamm!$D$19),Personalstamm!$E$19-J22,0)))))","v":""},"","",{"$f":"IF(OR(M22=\"\",M22=\"Bitte auswählen\"),\"\",IF(M22=\"Feiertag\",T22*U22,IF(M22=\"Gleittag\",0,VLOOKUP(B22,Personalstamm!$D$8:$F$14,3,FALSE))))","v":""},{"$f":"VLOOKUP(B22,Personalstamm!$D$8:$E$14,2,FALSE)","v":{"v":8,"d":"8.00"}},"",{"v":0,"d":"0.00"},null,{"$f":"IF(COUNTIF(Allgemein!$H$8:$H$45,A22)>0,\"Feiertag\",\"\")","v":""},{"$f":"IFERROR(VLOOKUP(A22,Allgemein!$H$8:$I$45,2,FALSE),\"\")","v":""},{"$f":"VLOOKUP(B22,Personalstamm!$D$8:$F$14,3,FALSE)","v":{"v":8,"d":"8.00"}},"",""]
["2026-08-14","Freitag","Bitte auswählen",{"$nulls":5},"","",{"$f":"IF(I23=\"\",\"\",IF(AND(I23<>\"\",J23=\"\",I23>=Personalstamm!$D$20),Personalstamm!$E$20,IF(AND(I23<>\"\",J23=\"\",I23>=Personalstamm!$D$19),Personalstamm!$E$19,IF(AND(I23<>\"\",J23<Personalstamm!$E$20,I23>=Personalstamm!$D$20),Personalstamm!$E$20-J23,IF(AND(I23<>\"\",J23<Personalstamm!E$19,I23>=Personalstamm!$D$19),Personalstamm!$E$19-J23,0)))))","v":""},"","",{"$f":"IF(OR(M23=\"\",M23=\"Bitte auswählen\"),\"\",IF(M23=\"Feiertag\",T23*U23,IF(M23=\"Gleittag\",0,VLOOKUP(B23,Personalstamm!$D$8:$F$14,3,FALSE))))","v":""},{"$f":"VLOOKUP(B23,Personalstamm!$D$8:$E$14,2,FALSE)","v":{"v":8,"d":"8.00"}},"",{"v":0,"d":"0.00"},null,{"$f":"IF(COUNTIF(Allgemein!$H$8:$H$45,A23)>0,\"Feiertag\",\"\")","v":""},{"$f":"IFERROR(VLOOKUP(A23,Allgemein!$H$8:$I$45,2,FALSE),\"\")","v":""},{"$f":"VLOOKUP(B23,Personalstamm!$D$8:$F$14,3,FALSE)","v":{"v":8,"d":"8.00"}},"",""]
["2026-08-15","Samstag","Fehlzeit",{"$nulls":5},"","",{"$f":"IF(I24=\"\",\"\",IF(AND(I24<>\"\",J24=\"\",I24>=Personalstamm!$D$20),Personalstamm!$E$20,IF(AND(I24<>\"\",J24=\"\",I24>=Personalstamm!$D$19),Personalstamm!$E$19,IF(AND(I24<>\"\",J24<Personalstamm!$E$20,I24>=Personalstamm!$D$20),Personalstamm!$E$20-J24,IF(AND(I24<>\"\",J24<Personalstamm!E$19,I24>=Personalstamm!$D$19),Personalstamm!$E$19-J24,0)))))","v":""},"","Feiertag",{"$f":"IF(OR(M24=\"\",M24=\"Bitte auswählen\"),\"\",IF(M24=\"Feiertag\",T24*U24,IF(M24=\"Gleittag\",0,VLOOKUP(B24,Personalstamm!$D$8:$F$14,3,FALSE))))","v":{"v":0,"d":"0.00"}},{"$f":"VLOOKUP(B24,Personalstamm!$D$8:$E$14,2,FALSE)","v":{"v":0,"d":"0.00"}},"",{"v":0,"d":"0.00"},null,{"$f":"IF(COUNTIF(Allgemein!$H$8:$H$45,A24)>0,\"Feiertag\",\"\")","v":"Feiertag"},{"$f":"IFERROR(VLOOKUP(A24,Allgemein!$H$8:$I$45,2,FALSE),\"\")","v":{"v":1,"d":"1.00"}},{"$f":"VLOOKUP(B24,Personalstamm!$D$8:$F$14,3,FALSE)","v":{"v":0,"d":"0.00"}},"",""]
["2026-08-16","Sonntag","Wochenende",{"$nulls":5},"","",{"$f":"IF(I25=\"\",\"\",IF(AND(I25<>\"\",J25=\"\",I25>=Personalstamm!$D$20),Personalstamm!$E$20,IF(AND(I25<>\"\",J25=\"\",I25>=Personalstamm!$D$19),Personalstamm!$E$19,IF(AND(I25<>\"\",J25<Personalstamm!$E$20,I25>=Personalstamm!$D$20),Personalstamm!$E$20-J25,IF(AND(I25<>\"\",J25<Personalstamm!E$19,I25>=Personalstamm!$D$19),Personalstamm!$E$19-J25,0)))))","v":""},"","",{"$f":"IF(OR(M25=\"\",M25=\"Bitte auswählen\"),\"\",IF(M25=\"Feiertag\",T25*U25,IF(M25=\"Gleittag\",0,VLOOKUP(B25,Personalstamm!$D$8:$F$14,3,FALSE))))","v":""},{"$f":"VLOOKUP(B25,Personalstamm!$D$8:$E$14,2,FALSE)","v":{"v":0,"d":"0.00"}},"",{"v":0,"d":"0.00"},null,{"$f":"IF(COUNTIF(Allgemein!$H$8:$H$45,A25)>0,\"Feiertag\",\"\")","v":""},{"$f":"IFERROR(VLOOKUP(A25,Allgemein!$H$8:$I$45,2,FALSE),\"\")","v":""},{"$f":"VLOOKUP(B25,Personalstamm!$D$8:$F$14,3,FALSE)","v":{"v":0,"d":"0.00"}},"",""]
["2026-08-17","Montag","Bitte auswählen",{"$nulls":5},"","",{"$f":"IF(I26=\"\",\"\",IF(AND(I26<>\"\",J26=\"\",I26>=Personalstamm!$D$20),Personalstamm!$E$20,IF(AND(I26<>\"\",J26=\"\",I26>=Personalstamm!$D$19),Personalstamm!$E$19,IF(AND(I26<>\"\",J26<Personalstamm!$E$20,I26>=Personalstamm!$D$20),Personalstamm!$E$20-J26,IF(AND(I26<>\"\",J26<Personalstamm!E$19,I26>=Personalstamm!$D$19),Personalstamm!$E$19-J26,0)))))","v":""},"","",{"$f":"IF(OR(M26=\"\",M26=\"Bitte auswählen\"),\"\",IF(M26=\"Feiertag\",T26*U26,IF(M26=\"Gleittag\",0,VLOOKUP(B26,Personalstamm!$D$8:$F$14,3,FALSE))))","v":""},{"$f":"VLOOKUP(B26,Personalstamm!$D$8:$E$14,2,FALSE)","v":{"v":8,"d":"8.00"}},"",{"v":0,"d":"0.00"},null,{"$f":"IF(COUNTIF(Allgemein!$H$8:$H$45,A26)>0,\"Feiertag\",\"\")","v":""},{"$f":"IFERROR(VLOOKUP(A26,Allgemein!$H$8:$I$45,2,FALSE),\"\")","v":""},{"$f":"VLOOKUP(B26,Personalstamm!$D$8:$F$14,3,FALSE)","v":{"v":8,"d":"8.00"}},"",""]
["2026-08-18","Dienstag","Bitte auswählen",{"$nulls":5},"","",{"$f":"IF(I27=\"\",\"\",IF(AND(I27<>\"\",J27=\"\",I27>=Personalstamm!$D$20),Personalstamm!$E$20,IF(AND(I27<>\"\",J27=\"\",I27>=Personalstamm!$D$19),Personalstamm!$E$19,IF(AND(I27<>\"\",J27<Personalstamm!$E$20,I27>=Personalstamm!$D$20),Personalstamm!$E$20-J27,IF(AND(I27<>\"\",J27<Personalstamm!E$19,I27>=Personalstamm!$D$19),Personalstamm!$E$19-J27,0)))))","v":""},"","",{"$f":"IF(OR(M27=\"\",M27=\"Bitte auswählen\"),\"\",IF(M27=\"Feiertag\",T27*U27,IF(M27=\"Gleittag\",0,VLOOKUP(B27,Personalstamm!$D$8:$F$14,3,FALSE))))","v":""},{"$f":"VLOOKUP(B27,Personalstamm!$D$8:$E$14,2,FALSE)","v":{"v":8,"d":"8.00"}},"",{"v":0,"d":"0.00"},null,{"$f":"IF(COUNTIF(Allgemein!$H$8:$H$45,A27)>0,\"Feiertag\",\"\")","v":""},{"$f":"IFERROR(VLOOKUP(A27,Allgemein!$H$8:$I$45,2,FALSE),\"\")","v":""},{"$f":"VLOOKUP(B27,Personalstamm!$D$8:$F$14,3,FALSE)","v":{"v":8,"d":"8.00"}},"",""]
["2026-08-19","Mittwoch","Bitte auswählen",{"$nulls":5},"","",{"$f":"IF(I28=\"\",\"\",IF(AND(I28<>\"\",J28=\"\",I28>=Personalstamm!$D$20),Personalstamm!$E$20,IF(AND(I28<>\"\",J28=\"\",I28>=Personalstamm!$D$19),Personalstamm!$E$19,IF(AND(I28<>\"\",J28<Personalstamm!$E$20,I28>=Personalstamm!$D$20),Personalstamm!$E$20-J28,IF(AND(I28<>\"\",J28<Personalstamm!E$19,I28>=Personalstamm!$D$19),Personalstamm!$E$19-J28,0)))))","v":""},"","",{"$f":"IF(OR(M28=\"\",M28=\"Bitte auswählen\"),\"\",IF(M28=\"Feiertag\",T28*U28,IF(M28=\"Gleittag\",0,VLOOKUP(B28,Personalstamm!$D$8:$F$14,3,FALSE))))","v":""},{"$f":"VLOOKUP(B28,Personalstamm!$D$8:$E$14,2,FALSE)","v":{"v":8,"d":"8.00"}},"",{"v":0,"d":"0.00"},null,{"$f":"IF(COUNTIF(Allgemein!$H$8:$H$45,A28)>0,\"Feiertag\",\"\")","v":""},{"$f":"IFERROR(VLOOKUP(A28,Allgemein!$H$8:$I$45,2,FALSE),\"\")","v":""},{"$f":"VLOOKUP(B28,Personalstamm!$D$8:$F$14,3,FALSE)","v":{"v":8,"d":"8.00"}},"",""]
["2026-08-20","Donnerstag","Bitte auswählen",{"$nulls":5},"","",{"$f":"IF(I29=\"\",\"\",IF(AND(I29<>\"\",J29=\"\",I29>=Personalstamm!$D$20),Personalstamm!$E$20,IF(AND(I29<>\"\",J29=\"\",I29>=Personalstamm!$D$19),Personalstamm!$E$19,IF(AND(I29<>\"\",J29<Personalstamm!$E$20,I29>=Personalstamm!$D$20),Personalstamm!$E$20-J29,IF(AND(I29<>\"\",J29<Personalstamm!E$19,I29>=Personalstamm!$D$19),Personalstamm!$E$19-J29,0)))))","v":""},"","",{"$f":"IF(OR(M29=\"\",M29=\"Bitte auswählen\"),\"\",IF(M29=\"Feiertag\",T29*U29,IF(M29=\"Gleittag\",0,VLOOKUP(B29,Personalstamm!$D$8:$F$14,3,FALSE))))","v":""},{"$f":"VLOOKUP(B29,Personalstamm!$D$8:$E$14,2,FALSE)","v":{"v":8,"d":"8.00"}},"",{"v":0,"d":"0.00"},null,{"$f":"IF(COUNTIF(Allgemein!$H$8:$H$45,A29)>0,\"Feiertag\",\"\")","v":""},{"$f":"IFERROR(VLOOKUP(A29,Allgemein!$H$8:$I$45,2,FALSE),\"\")","v":""},{"$f":"VLOOKUP(B29,Personalstamm!$D$8:$F$14,3,FALSE)","v":{"v":8,"d":"8.00"}},"",""]
["2026-08-21","Freitag","Bitte auswählen",{"$nulls":5},"","",{"$f":"IF(I30=\"\",\"\",IF(AND(I30<>\"\",J30=\"\",I30>=Personalstamm!$D$20),Personalstamm!$E$20,IF(AND(I30<>\"\",J30=\"\",I30>=Personalstamm!$D$19),Personalstamm!$E$19,IF(AND(I30<>\"\",J30<Personalstamm!$E$20,I30>=Personalstamm!$D$20),Personalstamm!$E$20-J30,IF(AND(I30<>\"\",J30<Personalstamm!E$19,I30>=Personalstamm!$D$19),Personalstamm!$E$19-J30,0)))))","v":""},"","",{"$f":"IF(OR(M30=\"\",M30=\"Bitte auswählen\"),\"\",IF(M30=\"Feiertag\",T30*U30,IF(M30=\"Gleittag\",0,VLOOKUP(B30,Personalstamm!$D$8:$F$14,3,FALSE))))","v":""},{"$f":"VLOOKUP(B30,Personalstamm!$D$8:$E$14,2,FALSE)","v":{"v":8,"d":"8.00"}},"",{"v":0,"d":"0.00"},null,{"$f":"IF(COUNTIF(Allgemein!$H$8:$H$45,A30)>0,\"Feiertag\",\"\")","v":""},{"$f":"IFERROR(VLOOKUP(A30,Allgemein!$H$8:$I$45,2,FALSE),\"\")","v":""},{"$f":"VLOOKUP(B30,Personalstamm!$D$8:$F$14,3,FALSE)","v":{"v":8,"d":"8.00"}},"",""]
["2026-08-22","Samstag","Wochenende",{"$nulls":5},"","",{"$f":"IF(I31=\"\",\"\",IF(AND(I31<>\"\",J31=\"\",I31>=Personalstamm!$D$20),Personalstamm!$E$20,IF(AND(I31<>\"\",J31=\"\",I31>=Personalstamm!$D$19),Personalstamm!$E$19,IF(AND(I31<>\"\",J31<Personalstamm!$E$20,I31>=Personalstamm!$D$20),Personalstamm!$E$20-J31,IF(AND(I31<>\"\",J31<Personalstamm!E$19,I31>=Personalstamm!$D$19),Personalstamm!$E$19-J31,0)))))","v":""},"","",{"$f":"IF(OR(M31=\"\",M31=\"Bitte auswählen\"),\"\",IF(M31=\"Feiertag\",T31*U31,IF(M31=\"Gleittag\",0,VLOOKUP(B31,Personalstamm!$D$8:$F$14,3,FALSE))))","v":""},{"$f":"VLOOKUP(B31,Personalstamm!$D$8:$E$14,2,FALSE)","v":{"v":0,"d":"0.00"}},"",{"v":0,"d":"0.00"},null,{"$f":"IF(COUNTIF(Allgemein!$H$8:$H$45,A31)>0,\"Feiertag\",\"\")","v":""},{"$f":"IFERROR(VLOOKUP(A31,Allgemein!$H$8:$I$45,2,FALSE),\"\")","v":""},{"$f":"VLOOKUP(B31,Personalstamm!$D$8:$F$14,3,FALSE)","v":{"v":0,"d":"0.00"}},"",""]
["2026-08-23","Sonntag","Wochenende",{"$nulls":5},"","",{"$f":"IF(I32=\"\",\"\",IF(AND(I32<>\"\",J32=\"\",I32>=Personalstamm!$D$20),Personalstamm!$E$20,IF(AND(I32<>\"\",J32=\"\",I32>=Personalstamm!$D$19),Personalstamm!$E$19,IF(AND(I32<>\"\",J32<Personalstamm!$E$20,I32>=Personalstamm!$D$20),Personalstamm!$E$20-J32,IF(AND(I32<>\"\",J32<Personalstamm!E$19,I32>=Personalstamm!$D$19),Personalstamm!$E$19-J32,0)))))","v":""},"","",{"$f":"IF(OR(M32=\"\",M32=\"Bitte auswählen\"),\"\",IF(M32=\"Feiertag\",T32*U32,IF(M32=\"Gleittag\",0,VLOOKUP(B32,Personalstamm!$D$8:$F$14,3,FALSE))))","v":""},{"$f":"VLOOKUP(B32,Personalstamm!$D$8:$E$14,2,FALSE)","v":{"v":0,"d":"0.00"}},"",{"v":0,"d":"0.00"},null,{"$f":"IF(COUNTIF(Allgemein!$H$8:$H$45,A32)>0,\"Feiertag\",\"\")","v":""},{"$f":"IFERROR(VLOOKUP(A32,Allgemein!$H$8:$I$45,2,FALSE),\"\")","v":""},{"$f":"VLOOKUP(B32,Personalstamm!$D$8:$F$14,3,FALSE)","v":{"v":0,"d":"0.00"}},"",""]
["2026-08-24","Montag","Bitte auswählen",{"$nulls":5},"","",{"$f":"IF(I33=\"\",\"\",IF(AND(I33<>\"\",J33=\"\",I33>=Personalstamm!$D$20),Personalstamm!$E$20,IF(AND(I33<>\"\",J33=\"\",I33>=Personalstamm!$D$19),Personalstamm!$E$19,IF(AND(I33<>\"\",J33<Personalstamm!$E$20,I33>=Personalstamm!$D$20),Personalstamm!$E$20-J33,IF(AND(I33<>\"\",J33<Personalstamm!E$19,I33>=Personalstamm!$D$19),Personalstamm!$E$19-J33,0)))))","v":""},"","",{"$f":"IF(OR(M33=\"\",M33=\"Bitte auswählen\"),\"\",IF(M33=\"Feiertag\",T33*U33,IF(M33=\"Gleittag\",0,VLOOKUP(B33,Personalstamm!$D$8:$F$14,3,FALSE))))","v":""},{"$f":"VLOOKUP(B33,Personalstamm!$D$8:$E$14,2,FALSE)","v":{"v":8,"d":"8.00"}},"",{"v":0,"d":"0.00"},null,{"$f":"IF(COUNTIF(Allgemein!$H$8:$H$45,A33)>0,\"Feiertag\",\"\")","v":""},{"$f":"IFERROR(VLOOKUP(A33,Allgemein!$H$8:$I$45,2,FALSE),\"\")","v":""},{"$f":"VLOOKUP(B33,Personalstamm!$D$8:$F$14,3,FALSE)","v":{"v":8,"d":"8.00"}},"",""]
["2026-08-25","Dienstag","Bitte auswählen",{"$nulls":5},"","",{"$f":"IF(I34=\"\",\"\",IF(AND(I34<>\"\",J34=\"\",I34>=Personalstamm!$D$20),Personalstamm!$E$20,IF(AND(I34<>\"\",J34=\"\",I34>=Personalstamm!$D$19),Personalstamm!$E$19,IF(AND(I34<>\"\",J34<Personalstamm!$E$20,I34>=Personalstamm!$D$20),Personalstamm!$E$20-J34,IF(AND(I34<>\"\",J34<Personalstamm!E$19,I34>=Personalstamm!$D$19),Personalstamm!$E$19-J34,0)))))","v":""},"","",{"$f":"IF(OR(M34=\"\",M34=\"Bitte auswählen\"),\"\",IF(M34=\"Feiertag\",T34*U34,IF(M34=\"Gleittag\",0,VLOOKUP(B34,Personalstamm!$D$8:$F$14,3,FALSE))))","v":""},{"$f":"VLOOKUP(B34,Personalstamm!$D$8:$E$14,2,FALSE)","v":{"v":8,"d":"8.00"}},"",{"v":0,"d":"0.00"},null,{"$f":"IF(COUNTIF(Allgemein!$H$8:$H$45,A34)>0,\"Feiertag\",\"\")","v":""},{"$f":"IFERROR(VLOOKUP(A34,Allgemein!$H$8:$I$45,2,FALSE),\"\")","v":""},{"$f":"VLOOKUP(B34,Personalstamm!$D$8:$F$14,3,FALSE)","v":{"v":8,"d":"8.00"}},"",""]
["2026-08-26","Mittwoch","Bitte auswählen",{"$nulls":5},"","",{"$f":"IF(I35=\"\",\"\",IF(AND(I35<>\"\",J35=\"\",I35>=Personalstamm!$D$20),Personalstamm!$E$20,IF(AND(I35<>\"\",J35=\"\",I35>=Personalstamm!$D$19),Personalstamm!$E$19,IF(AND(I35<>\"\",J35<Personalstamm!$E$20,I35>=Personalstamm!$D$20),Personalstamm!$E$20-J35,IF(AND(I35<>\"\",J35<Personalstamm!E$19,I35>=Personalstamm!$D$19),Personalstamm!$E$19-J35,0)))))","v":""},"","",{"$f":"IF(OR(M35=\"\",M35=\"Bitte auswählen\"),\"\",IF(M35=\"Feiertag\",T35*U35,IF(M35=\"Gleittag\",0,VLOOKUP(B35,Personalstamm!$D$8:$F$14,3,FALSE))))","v":""},{"$f":"VLOOKUP(B35,Personalstamm!$D$8:$E$14,2,FALSE)","v":{"v":8,"d":"8.00"}},"",{"v":0,"d":"0.00"},null,{"$f":"IF(COUNTIF(Allgemein!$H$8:$H$45,A35)>0,\"Feiertag\",\"\")","v":""},{"$f":"IFERROR(VLOOKUP(A35,Allgemein!$H$8:$I$45,2,FALSE),\"\")","v":""},{"$f":"VLOOKUP(B35,Personalstamm!$D$8:$F$14,3,FALSE)","v":{"v":8,"d":"8.00"}},"",""]
["2026-08-27","Donnerstag","Bitte auswählen",{"$nulls":5},"","",{"$f":"IF(I36=\"\",\"\",IF(AND(I36<>\"\",J36=\"\",I36>=Personalstamm!$D$20),Personalstamm!$E$20,IF(AND(I36<>\"\",J36=\"\",I36>=Personalstamm!$D$19),Personalstamm!$E$19,IF(AND(I36<>\"\",J36<Personalstamm!$E$20,I36>=Personalstamm!$D$20),Personalstamm!$E$20-J36,IF(AND(I36<>\"\",J36<Personalstamm!E$19,I36>=Personalstamm!$D$19),Personalstamm!$E$19-J36,0)))))","v":""},"","",{"$f":"IF(OR(M36=\"\",M36=\"Bitte auswählen\"),\"\",IF(M36=\"Feiertag\",T36*U36,IF(M36=\"Gleittag\",0,VLOOKUP(B36,Personalstamm!$D$8:$F$14,3,FALSE))))","v":""},{"$f":"VLOOKUP(B36,Personalstamm!$D$8:$E$14,2,FALSE)","v":{"v":8,"d":"8.00"}},"",{"v":0,"d":"0.00"},null,{"$f":"IF(COUNTIF(Allgemein!$H$8:$H$45,A36)>0,\"Feiertag\",\"\")","v":""},{"$f":"IFERROR(VLOOKUP(A36,Allgemein!$H$8:$I$45,2,FALSE),\"\")","v":""},{"$f":"VLOOKUP(B36,Personalstamm!$D$8:$F$14,3,FALSE)","v":{"v":8,"d":"8.00"}},"",""]
["2026-08-28","Freitag","Bitte auswählen",{"$nulls":5},"","",{"$f":"IF(I37=\"\",\"\",IF(AND(I37<>\"\",J37=\"\",I37>=Personalstamm!$D$20),Personalstamm!$E$20,IF(AND(I37<>\"\",J37=\"\",I37>=Personalstamm!$D$19),Personalstamm!$E$19,IF(AND(I37<>\"\",J37<Personalstamm!$E$20,I37>=Personalstamm!$D$20),Personalstamm!$E$20-J37,IF(AND(I37<>\"\",J37<Personalstamm!E$19,I37>=Personalstamm!$D$19),Personalstamm!$E$19-J37,0)))))","v":""},"","",{"$f":"IF(OR(M37=\"\",M37=\"Bitte auswählen\"),\"\",IF(M37=\"Feiertag\",T37*U37,IF(M37=\"Gleittag\",0,VLOOKUP(B37,Personalstamm!$D$8:$F$14,3,FALSE))))","v":""},{"$f":"VLOOKUP(B37,Personalstamm!$D$8:$E$14,2,FALSE)","v":{"v":8,"d":"8.00"}},"",{"v":0,"d":"0.00"},null,{"$f":"IF(COUNTIF(Allgemein!$H$8:$H$45,A37)>0,\"Feiertag\",\"\")","v":""},{"$f":"IFERROR(VLOOKUP(A37,Allgemein!$H$8:$I$45,2,FALSE),\"\")","v":""},{"$f":"VLOOKUP(B37,Personalstamm!$D$8:$F$14,3,FALSE)","v":{"v":8,"d":"8.00"}},"",""]
["2026-08-29","Samstag","Wochenende",{"$nulls":5},"","",{"$f":"IF(I38=\"\",\"\",IF(AND(I38<>\"\",J38=\"\",I38>=Personalstamm!$D$20),Personalstamm!$E$20,IF(AND(I38<>\"\",J38=\"\",I38>=Personalstamm!$D$19),Personalstamm!$E$19,IF(AND(I38<>\"\",J38<Personalstamm!$E$20,I38>=Personalstamm!$D$20),Personalstamm!$E$20-J38,IF(AND(I38<>\"\",J38<Personalstamm!E$19,I38>=Personalstamm!$D$19),Personalstamm!$E$19-J38,0)))))","v":""},"","",{"$f":"IF(OR(M38=\"\",M38=\"Bitte auswählen\"),\"\",IF(M38=\"Feiertag\",T38*U38,IF(M38=\"Gleittag\",0,VLOOKUP(B38,Personalstamm!$D$8:$F$14,3,FALSE))))","v":""},{"$f":"VLOOKUP(B38,Personalstamm!$D$8:$E$14,2,FALSE)","v":{"v":0,"d":"0.00"}},"",{"v":0,"d":"0.00"},null,{"$f":"IF(COUNTIF(Allgemein!$H$8:$H$45,A38)>0,\"Feiertag\",\"\")","v":""},{"$f":"IFERROR(VLOOKUP(A38,Allgemein!$H$8:$I$45,2,FALSE),\"\")","v":""},{"$f":"VLOOKUP(B38,Personalstamm!$D$8:$F$14,3,FALSE)","v":{"v":0,"d":"0.00"}},"",""]
["2026-08-30","Sonntag","Wochenende",{"$nulls":5},"","",{"$f":"IF(I39=\"\",\"\",IF(AND(I39<>\"\",J39=\"\",I39>=Personalstamm!$D$20),Personalstamm!$E$20,IF(AND(I39<>\"\",J39=\"\",I39>=Personalstamm!$D$19),Personalstamm!$E$19,IF(AND(I39<>\"\",J39<Personalstamm!$E$20,I39>=Personalstamm!$D$20),Personalstamm!$E$20-J39,IF(AND(I39<>\"\",J39<Personalstamm!E$19,I39>=Personalstamm!$D$19),Personalstamm!$E$19-J39,0)))))","v":""},"","",{"$f":"IF(OR(M39=\"\",M39=\"Bitte auswählen\"),\"\",IF(M39=\"Feiertag\",T39*U39,IF(M39=\"Gleittag\",0,VLOOKUP(B39,Personalstamm!$D$8:$F$14,3,FALSE))))","v":""},{"$f":"VLOOKUP(B39,Personalstamm!$D$8:$E$14,2,FALSE)","v":{"v":0,"d":"0.00"}},"",{"v":0,"d":"0.00"},null,{"$f":"IF(COUNTIF(Allgemein!$H$8:$H$45,A39)>0,\"Feiertag\",\"\")","v":""},{"$f":"IFERROR(VLOOKUP(A39,Allgemein!$H$8:$I$45,2,FALSE),\"\")","v":""},{"$f":"VLOOKUP(B39,Personalstamm!$D$8:$F$14,3,FALSE)","v":{"v":0,"d":"0.00"}},"",""]
["2026-08-31","Montag","Bitte auswählen",{"$nulls":5},"","",{"$f":"IF(I40=\"\",\"\",IF(AND(I40<>\"\",J40=\"\",I40>=Personalstamm!$D$20),Personalstamm!$E$20,IF(AND(I40<>\"\",J40=\"\",I40>=Personalstamm!$D$19),Personalstamm!$E$19,IF(AND(I40<>\"\",J40<Personalstamm!$E$20,I40>=Personalstamm!$D$20),Personalstamm!$E$20-J40,IF(AND(I40<>\"\",J40<Personalstamm!E$19,I40>=Personalstamm!$D$19),Personalstamm!$E$19-J40,0)))))","v":""},"","",{"$f":"IF(OR(M40=\"\",M40=\"Bitte auswählen\"),\"\",IF(M40=\"Feiertag\",T40*U40,IF(M40=\"Gleittag\",0,VLOOKUP(B40,Personalstamm!$D$8:$F$14,3,FALSE))))","v":""},{"$f":"VLOOKUP(B40,Personalstamm!$D$8:$E$14,2,FALSE)","v":{"v":8,"d":"8.00"}},"",{"v":0,"d":"0.00"},null,{"$f":"IF(COUNTIF(Allgemein!$H$8:$H$45,A40)>0,\"Feiertag\",\"\")","v":""},{"$f":"IFERROR(VLOOKUP(A40,Allgemein!$H$8:$I$45,2,FALSE),\"\")","v":""},{"$f":"VLOOKUP(B40,Personalstamm!$D$8:$F$14,3,FALSE)","v":{"v":8,"d":"8.00"}},"",""]
["Summe",{"$nulls":7},{"$f":"SUM(I10:I40)","v":{"v":0,"d":"0.00"}},{"$f":"SUM(J10:J40)","v":{"v":0,"d":"0.00"}},{"$f":"SUM(K10:K40)","v":{"v":0,"d":"0.00"}},{"$f":"SUM(L10:L40)","v":{"v":0,"d":"0.00"}},null,{"$f":"SUM(N10:N40)","v":{"v":0,"d":"0.00"}},{"$f":"SUM(O10:O40)","v":{"v":168,"d":"168.00"}},{"$f":"SUM(P10:P40)","v":{"v":0,"d":"0.00"}}]
[]
["Art","Anzahl Tage",null,"Fehlzeitenart","Anzahl Tage","Anzahl Stunden",null,"Urlaub genommen","Urlaub geplant"]
["Monat",{"$f":"COUNTIF($C$10:$C$40,\"*\")","v":{"v":31,"d":"31.00"}},null,"Urlaub",{"$f":"COUNTIF($M$10:$M$40,Allgemein!$I$50)","v":{"v":0,"d":"0.00"}},{"$f":"SUMIF($M$10:$M$40,Allgemein!$I$50,$N$10:$N$40)","v":{"v":0,"d":"0.00"}},null,{"$f":"COUNTIFS($A$10:$A$40,\"<\"&TODAY(),$M$10:$M$40,\"Urlaub\")","v":{"v":0,"d":"0.00"}},{"$f":"COUNTIFS($A$10:$A$40,\">=\"&TODAY(),$M$10:$M$40,\"Urlaub\")","v":{"v":0,"d":"0.00"}}]
["Anwesenheit",{"$f":"COUNTIF($C$10:$C$40,Allgemein!$G$50)","v":{"v":0,"d":"0.00"}},null,"Krankheit",{"$f":"COUNTIF($M$10:$M$40,Allgemein!$I$51)","v":{"v":0,"d":"0.00"}},{"$f":"SUMIF($M$10:$M$40,Allgemein!$I$51,$N$10:$N$40)","v":{"v":0,"d":"0.00"}}]
["Fehlzeit",{"$f":"COUNTIF($C$10:$C$40,Allgemein!$G$51)","v":{"v":1,"d":"1.00"}},null,"Kurzarbeit",{"$f":"COUNTIF($M$10:$M$40,Allgemein!$I$52)","v":{"v":0,"d":"0.00"}},{"$f":"SUMIF($M$10:$M$40,Allgemein!$I$52,$N$10:$N$40)","v":{"v":0,"d":"0.00"}}]
["Wochenende",{"$f":"COUNTIF($C$10:$C$40,Allgemein!$G$52)","v":{"v":9,"d":"9.00"}},null,"Mutterschutz",{"$f":"COUNTIF($M$10:$M$40,Allgemein!$I$53)","v":{"v":0,"d":"0.00"}},{"$f":"SUMIF($M$10:$M$40,Allgemein!$I$53,$N$10:$N$40)","v":{"v":0,"d":"0.00"}}]
["Undefiniert",{"$f":"COUNTIF($C$10:$C$40,Allgemein!$G$49)","v":{"v":21,"d":"21.00"}},null,"Fortbildung",{"$f":"COUNTIF($M$10:$M$40,Allgemein!$I$54)","v":{"v":0,"d":"0.00"}},{"$f":"SUMIF($M$10:$M$40,Allgemein!$I$54,$N$10:$N$40)","v":{"v":0,"d":"0.00"}}]
[{"$nulls":3},"Elternzeit",{"$f":"COUNTIF($M$10:$M$40,Allgemein!$I$55)","v":{"v":0,"d":"0.00"}},{"$f":"SUMIF($M$10:$M$40,Allgemein!$I$55,$N$10:$N$40)","v":{"v":0,"d":"0.00"}}]
[{"$nulls":3},"Gleittag",{"$f":"COUNTIF($M$10:$M$40,Allgemein!$I$56)","v":{"v":0,"d":"0.00"}},{"$f":"SUMIF($M$10:$M$40,Allgemein!$I$56,$V$10:$V$40)","v":{"v":0,"d":"0.00"}}]
[{"$nulls":3},"Schule",{"$f":"COUNTIF($M$10:$M$40,Allgemein!$I$57)","v":{"v":0,"d":"0.00"}},{"$f":"SUMIF($M$10:$M$40,Allgemein!$I$57,$N$10:$N$40)","v":{"v":0,"d":"0.00"}}]
[{"$nulls":3},"Feiertag",{"$f":"COUNTIF($M$10:$M$40,Allgemein!$I$58)","v":{"v":1,"d":"1.00"}},{"$f":"SUMIF($M$10:$M$40,Allgemein!$I$58,$N$10:$N$40)","v":{"v":0,"d":"0.00"}}]
[{"$nulls":3},"Undefiniert",{"$f":"COUNTIF($M$10:$M$40,Allgemein!$I$49)","v":{"v":0,"d":"0.00"}},{"$f":"SUMIF($M$10:$M$40,Allgemein!$I$49,$N$10:$N$40)","v":{"v":0,"d":"0.00"}}]

{"sheet":"Sep.","index":13,"n_rows":52,"n_cols":23,"rows_kept":52}
[]
[]
[]
[]
[]
["Urlaubsvortrag",{"$f":"Aug.!$F$6","v":{"v":30,"d":"30.00"}},"Urlaub genommen",{"$f":"$H$43","v":{"v":0,"d":"0.00"}},"Resturlaub",{"$f":"$B$6-$D$6","v":{"v":30,"d":"30.00"}}]
["Saldovortrag",{"$f":"Aug.!$F$7","v":{"v":0,"d":"0.00"}},"Saldoänderung",{"$f":"$P$40","v":{"v":0,"d":"0.00"}},"Kumulierter Saldo",{"$f":"$B$7+$D$7","v":{"v":0,"d":"0.00"}}]
[]
["Datum","Wochentag","Art","Arbeitsort","Von Uhrzeit","Bis Uhrzeit","Von Uhrzeit","Bis Uhrzeit","Bruttoarbeitszeit","Geb. Pause","Mindestpause","Nettoarbeitszeit","Fehlzeitenart","Fehlstunden","Sollstunden","Tagessaldo","Kumulierter Saldo",null,"Feiertag","Feiertag Anteil Tag","FZ-Gutschrift","Gleittag","Ausgewertet"]
["2026-09-01",{"$f":"TEXT(A10,\"tttt\")","v":"Dienstag"},{"$f":"IF(AND(S10=\"Feiertag\",T10>0),\"Fehlzeit\",IF(OR(B10=\"Samstag\",B10=\"Sonntag\"),\"Wochenende\",\"Bitte auswählen\"))","v":"Bitte auswählen"},{"$nulls":5},{"$f":"IF(AND(OR(C10=\"Anwesenheit\",C10=\"Wochenende\"),E10<>\"\",F10<>\"\",W10=\"Ja\"),((F10-E10)+(H10-G10))*24,\"\")","v":""},{"$f":"IF(I10=\"\",\"\",IF(AND(G10<>\"\",H10<>\"\"),(G10-F10)*24,0))","v":""},{"$f":"IF(I10=\"\",\"\",IF(AND(I10<>\"\",J10=\"\",I10>=Personalstamm!$D$20),Personalstamm!$E$20,IF(AND(I10<>\"\",J10=\"\",I10>=Personalstamm!$D$19),Personalstamm!$E$19,IF(AND(I10<>\"\",J10<Personalstamm!$E$20,I10>=Personalstamm!$D$20),Personalstamm!$E$20-J10,IF(AND(I10<>\"\",J10<Personalstamm!E$19,I10>=Personalstamm!$D$19),Personalstamm!$E$19-J10,0)))))","v":""},{"$f":"IF(I10<>\"\",I10-K10,\"\")","v":""},{"$f":"IF(AND(S10=\"Feiertag\",T10>0),\"Feiertag\",IF(C10=\"Fehlzeit\",\"Bitte auswählen\",\"\"))","v":""},{"$f":"IF(OR(M10=\"\",M10=\"Bitte auswählen\"),\"\",IF(M10=\"Feiertag\",T10*U10,IF(M10=\"Gleittag\",0,VLOOKUP(B10,Personalstamm!$D$8:$F$14,3,FALSE))))","v":""},{"$f":"VLOOKUP(B10,Personalstamm!$D$8:$E$14,2,FALSE)","v":{"v":8,"d":"8.00"}},{"$f":"IF(AND(OR(C10=\"Anwesenheit\",C10=\"Wochenende\"),L10<>\"\"),L10-O10,IF(AND(C10=\"Fehlzeit\",N10<>\"\",W10=\"Ja\"),N10-O10,IF(W10=\"Ja\",-O10,\"\")))","v":""},{"$f":"IF(P10=\"\",B7,B7+P10)","v":{"v":0,"d":"0.00"}},null,{"$f":"IF(COUNTIF(Allgemein!$H$8:$H$45,A10)>0,\"Feiertag\",\"\")","v":""},{"$f":"IFERROR(VLOOKUP(A10,Allgemein!$H$8:$I$45,2,FALSE),\"\")","v":""},{"$f":"VLOOKUP(B10,Personalstamm!$D$8:$F$14,3,FALSE)","v":{"v":8,"d":"8.00"}},{"$f":"IF(M10=\"Gleittag\",ABS(P10),\"\")","v":""},{"$f":"IF(A10<=TODAY(),\"Ja\",\"\")","v":""}]
["2026-09-02",{"$f":"TEXT(A11,\"tttt\")","v":"Mittwoch"},{"$f":"IF(AND(S11=\"Feiertag\",T11>0),\"Fehlzeit\",IF(OR(B11=\"Samstag\",B11=\"Sonntag\"),\"Wochenende\",\"Bitte auswählen\"))","v":"Bitte auswählen"},{"$nulls":5},{"$f":"IF(AND(OR(C11=\"Anwesenheit\",C11=\"Wochenende\"),E11<>\"\",F11<>\"\",W11=\"Ja\"),((F11-E11)+(H11-G11))*24,\"\")","v":""},{"$f":"IF(I11=\"\",\"\",IF(AND(G11<>\"\",H11<>\"\"),(G11-F11)*24,0))","v":""},{"$f":"IF(I11=\"\",\"\",IF(AND(I11<>\"\",J11=\"\",I11>=Personalstamm!$D$20),Personalstamm!$E$20,IF(AND(I11<>\"\",J11=\"\",I11>=Personalstamm!$D$19),Personalstamm!$E$19,IF(AND(I11<>\"\",J11<Personalstamm!$E$20,I11>=Personalstamm!$D$20),Personalstamm!$E$20-J11,IF(AND(I11<>\"\",J11<Personalstamm!E$19,I11>=Personalstamm!$D$19),Personalstamm!$E$19-J11,0)))))","v":""},{"$f":"IF(I11<>\"\",I11-K11,\"\")","v":""},{"$f":"IF(AND(S11=\"Feiertag\",T11>0),\"Feiertag\",IF(C11=\"Fehlzeit\",\"Bitte auswählen\",\"\"))","v":""},{"$f":"IF(OR(M11=\"\",M11=\"Bitte auswählen\"),\"\",IF(M11=\"Feiertag\",T11*U11,IF(M11=\"Gleittag\",0,VLOOKUP(B11,Personalstamm!$D$8:$F$14,3,FALSE))))","v":""},{"$f":"VLOOKUP(B11,Personalstamm!$D$8:$E$14,2,FALSE)","v":{"v":8,"d":"8.00"}},{"$f":"IF(AND(OR(C11=\"Anwesenheit\",C11=\"Wochenende\"),L11<>\"\"),L11-O11,IF(AND(C11=\"Fehlzeit\",N11<>\"\",W11=\"Ja\"),N11-O11,IF(W11=\"Ja\",-O11,\"\")))","v":""},{"$f":"IF(P11=\"\",Q10,Q10+P11)","v":{"v":0,"d":"0.00"}},null,{"$f":"IF(COUNTIF(Allgemein!$H$8:$H$45,A11)>0,\"Feiertag\",\"\")","v":""},{"$f":"IFERROR(VLOOKUP(A11,Allgemein!$H$8:$I$45,2,FALSE),\"\")","v":""},{"$f":"VLOOKUP(B11,Personalstamm!$D$8:$F$14,3,FALSE)","v":{"v":8,"d":"8.00"}},{"$f":"IF(M11=\"Gleittag\",ABS(P11),\"\")","v":""},{"$f":"IF(A11<=TODAY(),\"Ja\",\"\")","v":""}]
["2026-09-03","Donnerstag","Bitte auswählen",{"$nulls":5},"","",{"$f":"IF(I12=\"\",\"\",IF(AND(I12<>\"\",J12=\"\",I12>=Personalstamm!$D$20),Personalstamm!$E$20,IF(AND(I12<>\"\",J12=\"\",I12>=Personalstamm!$D$19),Personalstamm!$E$19,IF(AND(I12<>\"\",J12<Personalstamm!$E$20,I12>=Personalstamm!$D$20),Personalstamm!$E$20-J12,IF(AND(I12<>\"\",J12<Personalstamm!E$19,I12>=Personalstamm!$D$19),Personalstamm!$E$19-J12,0)))))","v":""},"","",{"$f":"IF(OR(M12=\"\",M12=\"Bitte auswählen\"),\"\",IF(M12=\"Feiertag\",T12*U12,IF(M12=\"Gleittag\",0,VLOOKUP(B12,Personalstamm!$D$8:$F$14,3,FALSE))))","v":""},{"$f":"VLOOKUP(B12,Personalstamm!$D$8:$E$14,2,FALSE)","v":{"v":8,"d":"8.00"}},"",{"$f":"IF(P12=\"\",Q11,Q11+P12)","v":{"v":0,"d":"0.00"}},null,{"$f":"IF(COUNTIF(Allgemein!$H$8:$H$45,A12)>0,\"Feiertag\",\"\")","v":""},{"$f":"IFERROR(VLOOKUP(A12,Allgemein!$H$8:$I$45,2,FALSE),\"\")","v":""},{"$f":"VLOOKUP(B12,Personalstamm!$D$8:$F$14,3,FALSE)","v":{"v":8,"d":"8.00"}},"",""]
["2026-09-04","Freitag","Bitte auswählen",{"$nulls":5},"","",{"$f":"IF(I13=\"\",\"\",IF(AND(I13<>\"\",J13=\"\",I13>=Personalstamm!$D$20),Personalstamm!$E$20,IF(AND(I13<>\"\",J13=\"\",I13>=Personalstamm!$D$19),Personalstamm!$E$19,IF(AND(I13<>\"\",J13<Personalstamm!$E$20,I13>=Personalstamm!$D$20),Personalstamm!$E$20-J13,IF(AND(I13<>\"\",J13<Personalstamm!E$19,I13>=Personalstamm!$D$19),Personalstamm!$E$19-J13,0)))))","v":""},"","",{"$f":"IF(OR(M13=\"\",M13=\"Bitte auswählen\"),\"\",IF(M13=\"Feiertag\",T13*U13,IF(M13=\"Gleittag\",0,VLOOKUP(B13,Personalstamm!$D$8:$F$14,3,FALSE))))","v":""},{"$f":"VLOOKUP(B13,Personalstamm!$D$8:$E$14,2,FALSE)","v":{"v":8,"d":"8.00"}},"",{"$f":"IF(P13=\"\",Q12,Q12+P13)","v":{"v":0,"d":"0.00"}},null,{"$f":"IF(COUNTIF(Allgemein!$H$8:$H$45,A13)>0,\"Feiertag\",\"\")","v":""},{"$f":"IFERROR(VLOOKUP(A13,Allgemein!$H$8:$I$45,2,FALSE),\"\")","v":""},{"$f":"VLOOKUP(B13,Personalstamm!$D$8:$F$14,3,FALSE)","v":{"v":8,"d":"8.00"}},"",""]
["2026-09-05","Samstag","Wochenende",{"$nulls":5},"","",{"$f":"IF(I14=\"\",\"\",IF(AND(I14<>\"\",J14=\"\",I14>=Personalstamm!$D$20),Personalstamm!$E$20,IF(AND(I14<>\"\",J14=\"\",I14>=Personalstamm!$D$19),Personalstamm!$E$19,IF(AND(I14<>\"\",J14<Personalstamm!$E$20,I14>=Personalstamm!$D$20),Personalstamm!$E$20-J14,IF(AND(I14<>\"\",J14<Personalstamm!E$19,I14>=Personalstamm!$D$19),Personalstamm!$E$19-J14,0)))))","v":""},"","",{"$f":"IF(OR(M14=\"\",M14=\"Bitte auswählen\"),\"\",IF(M14=\"Feiertag\",T14*U14,IF(M14=\"Gleittag\",0,VLOOKUP(B14,Personalstamm!$D$8:$F$14,3,FALSE))))","v":""},{"$f":"VLOOKUP(B14,Personalstamm!$D$8:$E$14,2,FALSE)","v":{"v":0,"d":"0.00"}},"",{"v":0,"d":"0.00"},null,{"$f":"IF(COUNTIF(Allgemein!$H$8:$H$45,A14)>0,\"Feiertag\",\"\")","v":""},{"$f":"IFERROR(VLOOKUP(A14,Allgemein!$H$8:$I$45,2,FALSE),\"\")","v":""},{"$f":"VLOOKUP(B14,Personalstamm!$D$8:$F$14,3,FALSE)","v":{"v":0,"d":"0.00"}},"",""]
["2026-09-06","Sonntag","Wochenende",{"$nulls":5},"","",{"$f":"IF(I15=\"\",\"\",IF(AND(I15<>\"\",J15=\"\",I15>=Personalstamm!$D$20),Personalstamm!$E$20,IF(AND(I15<>\"\",J15=\"\",I15>=Personalstamm!$D$19),Personalstamm!$E$19,IF(AND(I15<>\"\",J15<Personalstamm!$E$20,I15>=Personalstamm!$D$20),Personalstamm!$E$20-J15,IF(AND(I15<>\"\",J15<Personalstamm!E$19,I15>=Personalstamm!$D$19),Personalstamm!$E$19-J15,0)))))","v":""},"","",{"$f":"IF(OR(M15=\"\",M15=\"Bitte auswählen\"),\"\",IF(M15=\"Feiertag\",T15*U15,IF(M15=\"Gleittag\",0,VLOOKUP(B15,Personalstamm!$D$8:$F$14,3,FALSE))))","v":""},{"$f":"VLOOKUP(B15,Personalstamm!$D$8:$E$14,2,FALSE)","v":{"v":0,"d":"0.00"}},"",{"v":0,"d":"0.00"},null,{"$f":"IF(COUNTIF(Allgemein!$H$8:$H$45,A15)>0,\"Feiertag\",\"\")","v":""},{"$f":"IFERROR(VLOOKUP(A15,Allgemein!$H$8:$I$45,2,FALSE),\"\")","v":""},{"$f":"VLOOKUP(B15,Personalstamm!$D$8:$F$14,3,FALSE)","v":{"v":0,"d":"0.00"}},"",""]
["2026-09-07","Montag","Bitte auswählen",{"$nulls":5},"","",{"$f":"IF(I16=\"\",\"\",IF(AND(I16<>\"\",J16=\"\",I16>=Personalstamm!$D$20),Personalstamm!$E$20,IF(AND(I16<>\"\",J16=\"\",I16>=Personalstamm!$D$19),Personalstamm!$E$19,IF(AND(I16<>\"\",J16<Personalstamm!$E$20,I16>=Personalstamm!$D$20),Personalstamm!$E$20-J16,IF(AND(I16<>\"\",J16<Personalstamm!E$19,I16>=Personalstamm!$D$19),Personalstamm!$E$19-J16,0)))))","v":""},"","",{"$f":"IF(OR(M16=\"\",M16=\"Bitte auswählen\"),\"\",IF(M16=\"Feiertag\",T16*U16,IF(M16=\"Gleittag\",0,VLOOKUP(B16,Personalstamm!$D$8:$F$14,3,FALSE))))","v":""},{"$f":"VLOOKUP(B16,Personalstamm!$D$8:$E$14,2,FALSE)","v":{"v":8,"d":"8.00"}},"",{"v":0,"d":"0.00"},null,{"$f":"IF(COUNTIF(Allgemein!$H$8:$H$45,A16)>0,\"Feiertag\",\"\")","v":""},{"$f":"IFERROR(VLOOKUP(A16,Allgemein!$H$8:$I$45,2,FALSE),\"\")","v":""},{"$f":"VLOOKUP(B16,Personalstamm!$D$8:$F$14,3,FALSE)","v":{"v":8,"d":"8.00"}},"",""]
["2026-09-08","Dienstag","Bitte auswählen",{"$nulls":5},"","",{"$f":"IF(I17=\"\",\"\",IF(AND(I17<>\"\",J17=\"\",I17>=Personalstamm!$D$20),Personalstamm!$E$20,IF(AND(I17<>\"\",J17=\"\",I17>=Personalstamm!$D$19),Personalstamm!$E$19,IF(AND(I17<>\"\",J17<Personalstamm!$E$20,I17>=Personalstamm!$D$20),Personalstamm!$E$20-J17,IF(AND(I17<>\"\",J17<Personalstamm!E$19,I17>=Personalstamm!$D$19),Personalstamm!$E$19-J17,0)))))","v":""},"","",{"$f":"IF(OR(M17=\"\",M17=\"Bitte auswählen\"),\"\",IF(M17=\"Feiertag\",T17*U17,IF(M17=\"Gleittag\",0,VLOOKUP(B17,Personalstamm!$D$8:$F$14,3,FALSE))))","v":""},{"$f":"VLOOKUP(B17,Personalstamm!$D$8:$E$14,2,FALSE)","v":{"v":8,"d":"8.00"}},"",{"v":0,"d":"0.00"},null,{"$f":"IF(COUNTIF(Allgemein!$H$8:$H$45,A17)>0,\"Feiertag\",\"\")","v":""},{"$f":"IFERROR(VLOOKUP(A17,Allgemein!$H$8:$I$45,2,FALSE),\"\")","v":""},{"$f":"VLOOKUP(B17,Personalstamm!$D$8:$F$14,3,FALSE)","v":{"v":8,"d":"8.00"}},"",""]
["2026-09-09","Mittwoch","Bitte auswählen",{"$nulls":5},"","",{"$f":"IF(I18=\"\",\"\",IF(AND(I18<>\"\",J18=\"\",I18>=Personalstamm!$D$20),Personalstamm!$E$20,IF(AND(I18<>\"\",J18=\"\",I18>=Personalstamm!$D$19),Personalstamm!$E$19,IF(AND(I18<>\"\",J18<Personalstamm!$E$20,I18>=Personalstamm!$D$20),Personalstamm!$E$20-J18,IF(AND(I18<>\"\",J18<Personalstamm!E$19,I18>=Personalstamm!$D$19),Personalstamm!$E$19-J18,0)))))","v":""},"","",{"$f":"IF(OR(M18=\"\",M18=\"Bitte auswählen\"),\"\",IF(M18=\"Feiertag\",T18*U18,IF(M18=\"Gleittag\",0,VLOOKUP(B18,Personalstamm!$D$8:$F$14,3,FALSE))))","v":""},{"$f":"VLOOKUP(B18,Personalstamm!$D$8:$E$14,2,FALSE)","v":{"v":8,"d":"8.00"}},"",{"v":0,"d":"0.00"},null,{"$f":"IF(COUNTIF(Allgemein!$H$8:$H$45,A18)>0,\"Feiertag\",\"\")","v":""},{"$f":"IFERROR(VLOOKUP(A18,Allgemein!$H$8:$I$45,2,FALSE),\"\")","v":""},{"$f":"VLOOKUP(B18,Personalstamm!$D$8:$F$14,3,FALSE)","v":{"v":8,"d":"8.00"}},"",""]
["2026-09-10","Donnerstag","Bitte auswählen",{"$nulls":5},"","",{"$f":"IF(I19=\"\",\"\",IF(AND(I19<>\"\",J19=\"\",I19>=Personalstamm!$D$20),Personalstamm!$E$20,IF(AND(I19<>\"\",J19=\"\",I19>=Personalstamm!$D$19),Personalstamm!$E$19,IF(AND(I19<>\"\",J19<Personalstamm!$E$20,I19>=Personalstamm!$D$20),Personalstamm!$E$20-J19,IF(AND(I19<>\"\",J19<Personalstamm!E$19,I19>=Personalstamm!$D$19),Personalstamm!$E$19-J19,0)))))","v":""},"","",{"$f":"IF(OR(M19=\"\",M19=\"Bitte auswählen\"),\"\",IF(M19=\"Feiertag\",T19*U19,IF(M19=\"Gleittag\",0,VLOOKUP(B19,Personalstamm!$D$8:$F$14,3,FALSE))))","v":""},{"$f":"VLOOKUP(B19,Personalstamm!$D$8:$E$14,2,FALSE)","v":{"v":8,"d":"8.00"}},"",{"v":0,"d":"0.00"},null,{"$f":"IF(COUNTIF(Allgemein!$H$8:$H$45,A19)>0,\"Feiertag\",\"\")","v":""},{"$f":"IFERROR(VLOOKUP(A19,Allgemein!$H$8:$I$45,2,FALSE),\"\")","v":""},{"$f":"VLOOKUP(B19,Personalstamm!$D$8:$F$14,3,FALSE)","v":{"v":8,"d":"8.00"}},"",""]
["2026-09-11","Freitag","Bitte auswählen",{"$nulls":5},"","",{"$f":"IF(I20=\"\",\"\",IF(AND(I20<>\"\",J20=\"\",I20>=Personalstamm!$D$20),Personalstamm!$E$20,IF(AND(I20<>\"\",J20=\"\",I20>=Personalstamm!$D$19),Personalstamm!$E$19,IF(AND(I20<>\"\",J20<Personalstamm!$E$20,I20>=Personalstamm!$D$20),Personalstamm!$E$20-J20,IF(AND(I20<>\"\",J20<Personalstamm!E$19,I20>=Personalstamm!$D$19),Personalstamm!$E$19-J20,0)))))","v":""},"","",{"$f":"IF(OR(M20=\"\",M20=\"Bitte auswählen\"),\"\",IF(M20=\"Feiertag\",T20*U20,IF(M20=\"Gleittag\",0,VLOOKUP(B20,Personalstamm!$D$8:$F$14,3,FALSE))))","v":""},{"$f":"VLOOKUP(B20,Personalstamm!$D$8:$E$14,2,FALSE)","v":{"v":8,"d":"8.00"}},"",{"v":0,"d":"0.00"},null,{"$f":"IF(COUNTIF(Allgemein!$H$8:$H$45,A20)>0,\"Feiertag\",\"\")","v":""},{"$f":"IFERROR(VLOOKUP(A20,Allgemein!$H$8:$I$45,2,FALSE),\"\")","v":""},{"$f":"VLOOKUP(B20,Personalstamm!$D$8:$F$14,3,FALSE)","v":{"v":8,"d":"8.00"}},"",""]
["2026-09-12","Samstag","Wochenende",{"$nulls":5},"","",{"$f":"IF(I21=\"\",\"\",IF(AND(I21<>\"\",J21=\"\",I21>=Personalstamm!$D$20),Personalstamm!$E$20,IF(AND(I21<>\"\",J21=\"\",I21>=Personalstamm!$D$19),Personalstamm!$E$19,IF(AND(I21<>\"\",J21<Personalstamm!$E$20,I21>=Personalstamm!$D$20),Personalstamm!$E$20-J21,IF(AND(I21<>\"\",J21<Personalstamm!E$19,I21>=Personalstamm!$D$19),Personalstamm!$E$19-J21,0)))))","v":""},"","",{"$f":"IF(OR(M21=\"\",M21=\"Bitte auswählen\"),\"\",IF(M21=\"Feiertag\",T21*U21,IF(M21=\"Gleittag\",0,VLOOKUP(B21,Personalstamm!$D$8:$F$14,3,FALSE))))","v":""},{"$f":"VLOOKUP(B21,Personalstamm!$D$8:$E$14,2,FALSE)","v":{"v":0,"d":"0.00"}},"",{"v":0,"d":"0.00"},null,{"$f":"IF(COUNTIF(Allgemein!$H$8:$H$45,A21)>0,\"Feiertag\",\"\")","v":""},{"$f":"IFERROR(VLOOKUP(A21,Allgemein!$H$8:$I$45,2,FALSE),\"\")","v":""},{"$f":"VLOOKUP(B21,Personalstamm!$D$8:$F$14,3,FALSE)","v":{"v":0,"d":"0.00"}},"",""]
["2026-09-13","Sonntag","Wochenende",{"$nulls":5},"","",{"$f":"IF(I22=\"\",\"\",IF(AND(I22<>\"\",J22=\"\",I22>=Personalstamm!$D$20),Personalstamm!$E$20,IF(AND(I22<>\"\",J22=\"\",I22>=Personalstamm!$D$19),Personalstamm!$E$19,IF(AND(I22<>\"\",J22<Personalstamm!$E$20,I22>=Personalstamm!$D$20),Personalstamm!$E$20-J22,IF(AND(I22<>\"\",J22<Personalstamm!E$19,I22>=Personalstamm!$D$19),Personalstamm!$E$19-J22,0)))))","v":""},"","",{"$f":"IF(OR(M22=\"\",M22=\"Bitte auswählen\"),\"\",IF(M22=\"Feiertag\",T22*U22,IF(M22=\"Gleittag\",0,VLOOKUP(B22,Personalstamm!$D$8:$F$14,3,FALSE))))","v":""},{"$f":"VLOOKUP(B22,Personalstamm!$D$8:$E$14,2,FALSE)","v":{"v":0,"d":"0.00"}},"",{"v":0,"d":"0.00"},null,{"$f":"IF(COUNTIF(Allgemein!$H$8:$H$45,A22)>0,\"Feiertag\",\"\")","v":""},{"$f":"IFERROR(VLOOKUP(A22,Allgemein!$H$8:$I$45,2,FALSE),\"\")","v":""},{"$f":"VLOOKUP(B22,Personalstamm!$D$8:$F$14,3,FALSE)","v":{"v":0,"d":"0.00"}},"",""]
["2026-09-14","Montag","Bitte auswählen",{"$nulls":5},"","",{"$f":"IF(I23=\"\",\"\",IF(AND(I23<>\"\",J23=\"\",I23>=Personalstamm!$D$20),Personalstamm!$E$20,IF(AND(I23<>\"\",J23=\"\",I23>=Personalstamm!$D$19),Personalstamm!$E$19,IF(AND(I23<>\"\",J23<Personalstamm!$E$20,I23>=Personalstamm!$D$20),Personalstamm!$E$20-J23,IF(AND(I23<>\"\",J23<Personalstamm!E$19,I23>=Personalstamm!$D$19),Personalstamm!$E$19-J23,0)))))","v":""},"","",{"$f":"IF(OR(M23=\"\",M23=\"Bitte auswählen\"),\"\",IF(M23=\"Feiertag\",T23*U23,IF(M23=\"Gleittag\",0,VLOOKUP(B23,Personalstamm!$D$8:$F$14,3,FALSE))))","v":""},{"$f":"VLOOKUP(B23,Personalstamm!$D$8:$E$14,2,FALSE)","v":{"v":8,"d":"8.00"}},"",{"v":0,"d":"0.00"},null,{"$f":"IF(COUNTIF(Allgemein!$H$8:$H$45,A23)>0,\"Feiertag\",\"\")","v":""},{"$f":"IFERROR(VLOOKUP(A23,Allgemein!$H$8:$I$45,2,FALSE),\"\")","v":""},{"$f":"VLOOKUP(B23,Personalstamm!$D$8:$F$14,3,FALSE)","v":{"v":8,"d":"8.00"}},"",""]
["2026-09-15","Dienstag","Bitte auswählen",{"$nulls":5},"","",{"$f":"IF(I24=\"\",\"\",IF(AND(I24<>\"\",J24=\"\",I24>=Personalstamm!$D$20),Personalstamm!$E$20,IF(AND(I24<>\"\",J24=\"\",I24>=Personalstamm!$D$19),Personalstamm!$E$19,IF(AND(I24<>\"\",J24<Personalstamm!$E$20,I24>=Personalstamm!$D$20),Personalstamm!$E$20-J24,IF(AND(I24<>\"\",J24<Personalstamm!E$19,I24>=Personalstamm!$D$19),Personalstamm!$E$19-J24,0)))))","v":""},"","",{"$f":"IF(OR(M24=\"\",M24=\"Bitte auswählen\"),\"\",IF(M24=\"Feiertag\",T24*U24,IF(M24=\"Gleittag\",0,VLOOKUP(B24,Personalstamm!$D$8:$F$14,3,FALSE))))","v":""},{"$f":"VLOOKUP(B24,Personalstamm!$D$8:$E$14,2,FALSE)","v":{"v":8,"d":"8.00"}},"",{"v":0,"d":"0.00"},null,{"$f":"IF(COUNTIF(Allgemein!$H$8:$H$45,A24)>0,\"Feiertag\",\"\")","v":""},{"$f":"IFERROR(VLOOKUP(A24,Allgemein!$H$8:$I$45,2,FALSE),\"\")","v":""},{"$f":"VLOOKUP(B24,Personalstamm!$D$8:$F$14,3,FALSE)","v":{"v":8,"d":"8.00"}},"",""]
["2026-09-16","Mittwoch","Bitte auswählen",{"$nulls":5},"","",{"$f":"IF(I25=\"\",\"\",IF(AND(I25<>\"\",J25=\"\",I25>=Personalstamm!$D$20),Personalstamm!$E$20,IF(AND(I25<>\"\",J25=\"\",I25>=Personalstamm!$D$19),Personalstamm!$E$19,IF(AND(I25<>\"\",J25<Personalstamm!$E$20,I25>=Personalstamm!$D$20),Personalstamm!$E$20-J25,IF(AND(I25<>\"\",J25<Personalstamm!E$19,I25>=Personalstamm!$D$19),Personalstamm!$E$19-J25,0)))))","v":""},"","",{"$f":"IF(OR(M25=\"\",M25=\"Bitte auswählen\"),\"\",IF(M25=\"Feiertag\",T25*U25,IF(M25=\"Gleittag\",0,VLOOKUP(B25,Personalstamm!$D$8:$F$14,3,FALSE))))","v":""},{"$f":"VLOOKUP(B25,Personalstamm!$D$8:$E$14,2,FALSE)","v":{"v":8,"d":"8.00"}},"",{"v":0,"d":"0.00"},null,{"$f":"IF(COUNTIF(Allgemein!$H$8:$H$45,A25)>0,\"Feiertag\",\"\")","v":""},{"$f":"IFERROR(VLOOKUP(A25,Allgemein!$H$8:$I$45,2,FALSE),\"\")","v":""},{"$f":"VLOOKUP(B25,Personalstamm!$D$8:$F$14,3,FALSE)","v":{"v":8,"d":"8.00"}},"",""]
["2026-09-17","Donnerstag","Bitte auswählen",{"$nulls":5},"","",{"$f":"IF(I26=\"\",\"\",IF(AND(I26<>\"\",J26=\"\",I26>=Personalstamm!$D$20),Personalstamm!$E$20,IF(AND(I26<>\"\",J26=\"\",I26>=Personalstamm!$D$19),Personalstamm!$E$19,IF(AND(I26<>\"\",J26<Personalstamm!$E$20,I26>=Personalstamm!$D$20),Personalstamm!$E$20-J26,IF(AND(I26<>\"\",J26<Personalstamm!E$19,I26>=Personalstamm!$D$19),Personalstamm!$E$19-J26,0)))))","v":""},"","",{"$f":"IF(OR(M26=\"\",M26=\"Bitte auswählen\"),\"\",IF(M26=\"Feiertag\",T26*U26,IF(M26=\"Gleittag\",0,VLOOKUP(B26,Personalstamm!$D$8:$F$14,3,FALSE))))","v":""},{"$f":"VLOOKUP(B26,Personalstamm!$D$8:$E$14,2,FALSE)","v":{"v":8,"d":"8.00"}},"",{"v":0,"d":"0.00"},null,{"$f":"IF(COUNTIF(Allgemein!$H$8:$H$45,A26)>0,\"Feiertag\",\"\")","v":""},{"$f":"IFERROR(VLOOKUP(A26,Allgemein!$H$8:$I$45,2,FALSE),\"\")","v":""},{"$f":"VLOOKUP(B26,Personalstamm!$D$8:$F$14,3,FALSE)","v":{"v":8,"d":"8.00"}},"",""]
["2026-09-18","Freitag","Bitte auswählen",{"$nulls":5},"","",{"$f":"IF(I27=\"\",\"\",IF(AND(I27<>\"\",J27=\"\",I27>=Personalstamm!$D$20),Personalstamm!$E$20,IF(AND(I27<>\"\",J27=\"\",I27>=Personalstamm!$D$19),Personalstamm!$E$19,IF(AND(I27<>\"\",J27<Personalstamm!$E$20,I27>=Personalstamm!$D$20),Personalstamm!$E$20-J27,IF(AND(I27<>\"\",J27<Personalstamm!E$19,I27>=Personalstamm!$D$19),Personalstamm!$E$19-J27,0)))))","v":""},"","",{"$f":"IF(OR(M27=\"\",M27=\"Bitte auswählen\"),\"\",IF(M27=\"Feiertag\",T27*U27,IF(M27=\"Gleittag\",0,VLOOKUP(B27,Personalstamm!$D$8:$F$14,3,FALSE))))","v":""},{"$f":"VLOOKUP(B27,Personalstamm!$D$8:$E$14,2,FALSE)","v":{"v":8,"d":"8.00"}},"",{"v":0,"d":"0.00"},null,{"$f":"IF(COUNTIF(Allgemein!$H$8:$H$45,A27)>0,\"Feiertag\",\"\")","v":""},{"$f":"IFERROR(VLOOKUP(A27,Allgemein!$H$8:$I$45,2,FALSE),\"\")","v":""},{"$f":"VLOOKUP(B27,Personalstamm!$D$8:$F$14,3,FALSE)","v":{"v":8,"d":"8.00"}},"",""]
["2026-09-19","Samstag","Wochenende",{"$nulls":5},"","",{"$f":"IF(I28=\"\",\"\",IF(AND(I28<>\"\",J28=\"\",I28>=Personalstamm!$D$20),Personalstamm!$E$20,IF(AND(I28<>\"\",J28=\"\",I28>=Personalstamm!$D$19),Personalstamm!$E$19,IF(AND(I28<>\"\",J28<Personalstamm!$E$20,I28>=Personalstamm!$D$20),Personalstamm!$E$20-J28,IF(AND(I28<>\"\",J28<Personalstamm!E$19,I28>=Personalstamm!$D$19),Personalstamm!$E$19-J28,0)))))","v":""},"","",{"$f":"IF(OR(M28=\"\",M28=\"Bitte auswählen\"),\"\",IF(M28=\"Feiertag\",T28*U28,IF(M28=\"Gleittag\",0,VLOOKUP(B28,Personalstamm!$D$8:$F$14,3,FALSE))))","v":""},{"$f":"VLOOKUP(B28,Personalstamm!$D$8:$E$14,2,FALSE)","v":{"v":0,"d":"0.00"}},"",{"v":0,"d":"0.00"},null,{"$f":"IF(COUNTIF(Allgemein!$H$8:$H$45,A28)>0,\"Feiertag\",\"\")","v":""},{"$f":"IFERROR(VLOOKUP(A28,Allgemein!$H$8:$I$45,2,FALSE),\"\")","v":""},{"$f":"VLOOKUP(B28,Personalstamm!$D$8:$F$14,3,FALSE)","v":{"v":0,"d":"0.00"}},"",""]
["2026-09-20","Sonntag","Wochenende",{"$nulls":5},"","",{"$f":"IF(I29=\"\",\"\",IF(AND(I29<>\"\",J29=\"\",I29>=Personalstamm!$D$20),Personalstamm!$E$20,IF(AND(I29<>\"\",J29=\"\",I29>=Personalstamm!$D$19),Personalstamm!$E$19,IF(AND(I29<>\"\",J29<Personalstamm!$E$20,I29>=Personalstamm!$D$20),Personalstamm!$E$20-J29,IF(AND(I29<>\"\",J29<Personalstamm!E$19,I29>=Personalstamm!$D$19),Personalstamm!$E$19-J29,0)))))","v":""},"","",{"$f":"IF(OR(M29=\"\",M29=\"Bitte auswählen\"),\"\",IF(M29=\"Feiertag\",T29*U29,IF(M29=\"Gleittag\",0,VLOOKUP(B29,Personalstamm!$D$8:$F$14,3,FALSE))))","v":""},{"$f":"VLOOKUP(B29,Personalstamm!$D$8:$E$14,2,FALSE)","v":{"v":0,"d":"0.00"}},"",{"v":0,"d":"0.00"},null,{"$f":"IF(COUNTIF(Allgemein!$H$8:$H$45,A29)>0,\"Feiertag\",\"\")","v":"Feiertag"},{"$f":"IFERROR(VLOOKUP(A29,Allgemein!$H$8:$I$45,2,FALSE),\"\")","v":{"v":0,"d":"0.00"}},{"$f":"VLOOKUP(B29,Personalstamm!$D$8:$F$14,3,FALSE)","v":{"v":0,"d":"0.00"}},"",""]
["2026-09-21","Montag","Bitte auswählen",{"$nulls":5},"","",{"$f":"IF(I30=\"\",\"\",IF(AND(I30<>\"\",J30=\"\",I30>=Personalstamm!$D$20),Personalstamm!$E$20,IF(AND(I30<>\"\",J30=\"\",I30>=Personalstamm!$D$19),Personalstamm!$E$19,IF(AND(I30<>\"\",J30<Personalstamm!$E$20,I30>=Personalstamm!$D$20),Personalstamm!$E$20-J30,IF(AND(I30<>\"\",J30<Personalstamm!E$19,I30>=Personalstamm!$D$19),Personalstamm!$E$19-J30,0)))))","v":""},"","",{"$f":"IF(OR(M30=\"\",M30=\"Bitte auswählen\"),\"\",IF(M30=\"Feiertag\",T30*U30,IF(M30=\"Gleittag\",0,VLOOKUP(B30,Personalstamm!$D$8:$F$14,3,FALSE))))","v":""},{"$f":"VLOOKUP(B30,Personalstamm!$D$8:$E$14,2,FALSE)","v":{"v":8,"d":"8.00"}},"",{"v":0,"d":"0.00"},null,{"$f":"IF(COUNTIF(Allgemein!$H$8:$H$45,A30)>0,\"Feiertag\",\"\")","v":""},{"$f":"IFERROR(VLOOKUP(A30,Allgemein!$H$8:$I$45,2,FALSE),\"\")","v":""},{"$f":"VLOOKUP(B30,Personalstamm!$D$8:$F$14,3,FALSE)","v":{"v":8,"d":"8.00"}},"",""]
["2026-09-22","Dienstag","Bitte auswählen",{"$nulls":5},"","",{"$f":"IF(I31=\"\",\"\",IF(AND(I31<>\"\",J31=\"\",I31>=Personalstamm!$D$20),Personalstamm!$E$20,IF(AND(I31<>\"\",J31=\"\",I31>=Personalstamm!$D$19),Personalstamm!$E$19,IF(AND(I31<>\"\",J31<Personalstamm!$E$20,I31>=Personalstamm!$D$20),Personalstamm!$E$20-J31,IF(AND(I31<>\"\",J31<Personalstamm!E$19,I31>=Personalstamm!$D$19),Personalstamm!$E$19-J31,0)))))","v":""},"","",{"$f":"IF(OR(M31=\"\",M31=\"Bitte auswählen\"),\"\",IF(M31=\"Feiertag\",T31*U31,IF(M31=\"Gleittag\",0,VLOOKUP(B31,Personalstamm!$D$8:$F$14,3,FALSE))))","v":""},{"$f":"VLOOKUP(B31,Personalstamm!$D$8:$E$14,2,FALSE)","v":{"v":8,"d":"8.00"}},"",{"v":0,"d":"0.00"},null,{"$f":"IF(COUNTIF(Allgemein!$H$8:$H$45,A31)>0,\"Feiertag\",\"\")","v":""},{"$f":"IFERROR(VLOOKUP(A31,Allgemein!$H$8:$I$45,2,FALSE),\"\")","v":""},{"$f":"VLOOKUP(B31,Personalstamm!$D$8:$F$14,3,FALSE)","v":{"v":8,"d":"8.00"}},"",""]
["2026-09-23","Mittwoch","Bitte auswählen",{"$nulls":5},"","",{"$f":"IF(I32=\"\",\"\",IF(AND(I32<>\"\",J32=\"\",I32>=Personalstamm!$D$20),Personalstamm!$E$20,IF(AND(I32<>\"\",J32=\"\",I32>=Personalstamm!$D$19),Personalstamm!$E$19,IF(AND(I32<>\"\",J32<Personalstamm!$E$20,I32>=Personalstamm!$D$20),Personalstamm!$E$20-J32,IF(AND(I32<>\"\",J32<Personalstamm!E$19,I32>=Personalstamm!$D$19),Personalstamm!$E$19-J32,0)))))","v":""},"","",{"$f":"IF(OR(M32=\"\",M32=\"Bitte auswählen\"),\"\",IF(M32=\"Feiertag\",T32*U32,IF(M32=\"Gleittag\",0,VLOOKUP(B32,Personalstamm!$D$8:$F$14,3,FALSE))))","v":""},{"$f":"VLOOKUP(B32,Personalstamm!$D$8:$E$14,2,FALSE)","v":{"v":8,"d":"8.00"}},"",{"v":0,"d":"0.00"},null,{"$f":"IF(COUNTIF(Allgemein!$H$8:$H$45,A32)>0,\"Feiertag\",\"\")","v":""},{"$f":"IFERROR(VLOOKUP(A32,Allgemein!$H$8:$I$45,2,FALSE),\"\")","v":""},{"$f":"VLOOKUP(B32,Personalstamm!$D$8:$F$14,3,FALSE)","v":{"v":8,"d":"8.00"}},"",""]
["2026-09-24","Donnerstag","Bitte auswählen",{"$nulls":5},"","",{"$f":"IF(I33=\"\",\"\",IF(AND(I33<>\"\",J33=\"\",I33>=Personalstamm!$D$20),Personalstamm!$E$20,IF(AND(I33<>\"\",J33=\"\",I33>=Personalstamm!$D$19),Personalstamm!$E$19,IF(AND(I33<>\"\",J33<Personalstamm!$E$20,I33>=Personalstamm!$D$20),Personalstamm!$E$20-J33,IF(AND(I33<>\"\",J33<Personalstamm!E$19,I33>=Personalstamm!$D$19),Personalstamm!$E$19-J33,0)))))","v":""},"","",{"$f":"IF(OR(M33=\"\",M33=\"Bitte auswählen\"),\"\",IF(M33=\"Feiertag\",T33*U33,IF(M33=\"Gleittag\",0,VLOOKUP(B33,Personalstamm!$D$8:$F$14,3,FALSE))))","v":""},{"$f":"VLOOKUP(B33,Personalstamm!$D$8:$E$14,2,FALSE)","v":{"v":8,"d":"8.00"}},"",{"v":0,"d":"0.00"},null,{"$f":"IF(COUNTIF(Allgemein!$H$8:$H$45,A33)>0,\"Feiertag\",\"\")","v":""},{"$f":"IFERROR(VLOOKUP(A33,Allgemein!$H$8:$I$45,2,FALSE),\"\")","v":""},{"$f":"VLOOKUP(B33,Personalstamm!$D$8:$F$14,3,FALSE)","v":{"v":8,"d":"8.00"}},"",""]
["2026-09-25","Freitag","Bitte auswählen",{"$nulls":5},"","",{"$f":"IF(I34=\"\",\"\",IF(AND(I34<>\"\",J34=\"\",I34>=Personalstamm!$D$20),Personalstamm!$E$20,IF(AND(I34<>\"\",J34=\"\",I34>=Personalstamm!$D$19),Personalstamm!$E$19,IF(AND(I34<>\"\",J34<Personalstamm!$E$20,I34>=Personalstamm!$D$20),Personalstamm!$E$20-J34,IF(AND(I34<>\"\",J34<Personalstamm!E$19,I34>=Personalstamm!$D$19),Personalstamm!$E$19-J34,0)))))","v":""},"","",{"$f":"IF(OR(M34=\"\",M34=\"Bitte auswählen\"),\"\",IF(M34=\"Feiertag\",T34*U34,IF(M34=\"Gleittag\",0,VLOOKUP(B34,Personalstamm!$D$8:$F$14,3,FALSE))))","v":""},{"$f":"VLOOKUP(B34,Personalstamm!$D$8:$E$14,2,FALSE)","v":{"v":8,"d":"8.00"}},"",{"v":0,"d":"0.00"},null,{"$f":"IF(COUNTIF(Allgemein!$H$8:$H$45,A34)>0,\"Feiertag\",\"\")","v":""},{"$f":"IFERROR(VLOOKUP(A34,Allgemein!$H$8:$I$45,2,FALSE),\"\")","v":""},{"$f":"VLOOKUP(B34,Personalstamm!$D$8:$F$14,3,FALSE)","v":{"v":8,"d":"8.00"}},"",""]
["2026-09-26","Samstag","Wochenende",{"$nulls":5},"","",{"$f":"IF(I35=\"\",\"\",IF(AND(I35<>\"\",J35=\"\",I35>=Personalstamm!$D$20),Personalstamm!$E$20,IF(AND(I35<>\"\",J35=\"\",I35>=Personalstamm!$D$19),Personalstamm!$E$19,IF(AND(I35<>\"\",J35<Personalstamm!$E$20,I35>=Personalstamm!$D$20),Personalstamm!$E$20-J35,IF(AND(I35<>\"\",J35<Personalstamm!E$19,I35>=Personalstamm!$D$19),Personalstamm!$E$19-J35,0)))))","v":""},"","",{"$f":"IF(OR(M35=\"\",M35=\"Bitte auswählen\"),\"\",IF(M35=\"Feiertag\",T35*U35,IF(M35=\"Gleittag\",0,VLOOKUP(B35,Personalstamm!$D$8:$F$14,3,FALSE))))","v":""},{"$f":"VLOOKUP(B35,Personalstamm!$D$8:$E$14,2,FALSE)","v":{"v":0,"d":"0.00"}},"",{"v":0,"d":"0.00"},null,{"$f":"IF(COUNTIF(Allgemein!$H$8:$H$45,A35)>0,\"Feiertag\",\"\")","v":""},{"$f":"IFERROR(VLOOKUP(A35,Allgemein!$H$8:$I$45,2,FALSE),\"\")","v":""},{"$f":"VLOOKUP(B35,Personalstamm!$D$8:$F$14,3,FALSE)","v":{"v":0,"d":"0.00"}},"",""]
["2026-09-27","Sonntag","Wochenende",{"$nulls":5},"","",{"$f":"IF(I36=\"\",\"\",IF(AND(I36<>\"\",J36=\"\",I36>=Personalstamm!$D$20),Personalstamm!$E$20,IF(AND(I36<>\"\",J36=\"\",I36>=Personalstamm!$D$19),Personalstamm!$E$19,IF(AND(I36<>\"\",J36<Personalstamm!$E$20,I36>=Personalstamm!$D$20),Personalstamm!$E$20-J36,IF(AND(I36<>\"\",J36<Personalstamm!E$19,I36>=Personalstamm!$D$19),Personalstamm!$E$19-J36,0)))))","v":""},"","",{"$f":"IF(OR(M36=\"\",M36=\"Bitte auswählen\"),\"\",IF(M36=\"Feiertag\",T36*U36,IF(M36=\"Gleittag\",0,VLOOKUP(B36,Personalstamm!$D$8:$F$14,3,FALSE))))","v":""},{"$f":"VLOOKUP(B36,Personalstamm!$D$8:$E$14,2,FALSE)","v":{"v":0,"d":"0.00"}},"",{"v":0,"d":"0.00"},null,{"$f":"IF(COUNTIF(Allgemein!$H$8:$H$45,A36)>0,\"Feiertag\",\"\")","v":""},{"$f":"IFERROR(VLOOKUP(A36,Allgemein!$H$8:$I$45,2,FALSE),\"\")","v":""},{"$f":"VLOOKUP(B36,Personalstamm!$D$8:$F$14,3,FALSE)","v":{"v":0,"d":"0.00"}},"",""]
["2026-09-28","Montag","Bitte auswählen",{"$nulls":5},"","",{"$f":"IF(I37=\"\",\"\",IF(AND(I37<>\"\",J37=\"\",I37>=Personalstamm!$D$20),Personalstamm!$E$20,IF(AND(I37<>\"\",J37=\"\",I37>=Personalstamm!$D$19),Personalstamm!$E$19,IF(AND(I37<>\"\",J37<Personalstamm!$E$20,I37>=Personalstamm!$D$20),Personalstamm!$E$20-J37,IF(AND(I37<>\"\",J37<Personalstamm!E$19,I37>=Personalstamm!$D$19),Personalstamm!$E$19-J37,0)))))","v":""},"","",{"$f":"IF(OR(M37=\"\",M37=\"Bitte auswählen\"),\"\",IF(M37=\"Feiertag\",T37*U37,IF(M37=\"Gleittag\",0,VLOOKUP(B37,Personalstamm!$D$8:$F$14,3,FALSE))))","v":""},{"$f":"VLOOKUP(B37,Personalstamm!$D$8:$E$14,2,FALSE)","v":{"v":8,"d":"8.00"}},"",{"v":0,"d":"0.00"},null,{"$f":"IF(COUNTIF(Allgemein!$H$8:$H$45,A37)>0,\"Feiertag\",\"\")","v":""},{"$f":"IFERROR(VLOOKUP(A37,Allgemein!$H$8:$I$45,2,FALSE),\"\")","v":""},{"$f":"VLOOKUP(B37,Personalstamm!$D$8:$F$14,3,FALSE)","v":{"v":8,"d":"8.00"}},"",""]
["2026-09-29","Dienstag","Bitte auswählen",{"$nulls":5},"","",{"$f":"IF(I38=\"\",\"\",IF(AND(I38<>\"\",J38=\"\",I38>=Personalstamm!$D$20),Personalstamm!$E$20,IF(AND(I38<>\"\",J38=\"\",I38>=Personalstamm!$D$19),Personalstamm!$E$19,IF(AND(I38<>\"\",J38<Personalstamm!$E$20,I38>=Personalstamm!$D$20),Personalstamm!$E$20-J38,IF(AND(I38<>\"\",J38<Personalstamm!E$19,I38>=Personalstamm!$D$19),Personalstamm!$E$19-J38,0)))))","v":""},"","",{"$f":"IF(OR(M38=\"\",M38=\"Bitte auswählen\"),\"\",IF(M38=\"Feiertag\",T38*U38,IF(M38=\"Gleittag\",0,VLOOKUP(B38,Personalstamm!$D$8:$F$14,3,FALSE))))","v":""},{"$f":"VLOOKUP(B38,Personalstamm!$D$8:$E$14,2,FALSE)","v":{"v":8,"d":"8.00"}},"",{"v":0,"d":"0.00"},null,{"$f":"IF(COUNTIF(Allgemein!$H$8:$H$45,A38)>0,\"Feiertag\",\"\")","v":""},{"$f":"IFERROR(VLOOKUP(A38,Allgemein!$H$8:$I$45,2,FALSE),\"\")","v":""},{"$f":"VLOOKUP(B38,Personalstamm!$D$8:$F$14,3,FALSE)","v":{"v":8,"d":"8.00"}},"",""]
["2026-09-30","Mittwoch","Bitte auswählen",{"$nulls":5},"","",{"$f":"IF(I39=\"\",\"\",IF(AND(I39<>\"\",J39=\"\",I39>=Personalstamm!$D$20),Personalstamm!$E$20,IF(AND(I39<>\"\",J39=\"\",I39>=Personalstamm!$D$19),Personalstamm!$E$19,IF(AND(I39<>\"\",J39<Personalstamm!$E$20,I39>=Personalstamm!$D$20),Personalstamm!$E$20-J39,IF(AND(I39<>\"\",J39<Personalstamm!E$19,I39>=Personalstamm!$D$19),Personalstamm!$E$19-J39,0)))))","v":""},"","",{"$f":"IF(OR(M39=\"\",M39=\"Bitte auswählen\"),\"\",IF(M39=\"Feiertag\",T39*U39,IF(M39=\"Gleittag\",0,VLOOKUP(B39,Personalstamm!$D$8:$F$14,3,FALSE))))","v":""},{"$f":"VLOOKUP(B39,Personalstamm!$D$8:$E$14,2,FALSE)","v":{"v":8,"d":"8.00"}},"",{"v":0,"d":"0.00"},null,{"$f":"IF(COUNTIF(Allgemein!$H$8:$H$45,A39)>0,\"Feiertag\",\"\")","v":""},{"$f":"IFERROR(VLOOKUP(A39,Allgemein!$H$8:$I$45,2,FALSE),\"\")","v":""},{"$f":"VLOOKUP(B39,Personalstamm!$D$8:$F$14,3,FALSE)","v":{"v":8,"d":"8.00"}},"",""]
["Summe",{"$nulls":7},{"$f":"SUM(I10:I39)","v":{"v":0,"d":"0.00"}},{"$f":"SUM(J10:J39)","v":{"v":0,"d":"0.00"}},{"$f":"SUM(K10:K39)","v":{"v":0,"d":"0.00"}},{"$f":"SUM(L10:L39)","v":{"v":0,"d":"0.00"}},null,{"$f":"SUM(N10:N39)","v":{"v":0,"d":"0.00"}},{"$f":"SUM(O10:O39)","v":{"v":176,"d":"176.00"}},{"$f":"SUM(P10:P39)","v":{"v":0,"d":"0.00"}}]
[]
["Art","Anzahl Tage",null,"Fehlzeitenart","Anzahl Tage","Anzahl Stunden",null,"Urlaub genommen","Urlaub geplant"]
["Monat",{"$f":"COUNTIF($C$10:$C$39,\"*\")","v":{"v":30,"d":"30.00"}},null,"Urlaub",{"$f":"COUNTIF($M$10:$M$39,Allgemein!$I$50)","v":{"v":0,"d":"0.00"}},{"$f":"SUMIF($M$10:$M$39,Allgemein!$I$50,$N$10:$N$39)","v":{"v":0,"d":"0.00"}},null,{"$f":"COUNTIFS($A$10:$A$39,\"<\"&TODAY(),$M$10:$M$39,\"Urlaub\")","v":{"v":0,"d":"0.00"}},{"$f":"COUNTIFS($A$10:$A$39,\">=\"&TODAY(),$M$10:$M$39,\"Urlaub\")","v":{"v":0,"d":"0.00"}}]
["Anwesenheit",{"$f":"COUNTIF($C$10:$C$39,Allgemein!$G$50)","v":{"v":0,"d":"0.00"}},null,"Krankheit",{"$f":"COUNTIF($M$10:$M$39,Allgemein!$I$51)","v":{"v":0,"d":"0.00"}},{"$f":"SUMIF($M$10:$M$39,Allgemein!$I$51,$N$10:$N$39)","v":{"v":0,"d":"0.00"}}]
["Fehlzeit",{"$f":"COUNTIF($C$10:$C$39,Allgemein!$G$51)","v":{"v":0,"d":"0.00"}},null,"Kurzarbeit",{"$f":"COUNTIF($M$10:$M$39,Allgemein!$I$52)","v":{"v":0,"d":"0.00"}},{"$f":"SUMIF($M$10:$M$39,Allgemein!$I$52,$N$10:$N$39)","v":{"v":0,"d":"0.00"}}]
["Wochenende",{"$f":"COUNTIF($C$10:$C$39,Allgemein!$G$52)","v":{"v":8,"d":"8.00"}},null,"Mutterschutz",{"$f":"COUNTIF($M$10:$M$39,Allgemein!$I$53)","v":{"v":0,"d":"0.00"}},{"$f":"SUMIF($M$10:$M$39,Allgemein!$I$53,$N$10:$N$39)","v":{"v":0,"d":"0.00"}}]
["Undefiniert",{"$f":"COUNTIF($C$10:$C$39,Allgemein!$G$49)","v":{"v":22,"d":"22.00"}},null,"Fortbildung",{"$f":"COUNTIF($M$10:$M$39,Allgemein!$I$54)","v":{"v":0,"d":"0.00"}},{"$f":"SUMIF($M$10:$M$39,Allgemein!$I$54,$N$10:$N$39)","v":{"v":0,"d":"0.00"}}]
[{"$nulls":3},"Elternzeit",{"$f":"COUNTIF($M$10:$M$39,Allgemein!$I$55)","v":{"v":0,"d":"0.00"}},{"$f":"SUMIF($M$10:$M$39,Allgemein!$I$55,$N$10:$N$39)","v":{"v":0,"d":"0.00"}}]
[{"$nulls":3},"Gleittag",{"$f":"COUNTIF($M$10:$M$39,Allgemein!$I$56)","v":{"v":0,"d":"0.00"}},{"$f":"SUMIF($M$10:$M$39,Allgemein!$I$56,$V$10:$V$39)","v":{"v":0,"d":"0.00"}}]
[{"$nulls":3},"Schule",{"$f":"COUNTIF($M$10:$M$39,Allgemein!$I$57)","v":{"v":0,"d":"0.00"}},{"$f":"SUMIF($M$10:$M$39,Allgemein!$I$57,$N$10:$N$39)","v":{"v":0,"d":"0.00"}}]
[{"$nulls":3},"Feiertag",{"$f":"COUNTIF($M$10:$M$39,Allgemein!$I$58)","v":{"v":0,"d":"0.00"}},{"$f":"SUMIF($M$10:$M$39,Allgemein!$I$58,$N$10:$N$39)","v":{"v":0,"d":"0.00"}}]
[{"$nulls":3},"Undefiniert",{"$f":"COUNTIF($M$10:$M$39,Allgemein!$I$49)","v":{"v":0,"d":"0.00"}},{"$f":"SUMIF($M$10:$M$39,Allgemein!$I$49,$N$10:$N$39)","v":{"v":0,"d":"0.00"}}]

{"sheet":"Okt.","index":14,"n_rows":53,"n_cols":23,"rows_kept":53}
[]
[]
[]
[]
[]
["Urlaubsvortrag",{"$f":"Sep.!$F$6","v":{"v":30,"d":"30.00"}},"Urlaub genommen",{"$f":"$H$44","v":{"v":0,"d":"0.00"}},"Resturlaub",{"$f":"$B$6-$D$6","v":{"v":30,"d":"30.00"}}]
["Saldovortrag",{"$f":"Sep.!$F$7","v":{"v":0,"d":"0.00"}},"Saldoänderung",{"$f":"$P$41","v":{"v":0,"d":"0.00"}},"Kumulierter Saldo",{"$f":"$B$7+$D$7","v":{"v":0,"d":"0.00"}}]
[]
["Datum","Wochentag","Art","Arbeitsort","Von Uhrzeit","Bis Uhrzeit","Von Uhrzeit","Bis Uhrzeit","Bruttoarbeitszeit","Geb. Pause","Mindestpause","Nettoarbeitszeit","Fehlzeitenart","Fehlstunden","Sollstunden","Tagessaldo","Kumulierter Saldo",null,"Feiertag","Feiertag Anteil Tag","FZ-Gutschrift","Gleittag","Ausgewertet"]
["2026-10-01",{"$f":"TEXT(A10,\"tttt\")","v":"Donnerstag"},{"$f":"IF(AND(S10=\"Feiertag\",T10>0),\"Fehlzeit\",IF(OR(B10=\"Samstag\",B10=\"Sonntag\"),\"Wochenende\",\"Bitte auswählen\"))","v":"Bitte auswählen"},{"$nulls":5},{"$f":"IF(AND(OR(C10=\"Anwesenheit\",C10=\"Wochenende\"),E10<>\"\",F10<>\"\",W10=\"Ja\"),((F10-E10)+(H10-G10))*24,\"\")","v":""},{"$f":"IF(I10=\"\",\"\",IF(AND(G10<>\"\",H10<>\"\"),(G10-F10)*24,0))","v":""},{"$f":"IF(I10=\"\",\"\",IF(AND(I10<>\"\",J10=\"\",I10>=Personalstamm!$D$20),Personalstamm!$E$20,IF(AND(I10<>\"\",J10=\"\",I10>=Personalstamm!$D$19),Personalstamm!$E$19,IF(AND(I10<>\"\",J10<Personalstamm!$E$20,I10>=Personalstamm!$D$20),Personalstamm!$E$20-J10,IF(AND(I10<>\"\",J10<Personalstamm!E$19,I10>=Personalstamm!$D$19),Personalstamm!$E$19-J10,0)))))","v":""},{"$f":"IF(I10<>\"\",I10-K10,\"\")","v":""},{"$f":"IF(AND(S10=\"Feiertag\",T10>0),\"Feiertag\",IF(C10=\"Fehlzeit\",\"Bitte auswählen\",\"\"))","v":""},{"$f":"IF(OR(M10=\"\",M10=\"Bitte auswählen\"),\"\",IF(M10=\"Feiertag\",T10*U10,IF(M10=\"Gleittag\",0,VLOOKUP(B10,Personalstamm!$D$8:$F$14,3,FALSE))))","v":""},{"$f":"VLOOKUP(B10,Personalstamm!$D$8:$E$14,2,FALSE)","v":{"v":8,"d":"8.00"}},{"$f":"IF(AND(OR(C10=\"Anwesenheit\",C10=\"Wochenende\"),L10<>\"\"),L10-O10,IF(AND(C10=\"Fehlzeit\",N10<>\"\",W10=\"Ja\"),N10-O10,IF(W10=\"Ja\",-O10,\"\")))","v":""},{"$f":"IF(P10=\"\",B7,B7+P10)","v":{"v":0,"d":"0.00"}},null,{"$f":"IF(COUNTIF(Allgemein!$H$8:$H$45,A10)>0,\"Feiertag\",\"\")","v":""},{"$f":"IFERROR(VLOOKUP(A10,Allgemein!$H$8:$I$45,2,FALSE),\"\")","v":""},{"$f":"VLOOKUP(B10,Personalstamm!$D$8:$F$14,3,FALSE)","v":{"v":8,"d":"8.00"}},{"$f":"IF(M10=\"Gleittag\",ABS(P10),\"\")","v":""},{"$f":"IF(A10<=TODAY(),\"Ja\",\"\")","v":""}]
["2026-10-02","Freitag",{"$f":"IF(AND(S11=\"Feiertag\",T11>0),\"Fehlzeit\",IF(OR(B11=\"Samstag\",B11=\"Sonntag\"),\"Wochenende\",\"Bitte auswählen\"))","v":"Bitte auswählen"},{"$nulls":5},{"$f":"IF(AND(OR(C11=\"Anwesenheit\",C11=\"Wochenende\"),E11<>\"\",F11<>\"\",W11=\"Ja\"),((F11-E11)+(H11-G11))*24,\"\")","v":""},{"$f":"IF(I11=\"\",\"\",IF(AND(G11<>\"\",H11<>\"\"),(G11-F11)*24,0))","v":""},{"$f":"IF(I11=\"\",\"\",IF(AND(I11<>\"\",J11=\"\",I11>=Personalstamm!$D$20),Personalstamm!$E$20,IF(AND(I11<>\"\",J11=\"\",I11>=Personalstamm!$D$19),Personalstamm!$E$19,IF(AND(I11<>\"\",J11<Personalstamm!$E$20,I11>=Personalstamm!$D$20),Personalstamm!$E$20-J11,IF(AND(I11<>\"\",J11<Personalstamm!E$19,I11>=Personalstamm!$D$19),Personalstamm!$E$19-J11,0)))))","v":""},{"$f":"IF(I11<>\"\",I11-K11,\"\")","v":""},{"$f":"IF(AND(S11=\"Feiertag\",T11>0),\"Feiertag\",IF(C11=\"Fehlzeit\",\"Bitte auswählen\",\"\"))","v":""},{"$f":"IF(OR(M11=\"\",M11=\"Bitte auswählen\"),\"\",IF(M11=\"Feiertag\",T11*U11,IF(M11=\"Gleittag\",0,VLOOKUP(B11,Personalstamm!$D$8:$F$14,3,FALSE))))","v":""},{"$f":"VLOOKUP(B11,Personalstamm!$D$8:$E$14,2,FALSE)","v":{"v":8,"d":"8.00"}},{"$f":"IF(AND(OR(C11=\"Anwesenheit\",C11=\"Wochenende\"),L11<>\"\"),L11-O11,IF(AND(C11=\"Fehlzeit\",N11<>\"\",W11=\"Ja\"),N11-O11,IF(W11=\"Ja\",-O11,\"\")))","v":""},{"$f":"IF(P11=\"\",Q10,Q10+P11)","v":{"v":0,"d":"0.00"}},null,{"$f":"IF(COUNTIF(Allgemein!$H$8:$H$45,A11)>0,\"Feiertag\",\"\")","v":""},{"$f":"IFERROR(VLOOKUP(A11,Allgemein!$H$8:$I$45,2,FALSE),\"\")","v":""},{"$f":"VLOOKUP(B11,Personalstamm!$D$8:$F$14,3,FALSE)","v":{"v":8,"d":"8.00"}},{"$f":"IF(M11=\"Gleittag\",ABS(P11),\"\")","v":""},{"$f":"IF(A11<=TODAY(),\"Ja\",\"\")","v":""}]
["2026-10-03","Samstag","Fehlzeit",{"$nulls":5},"","",{"$f":"IF(I12=\"\",\"\",IF(AND(I12<>\"\",J12=\"\",I12>=Personalstamm!$D$20),Personalstamm!$E$20,IF(AND(I12<>\"\",J12=\"\",I12>=Personalstamm!$D$19),Personalstamm!$E$19,IF(AND(I12<>\"\",J12<Personalstamm!$E$20,I12>=Personalstamm!$D$20),Personalstamm!$E$20-J12,IF(AND(I12<>\"\",J12<Personalstamm!E$19,I12>=Personalstamm!$D$19),Personalstamm!$E$19-J12,0)))))","v":""},"","Feiertag",{"$f":"IF(OR(M12=\"\",M12=\"Bitte auswählen\"),\"\",IF(M12=\"Feiertag\",T12*U12,IF(M12=\"Gleittag\",0,VLOOKUP(B12,Personalstamm!$D$8:$F$14,3,FALSE))))","v":{"v":0,"d":"0.00"}},{"$f":"VLOOKUP(B12,Personalstamm!$D$8:$E$14,2,FALSE)","v":{"v":0,"d":"0.00"}},"",{"$f":"IF(P12=\"\",Q11,Q11+P12)","v":{"v":0,"d":"0.00"}},null,{"$f":"IF(COUNTIF(Allgemein!$H$8:$H$45,A12)>0,\"Feiertag\",\"\")","v":"Feiertag"},{"$f":"IFERROR(VLOOKUP(A12,Allgemein!$H$8:$I$45,2,FALSE),\"\")","v":{"v":1,"d":"1.00"}},{"$f":"VLOOKUP(B12,Personalstamm!$D$8:$F$14,3,FALSE)","v":{"v":0,"d":"0.00"}},"",""]
["2026-10-04","Sonntag","Wochenende",{"$nulls":5},"","",{"$f":"IF(I13=\"\",\"\",IF(AND(I13<>\"\",J13=\"\",I13>=Personalstamm!$D$20),Personalstamm!$E$20,IF(AND(I13<>\"\",J13=\"\",I13>=Personalstamm!$D$19),Personalstamm!$E$19,IF(AND(I13<>\"\",J13<Personalstamm!$E$20,I13>=Personalstamm!$D$20),Personalstamm!$E$20-J13,IF(AND(I13<>\"\",J13<Personalstamm!E$19,I13>=Personalstamm!$D$19),Personalstamm!$E$19-J13,0)))))","v":""},"","",{"$f":"IF(OR(M13=\"\",M13=\"Bitte auswählen\"),\"\",IF(M13=\"Feiertag\",T13*U13,IF(M13=\"Gleittag\",0,VLOOKUP(B13,Personalstamm!$D$8:$F$14,3,FALSE))))","v":""},{"$f":"VLOOKUP(B13,Personalstamm!$D$8:$E$14,2,FALSE)","v":{"v":0,"d":"0.00"}},"",{"v":0,"d":"0.00"},null,{"$f":"IF(COUNTIF(Allgemein!$H$8:$H$45,A13)>0,\"Feiertag\",\"\")","v":""},{"$f":"IFERROR(VLOOKUP(A13,Allgemein!$H$8:$I$45,2,FALSE),\"\")","v":""},{"$f":"VLOOKUP(B13,Personalstamm!$D$8:$F$14,3,FALSE)","v":{"v":0,"d":"0.00"}},"",""]
["2026-10-05","Montag","Bitte auswählen",{"$nulls":5},"","",{"$f":"IF(I14=\"\",\"\",IF(AND(I14<>\"\",J14=\"\",I14>=Personalstamm!$D$20),Personalstamm!$E$20,IF(AND(I14<>\"\",J14=\"\",I14>=Personalstamm!$D$19),Personalstamm!$E$19,IF(AND(I14<>\"\",J14<Personalstamm!$E$20,I14>=Personalstamm!$D$20),Personalstamm!$E$20-J14,IF(AND(I14<>\"\",J14<Personalstamm!E$19,I14>=Personalstamm!$D$19),Personalstamm!$E$19-J14,0)))))","v":""},"","",{"$f":"IF(OR(M14=\"\",M14=\"Bitte auswählen\"),\"\",IF(M14=\"Feiertag\",T14*U14,IF(M14=\"Gleittag\",0,VLOOKUP(B14,Personalstamm!$D$8:$F$14,3,FALSE))))","v":""},{"$f":"VLOOKUP(B14,Personalstamm!$D$8:$E$14,2,FALSE)","v":{"v":8,"d":"8.00"}},"",{"v":0,"d":"0.00"},null,{"$f":"IF(COUNTIF(Allgemein!$H$8:$H$45,A14)>0,\"Feiertag\",\"\")","v":""},{"$f":"IFERROR(VLOOKUP(A14,Allgemein!$H$8:$I$45,2,FALSE),\"\")","v":""},{"$f":"VLOOKUP(B14,Personalstamm!$D$8:$F$14,3,FALSE)","v":{"v":8,"d":"8.00"}},"",""]
["2026-10-06","Dienstag","Bitte auswählen",{"$nulls":5},"","",{"$f":"IF(I15=\"\",\"\",IF(AND(I15<>\"\",J15=\"\",I15>=Personalstamm!$D$20),Personalstamm!$E$20,IF(AND(I15<>\"\",J15=\"\",I15>=Personalstamm!$D$19),Personalstamm!$E$19,IF(AND(I15<>\"\",J15<Personalstamm!$E$20,I15>=Personalstamm!$D$20),Personalstamm!$E$20-J15,IF(AND(I15<>\"\",J15<Personalstamm!E$19,I15>=Personalstamm!$D$19),Personalstamm!$E$19-J15,0)))))","v":""},"","",{"$f":"IF(OR(M15=\"\",M15=\"Bitte auswählen\"),\"\",IF(M15=\"Feiertag\",T15*U15,IF(M15=\"Gleittag\",0,VLOOKUP(B15,Personalstamm!$D$8:$F$14,3,FALSE))))","v":""},{"$f":"VLOOKUP(B15,Personalstamm!$D$8:$E$14,2,FALSE)","v":{"v":8,"d":"8.00"}},"",{"v":0,"d":"0.00"},null,{"$f":"IF(COUNTIF(Allgemein!$H$8:$H$45,A15)>0,\"Feiertag\",\"\")","v":""},{"$f":"IFERROR(VLOOKUP(A15,Allgemein!$H$8:$I$45,2,FALSE),\"\")","v":""},{"$f":"VLOOKUP(B15,Personalstamm!$D$8:$F$14,3,FALSE)","v":{"v":8,"d":"8.00"}},"",""]
["2026-10-07","Mittwoch","Bitte auswählen",{"$nulls":5},"","",{"$f":"IF(I16=\"\",\"\",IF(AND(I16<>\"\",J16=\"\",I16>=Personalstamm!$D$20),Personalstamm!$E$20,IF(AND(I16<>\"\",J16=\"\",I16>=Personalstamm!$D$19),Personalstamm!$E$19,IF(AND(I16<>\"\",J16<Personalstamm!$E$20,I16>=Personalstamm!$D$20),Personalstamm!$E$20-J16,IF(AND(I16<>\"\",J16<Personalstamm!E$19,I16>=Personalstamm!$D$19),Personalstamm!$E$19-J16,0)))))","v":""},"","",{"$f":"IF(OR(M16=\"\",M16=\"Bitte auswählen\"),\"\",IF(M16=\"Feiertag\",T16*U16,IF(M16=\"Gleittag\",0,VLOOKUP(B16,Personalstamm!$D$8:$F$14,3,FALSE))))","v":""},{"$f":"VLOOKUP(B16,Personalstamm!$D$8:$E$14,2,FALSE)","v":{"v":8,"d":"8.00"}},"",{"v":0,"d":"0.00"},null,{"$f":"IF(COUNTIF(Allgemein!$H$8:$H$45,A16)>0,\"Feiertag\",\"\")","v":""},{"$f":"IFERROR(VLOOKUP(A16,Allgemein!$H$8:$I$45,2,FALSE),\"\")","v":""},{"$f":"VLOOKUP(B16,Personalstamm!$D$8:$F$14,3,FALSE)","v":{"v":8,"d":"8.00"}},"",""]
["2026-10-08","Donnerstag","Bitte auswählen",{"$nulls":5},"","",{"$f":"IF(I17=\"\",\"\",IF(AND(I17<>\"\",J17=\"\",I17>=Personalstamm!$D$20),Personalstamm!$E$20,IF(AND(I17<>\"\",J17=\"\",I17>=Personalstamm!$D$19),Personalstamm!$E$19,IF(AND(I17<>\"\",J17<Personalstamm!$E$20,I17>=Personalstamm!$D$20),Personalstamm!$E$20-J17,IF(AND(I17<>\"\",J17<Personalstamm!E$19,I17>=Personalstamm!$D$19),Personalstamm!$E$19-J17,0)))))","v":""},"","",{"$f":"IF(OR(M17=\"\",M17=\"Bitte auswählen\"),\"\",IF(M17=\"Feiertag\",T17*U17,IF(M17=\"Gleittag\",0,VLOOKUP(B17,Personalstamm!$D$8:$F$14,3,FALSE))))","v":""},{"$f":"VLOOKUP(B17,Personalstamm!$D$8:$E$14,2,FALSE)","v":{"v":8,"d":"8.00"}},"",{"v":0,"d":"0.00"},null,{"$f":"IF(COUNTIF(Allgemein!$H$8:$H$45,A17)>0,\"Feiertag\",\"\")","v":""},{"$f":"IFERROR(VLOOKUP(A17,Allgemein!$H$8:$I$45,2,FALSE),\"\")","v":""},{"$f":"VLOOKUP(B17,Personalstamm!$D$8:$F$14,3,FALSE)","v":{"v":8,"d":"8.00"}},"",""]
["2026-10-09","Freitag","Bitte auswählen",{"$nulls":5},"","",{"$f":"IF(I18=\"\",\"\",IF(AND(I18<>\"\",J18=\"\",I18>=Personalstamm!$D$20),Personalstamm!$E$20,IF(AND(I18<>\"\",J18=\"\",I18>=Personalstamm!$D$19),Personalstamm!$E$19,IF(AND(I18<>\"\",J18<Personalstamm!$E$20,I18>=Personalstamm!$D$20),Personalstamm!$E$20-J18,IF(AND(I18<>\"\",J18<Personalstamm!E$19,I18>=Personalstamm!$D$19),Personalstamm!$E$19-J18,0)))))","v":""},"","",{"$f":"IF(OR(M18=\"\",M18=\"Bitte auswählen\"),\"\",IF(M18=\"Feiertag\",T18*U18,IF(M18=\"Gleittag\",0,VLOOKUP(B18,Personalstamm!$D$8:$F$14,3,FALSE))))","v":""},{"$f":"VLOOKUP(B18,Personalstamm!$D$8:$E$14,2,FALSE)","v":{"v":8,"d":"8.00"}},"",{"v":0,"d":"0.00"},null,{"$f":"IF(COUNTIF(Allgemein!$H$8:$H$45,A18)>0,\"Feiertag\",\"\")","v":""},{"$f":"IFERROR(VLOOKUP(A18,Allgemein!$H$8:$I$45,2,FALSE),\"\")","v":""},{"$f":"VLOOKUP(B18,Personalstamm!$D$8:$F$14,3,FALSE)","v":{"v":8,"d":"8.00"}},"",""]
["2026-10-10","Samstag","Wochenende",{"$nulls":5},"","",{"$f":"IF(I19=\"\",\"\",IF(AND(I19<>\"\",J19=\"\",I19>=Personalstamm!$D$20),Personalstamm!$E$20,IF(AND(I19<>\"\",J19=\"\",I19>=Personalstamm!$D$19),Personalstamm!$E$19,IF(AND(I19<>\"\",J19<Personalstamm!$E$20,I19>=Personalstamm!$D$20),Personalstamm!$E$20-J19,IF(AND(I19<>\"\",J19<Personalstamm!E$19,I19>=Personalstamm!$D$19),Personalstamm!$E$19-J19,0)))))","v":""},"","",{"$f":"IF(OR(M19=\"\",M19=\"Bitte auswählen\"),\"\",IF(M19=\"Feiertag\",T19*U19,IF(M19=\"Gleittag\",0,VLOOKUP(B19,Personalstamm!$D$8:$F$14,3,FALSE))))","v":""},{"$f":"VLOOKUP(B19,Personalstamm!$D$8:$E$14,2,FALSE)","v":{"v":0,"d":"0.00"}},"",{"v":0,"d":"0.00"},null,{"$f":"IF(COUNTIF(Allgemein!$H$8:$H$45,A19)>0,\"Feiertag\",\"\")","v":""},{"$f":"IFERROR(VLOOKUP(A19,Allgemein!$H$8:$I$45,2,FALSE),\"\")","v":""},{"$f":"VLOOKUP(B19,Personalstamm!$D$8:$F$14,3,FALSE)","v":{"v":0,"d":"0.00"}},"",""]
["2026-10-11","Sonntag","Wochenende",{"$nulls":5},"","",{"$f":"IF(I20=\"\",\"\",IF(AND(I20<>\"\",J20=\"\",I20>=Personalstamm!$D$20),Personalstamm!$E$20,IF(AND(I20<>\"\",J20=\"\",I20>=Personalstamm!$D$19),Personalstamm!$E$19,IF(AND(I20<>\"\",J20<Personalstamm!$E$20,I20>=Personalstamm!$D$20),Personalstamm!$E$20-J20,IF(AND(I20<>\"\",J20<Personalstamm!E$19,I20>=Personalstamm!$D$19),Personalstamm!$E$19-J20,0)))))","v":""},"","",{"$f":"IF(OR(M20=\"\",M20=\"Bitte auswählen\"),\"\",IF(M20=\"Feiertag\",T20*U20,IF(M20=\"Gleittag\",0,VLOOKUP(B20,Personalstamm!$D$8:$F$14,3,FALSE))))","v":""},{"$f":"VLOOKUP(B20,Personalstamm!$D$8:$E$14,2,FALSE)","v":{"v":0,"d":"0.00"}},"",{"v":0,"d":"0.00"},null,{"$f":"IF(COUNTIF(Allgemein!$H$8:$H$45,A20)>0,\"Feiertag\",\"\")","v":""},{"$f":"IFERROR(VLOOKUP(A20,Allgemein!$H$8:$I$45,2,FALSE),\"\")","v":""},{"$f":"VLOOKUP(B20,Personalstamm!$D$8:$F$14,3,FALSE)","v":{"v":0,"d":"0.00"}},"",""]
["2026-10-12","Montag","Bitte auswählen",{"$nulls":5},"","",{"$f":"IF(I21=\"\",\"\",IF(AND(I21<>\"\",J21=\"\",I21>=Personalstamm!$D$20),Personalstamm!$E$20,IF(AND(I21<>\"\",J21=\"\",I21>=Personalstamm!$D$19),Personalstamm!$E$19,IF(AND(I21<>\"\",J21<Personalstamm!$E$20,I21>=Personalstamm!$D$20),Personalstamm!$E$20-J21,IF(AND(I21<>\"\",J21<Personalstamm!E$19,I21>=Personalstamm!$D$19),Personalstamm!$E$19-J21,0)))))","v":""},"","",{"$f":"IF(OR(M21=\"\",M21=\"Bitte auswählen\"),\"\",IF(M21=\"Feiertag\",T21*U21,IF(M21=\"Gleittag\",0,VLOOKUP(B21,Personalstamm!$D$8:$F$14,3,FALSE))))","v":""},{"$f":"VLOOKUP(B21,Personalstamm!$D$8:$E$14,2,FALSE)","v":{"v":8,"d":"8.00"}},"",{"v":0,"d":"0.00"},null,{"$f":"IF(COUNTIF(Allgemein!$H$8:$H$45,A21)>0,\"Feiertag\",\"\")","v":""},{"$f":"IFERROR(VLOOKUP(A21,Allgemein!$H$8:$I$45,2,FALSE),\"\")","v":""},{"$f":"VLOOKUP(B21,Personalstamm!$D$8:$F$14,3,FALSE)","v":{"v":8,"d":"8.00"}},"",""]
["2026-10-13","Dienstag","Bitte auswählen",{"$nulls":5},"","",{"$f":"IF(I22=\"\",\"\",IF(AND(I22<>\"\",J22=\"\",I22>=Personalstamm!$D$20),Personalstamm!$E$20,IF(AND(I22<>\"\",J22=\"\",I22>=Personalstamm!$D$19),Personalstamm!$E$19,IF(AND(I22<>\"\",J22<Personalstamm!$E$20,I22>=Personalstamm!$D$20),Personalstamm!$E$20-J22,IF(AND(I22<>\"\",J22<Personalstamm!E$19,I22>=Personalstamm!$D$19),Personalstamm!$E$19-J22,0)))))","v":""},"","",{"$f":"IF(OR(M22=\"\",M22=\"Bitte auswählen\"),\"\",IF(M22=\"Feiertag\",T22*U22,IF(M22=\"Gleittag\",0,VLOOKUP(B22,Personalstamm!$D$8:$F$14,3,FALSE))))","v":""},{"$f":"VLOOKUP(B22,Personalstamm!$D$8:$E$14,2,FALSE)","v":{"v":8,"d":"8.00"}},"",{"v":0,"d":"0.00"},null,{"$f":"IF(COUNTIF(Allgemein!$H$8:$H$45,A22)>0,\"Feiertag\",\"\")","v":""},{"$f":"IFERROR(VLOOKUP(A22,Allgemein!$H$8:$I$45,2,FALSE),\"\")","v":""},{"$f":"VLOOKUP(B22,Personalstamm!$D$8:$F$14,3,FALSE)","v":{"v":8,"d":"8.00"}},"",""]
["2026-10-14","Mittwoch","Bitte auswählen",{"$nulls":5},"","",{"$f":"IF(I23=\"\",\"\",IF(AND(I23<>\"\",J23=\"\",I23>=Personalstamm!$D$20),Personalstamm!$E$20,IF(AND(I23<>\"\",J23=\"\",I23>=Personalstamm!$D$19),Personalstamm!$E$19,IF(AND(I23<>\"\",J23<Personalstamm!$E$20,I23>=Personalstamm!$D$20),Personalstamm!$E$20-J23,IF(AND(I23<>\"\",J23<Personalstamm!E$19,I23>=Personalstamm!$D$19),Personalstamm!$E$19-J23,0)))))","v":""},"","",{"$f":"IF(OR(M23=\"\",M23=\"Bitte auswählen\"),\"\",IF(M23=\"Feiertag\",T23*U23,IF(M23=\"Gleittag\",0,VLOOKUP(B23,Personalstamm!$D$8:$F$14,3,FALSE))))","v":""},{"$f":"VLOOKUP(B23,Personalstamm!$D$8:$E$14,2,FALSE)","v":{"v":8,"d":"8.00"}},"",{"v":0,"d":"0.00"},null,{"$f":"IF(COUNTIF(Allgemein!$H$8:$H$45,A23)>0,\"Feiertag\",\"\")","v":""},{"$f":"IFERROR(VLOOKUP(A23,Allgemein!$H$8:$I$45,2,FALSE),\"\")","v":""},{"$f":"VLOOKUP(B23,Personalstamm!$D$8:$F$14,3,FALSE)","v":{"v":8,"d":"8.00"}},"",""]
["2026-10-15","Donnerstag","Bitte auswählen",{"$nulls":5},"","",{"$f":"IF(I24=\"\",\"\",IF(AND(I24<>\"\",J24=\"\",I24>=Personalstamm!$D$20),Personalstamm!$E$20,IF(AND(I24<>\"\",J24=\"\",I24>=Personalstamm!$D$19),Personalstamm!$E$19,IF(AND(I24<>\"\",J24<Personalstamm!$E$20,I24>=Personalstamm!$D$20),Personalstamm!$E$20-J24,IF(AND(I24<>\"\",J24<Personalstamm!E$19,I24>=Personalstamm!$D$19),Personalstamm!$E$19-J24,0)))))","v":""},"","",{"$f":"IF(OR(M24=\"\",M24=\"Bitte auswählen\"),\"\",IF(M24=\"Feiertag\",T24*U24,IF(M24=\"Gleittag\",0,VLOOKUP(B24,Personalstamm!$D$8:$F$14,3,FALSE))))","v":""},{"$f":"VLOOKUP(B24,Personalstamm!$D$8:$E$14,2,FALSE)","v":{"v":8,"d":"8.00"}},"",{"v":0,"d":"0.00"},null,{"$f":"IF(COUNTIF(Allgemein!$H$8:$H$45,A24)>0,\"Feiertag\",\"\")","v":""},{"$f":"IFERROR(VLOOKUP(A24,Allgemein!$H$8:$I$45,2,FALSE),\"\")","v":""},{"$f":"VLOOKUP(B24,Personalstamm!$D$8:$F$14,3,FALSE)","v":{"v":8,"d":"8.00"}},"",""]
["2026-10-16","Freitag","Bitte auswählen",{"$nulls":5},"","",{"$f":"IF(I25=\"\",\"\",IF(AND(I25<>\"\",J25=\"\",I25>=Personalstamm!$D$20),Personalstamm!$E$20,IF(AND(I25<>\"\",J25=\"\",I25>=Personalstamm!$D$19),Personalstamm!$E$19,IF(AND(I25<>\"\",J25<Personalstamm!$E$20,I25>=Personalstamm!$D$20),Personalstamm!$E$20-J25,IF(AND(I25<>\"\",J25<Personalstamm!E$19,I25>=Personalstamm!$D$19),Personalstamm!$E$19-J25,0)))))","v":""},"","",{"$f":"IF(OR(M25=\"\",M25=\"Bitte auswählen\"),\"\",IF(M25=\"Feiertag\",T25*U25,IF(M25=\"Gleittag\",0,VLOOKUP(B25,Personalstamm!$D$8:$F$14,3,FALSE))))","v":""},{"$f":"VLOOKUP(B25,Personalstamm!$D$8:$E$14,2,FALSE)","v":{"v":8,"d":"8.00"}},"",{"v":0,"d":"0.00"},null,{"$f":"IF(COUNTIF(Allgemein!$H$8:$H$45,A25)>0,\"Feiertag\",\"\")","v":""},{"$f":"IFERROR(VLOOKUP(A25,Allgemein!$H$8:$I$45,2,FALSE),\"\")","v":""},{"$f":"VLOOKUP(B25,Personalstamm!$D$8:$F$14,3,FALSE)","v":{"v":8,"d":"8.00"}},"",""]
["2026-10-17","Samstag","Wochenende",{"$nulls":5},"","",{"$f":"IF(I26=\"\",\"\",IF(AND(I26<>\"\",J26=\"\",I26>=Personalstamm!$D$20),Personalstamm!$E$20,IF(AND(I26<>\"\",J26=\"\",I26>=Personalstamm!$D$19),Personalstamm!$E$19,IF(AND(I26<>\"\",J26<Personalstamm!$E$20,I26>=Personalstamm!$D$20),Personalstamm!$E$20-J26,IF(AND(I26<>\"\",J26<Personalstamm!E$19,I26>=Personalstamm!$D$19),Personalstamm!$E$19-J26,0)))))","v":""},"","",{"$f":"IF(OR(M26=\"\",M26=\"Bitte auswählen\"),\"\",IF(M26=\"Feiertag\",T26*U26,IF(M26=\"Gleittag\",0,VLOOKUP(B26,Personalstamm!$D$8:$F$14,3,FALSE))))","v":""},{"$f":"VLOOKUP(B26,Personalstamm!$D$8:$E$14,2,FALSE)","v":{"v":0,"d":"0.00"}},"",{"v":0,"d":"0.00"},null,{"$f":"IF(COUNTIF(Allgemein!$H$8:$H$45,A26)>0,\"Feiertag\",\"\")","v":""},{"$f":"IFERROR(VLOOKUP(A26,Allgemein!$H$8:$I$45,2,FALSE),\"\")","v":""},{"$f":"VLOOKUP(B26,Personalstamm!$D$8:$F$14,3,FALSE)","v":{"v":0,"d":"0.00"}},"",""]
["2026-10-18","Sonntag","Wochenende",{"$nulls":5},"","",{"$f":"IF(I27=\"\",\"\",IF(AND(I27<>\"\",J27=\"\",I27>=Personalstamm!$D$20),Personalstamm!$E$20,IF(AND(I27<>\"\",J27=\"\",I27>=Personalstamm!$D$19),Personalstamm!$E$19,IF(AND(I27<>\"\",J27<Personalstamm!$E$20,I27>=Personalstamm!$D$20),Personalstamm!$E$20-J27,IF(AND(I27<>\"\",J27<Personalstamm!E$19,I27>=Personalstamm!$D$19),Personalstamm!$E$19-J27,0)))))","v":""},"","",{"$f":"IF(OR(M27=\"\",M27=\"Bitte auswählen\"),\"\",IF(M27=\"Feiertag\",T27*U27,IF(M27=\"Gleittag\",0,VLOOKUP(B27,Personalstamm!$D$8:$F$14,3,FALSE))))","v":""},{"$f":"VLOOKUP(B27,Personalstamm!$D$8:$E$14,2,FALSE)","v":{"v":0,"d":"0.00"}},"",{"v":0,"d":"0.00"},null,{"$f":"IF(COUNTIF(Allgemein!$H$8:$H$45,A27)>0,\"Feiertag\",\"\")","v":""},{"$f":"IFERROR(VLOOKUP(A27,Allgemein!$H$8:$I$45,2,FALSE),\"\")","v":""},{"$f":"VLOOKUP(B27,Personalstamm!$D$8:$F$14,3,FALSE)","v":{"v":0,"d":"0.00"}},"",""]
["2026-10-19","Montag","Bitte auswählen",{"$nulls":5},"","",{"$f":"IF(I28=\"\",\"\",IF(AND(I28<>\"\",J28=\"\",I28>=Personalstamm!$D$20),Personalstamm!$E$20,IF(AND(I28<>\"\",J28=\"\",I28>=Personalstamm!$D$19),Personalstamm!$E$19,IF(AND(I28<>\"\",J28<Personalstamm!$E$20,I28>=Personalstamm!$D$20),Personalstamm!$E$20-J28,IF(AND(I28<>\"\",J28<Personalstamm!E$19,I28>=Personalstamm!$D$19),Personalstamm!$E$19-J28,0)))))","v":""},"","",{"$f":"IF(OR(M28=\"\",M28=\"Bitte auswählen\"),\"\",IF(M28=\"Feiertag\",T28*U28,IF(M28=\"Gleittag\",0,VLOOKUP(B28,Personalstamm!$D$8:$F$14,3,FALSE))))","v":""},{"$f":"VLOOKUP(B28,Personalstamm!$D$8:$E$14,2,FALSE)","v":{"v":8,"d":"8.00"}},"",{"v":0,"d":"0.00"},null,{"$f":"IF(COUNTIF(Allgemein!$H$8:$H$45,A28)>0,\"Feiertag\",\"\")","v":""},{"$f":"IFERROR(VLOOKUP(A28,Allgemein!$H$8:$I$45,2,FALSE),\"\")","v":""},{"$f":"VLOOKUP(B28,Personalstamm!$D$8:$F$14,3,FALSE)","v":{"v":8,"d":"8.00"}},"",""]
["2026-10-20","Dienstag","Bitte auswählen",{"$nulls":5},"","",{"$f":"IF(I29=\"\",\"\",IF(AND(I29<>\"\",J29=\"\",I29>=Personalstamm!$D$20),Personalstamm!$E$20,IF(AND(I29<>\"\",J29=\"\",I29>=Personalstamm!$D$19),Personalstamm!$E$19,IF(AND(I29<>\"\",J29<Personalstamm!$E$20,I29>=Personalstamm!$D$20),Personalstamm!$E$20-J29,IF(AND(I29<>\"\",J29<Personalstamm!E$19,I29>=Personalstamm!$D$19),Personalstamm!$E$19-J29,0)))))","v":""},"","",{"$f":"IF(OR(M29=\"\",M29=\"Bitte auswählen\"),\"\",IF(M29=\"Feiertag\",T29*U29,IF(M29=\"Gleittag\",0,VLOOKUP(B29,Personalstamm!$D$8:$F$14,3,FALSE))))","v":""},{"$f":"VLOOKUP(B29,Personalstamm!$D$8:$E$14,2,FALSE)","v":{"v":8,"d":"8.00"}},"",{"v":0,"d":"0.00"},null,{"$f":"IF(COUNTIF(Allgemein!$H$8:$H$45,A29)>0,\"Feiertag\",\"\")","v":""},{"$f":"IFERROR(VLOOKUP(A29,Allgemein!$H$8:$I$45,2,FALSE),\"\")","v":""},{"$f":"VLOOKUP(B29,Personalstamm!$D$8:$F$14,3,FALSE)","v":{"v":8,"d":"8.00"}},"",""]
["2026-10-21","Mittwoch","Bitte auswählen",{"$nulls":5},"","",{"$f":"IF(I30=\"\",\"\",IF(AND(I30<>\"\",J30=\"\",I30>=Personalstamm!$D$20),Personalstamm!$E$20,IF(AND(I30<>\"\",J30=\"\",I30>=Personalstamm!$D$19),Personalstamm!$E$19,IF(AND(I30<>\"\",J30<Personalstamm!$E$20,I30>=Personalstamm!$D$20),Personalstamm!$E$20-J30,IF(AND(I30<>\"\",J30<Personalstamm!E$19,I30>=Personalstamm!$D$19),Personalstamm!$E$19-J30,0)))))","v":""},"","",{"$f":"IF(OR(M30=\"\",M30=\"Bitte auswählen\"),\"\",IF(M30=\"Feiertag\",T30*U30,IF(M30=\"Gleittag\",0,VLOOKUP(B30,Personalstamm!$D$8:$F$14,3,FALSE))))","v":""},{"$f":"VLOOKUP(B30,Personalstamm!$D$8:$E$14,2,FALSE)","v":{"v":8,"d":"8.00"}},"",{"v":0,"d":"0.00"},null,{"$f":"IF(COUNTIF(Allgemein!$H$8:$H$45,A30)>0,\"Feiertag\",\"\")","v":""},{"$f":"IFERROR(VLOOKUP(A30,Allgemein!$H$8:$I$45,2,FALSE),\"\")","v":""},{"$f":"VLOOKUP(B30,Personalstamm!$D$8:$F$14,3,FALSE)","v":{"v":8,"d":"8.00"}},"",""]
["2026-10-22","Donnerstag","Bitte auswählen",{"$nulls":5},"","",{"$f":"IF(I31=\"\",\"\",IF(AND(I31<>\"\",J31=\"\",I31>=Personalstamm!$D$20),Personalstamm!$E$20,IF(AND(I31<>\"\",J31=\"\",I31>=Personalstamm!$D$19),Personalstamm!$E$19,IF(AND(I31<>\"\",J31<Personalstamm!$E$20,I31>=Personalstamm!$D$20),Personalstamm!$E$20-J31,IF(AND(I31<>\"\",J31<Personalstamm!E$19,I31>=Personalstamm!$D$19),Personalstamm!$E$19-J31,0)))))","v":""},"","",{"$f":"IF(OR(M31=\"\",M31=\"Bitte auswählen\"),\"\",IF(M31=\"Feiertag\",T31*U31,IF(M31=\"Gleittag\",0,VLOOKUP(B31,Personalstamm!$D$8:$F$14,3,FALSE))))","v":""},{"$f":"VLOOKUP(B31,Personalstamm!$D$8:$E$14,2,FALSE)","v":{"v":8,"d":"8.00"}},"",{"v":0,"d":"0.00"},null,{"$f":"IF(COUNTIF(Allgemein!$H$8:$H$45,A31)>0,\"Feiertag\",\"\")","v":""},{"$f":"IFERROR(VLOOKUP(A31,Allgemein!$H$8:$I$45,2,FALSE),\"\")","v":""},{"$f":"VLOOKUP(B31,Personalstamm!$D$8:$F$14,3,FALSE)","v":{"v":8,"d":"8.00"}},"",""]
["2026-10-23","Freitag","Bitte auswählen",{"$nulls":5},"","",{"$f":"IF(I32=\"\",\"\",IF(AND(I32<>\"\",J32=\"\",I32>=Personalstamm!$D$20),Personalstamm!$E$20,IF(AND(I32<>\"\",J32=\"\",I32>=Personalstamm!$D$19),Personalstamm!$E$19,IF(AND(I32<>\"\",J32<Personalstamm!$E$20,I32>=Personalstamm!$D$20),Personalstamm!$E$20-J32,IF(AND(I32<>\"\",J32<Personalstamm!E$19,I32>=Personalstamm!$D$19),Personalstamm!$E$19-J32,0)))))","v":""},"","",{"$f":"IF(OR(M32=\"\",M32=\"Bitte auswählen\"),\"\",IF(M32=\"Feiertag\",T32*U32,IF(M32=\"Gleittag\",0,VLOOKUP(B32,Personalstamm!$D$8:$F$14,3,FALSE))))","v":""},{"$f":"VLOOKUP(B32,Personalstamm!$D$8:$E$14,2,FALSE)","v":{"v":8,"d":"8.00"}},"",{"v":0,"d":"0.00"},null,{"$f":"IF(COUNTIF(Allgemein!$H$8:$H$45,A32)>0,\"Feiertag\",\"\")","v":""},{"$f":"IFERROR(VLOOKUP(A32,Allgemein!$H$8:$I$45,2,FALSE),\"\")","v":""},{"$f":"VLOOKUP(B32,Personalstamm!$D$8:$F$14,3,FALSE)","v":{"v":8,"d":"8.00"}},"",""]
["2026-10-24","Samstag","Wochenende",{"$nulls":5},"","",{"$f":"IF(I33=\"\",\"\",IF(AND(I33<>\"\",J33=\"\",I33>=Personalstamm!$D$20),Personalstamm!$E$20,IF(AND(I33<>\"\",J33=\"\",I33>=Personalstamm!$D$19),Personalstamm!$E$19,IF(AND(I33<>\"\",J33<Personalstamm!$E$20,I33>=Personalstamm!$D$20),Personalstamm!$E$20-J33,IF(AND(I33<>\"\",J33<Personalstamm!E$19,I33>=Personalstamm!$D$19),Personalstamm!$E$19-J33,0)))))","v":""},"","",{"$f":"IF(OR(M33=\"\",M33=\"Bitte auswählen\"),\"\",IF(M33=\"Feiertag\",T33*U33,IF(M33=\"Gleittag\",0,VLOOKUP(B33,Personalstamm!$D$8:$F$14,3,FALSE))))","v":""},{"$f":"VLOOKUP(B33,Personalstamm!$D$8:$E$14,2,FALSE)","v":{"v":0,"d":"0.00"}},"",{"v":0,"d":"0.00"},null,{"$f":"IF(COUNTIF(Allgemein!$H$8:$H$45,A33)>0,\"Feiertag\",\"\")","v":""},{"$f":"IFERROR(VLOOKUP(A33,Allgemein!$H$8:$I$45,2,FALSE),\"\")","v":""},{"$f":"VLOOKUP(B33,Personalstamm!$D$8:$F$14,3,FALSE)","v":{"v":0,"d":"0.00"}},"",""]
["2026-10-25","Sonntag","Wochenende",{"$nulls":5},"","",{"$f":"IF(I34=\"\",\"\",IF(AND(I34<>\"\",J34=\"\",I34>=Personalstamm!$D$20),Personalstamm!$E$20,IF(AND(I34<>\"\",J34=\"\",I34>=Personalstamm!$D$19),Personalstamm!$E$19,IF(AND(I34<>\"\",J34<Personalstamm!$E$20,I34>=Personalstamm!$D$20),Personalstamm!$E$20-J34,IF(AND(I34<>\"\",J34<Personalstamm!E$19,I34>=Personalstamm!$D$19),Personalstamm!$E$19-J34,0)))))","v":""},"","",{"$f":"IF(OR(M34=\"\",M34=\"Bitte auswählen\"),\"\",IF(M34=\"Feiertag\",T34*U34,IF(M34=\"Gleittag\",0,VLOOKUP(B34,Personalstamm!$D$8:$F$14,3,FALSE))))","v":""},{"$f":"VLOOKUP(B34,Personalstamm!$D$8:$E$14,2,FALSE)","v":{"v":0,"d":"0.00"}},"",{"v":0,"d":"0.00"},null,{"$f":"IF(COUNTIF(Allgemein!$H$8:$H$45,A34)>0,\"Feiertag\",\"\")","v":""},{"$f":"IFERROR(VLOOKUP(A34,Allgemein!$H$8:$I$45,2,FALSE),\"\")","v":""},{"$f":"VLOOKUP(B34,Personalstamm!$D$8:$F$14,3,FALSE)","v":{"v":0,"d":"0.00"}},"",""]
["2026-10-26","Montag","Bitte auswählen",{"$nulls":5},"","",{"$f":"IF(I35=\"\",\"\",IF(AND(I35<>\"\",J35=\"\",I35>=Personalstamm!$D$20),Personalstamm!$E$20,IF(AND(I35<>\"\",J35=\"\",I35>=Personalstamm!$D$19),Personalstamm!$E$19,IF(AND(I35<>\"\",J35<Personalstamm!$E$20,I35>=Personalstamm!$D$20),Personalstamm!$E$20-J35,IF(AND(I35<>\"\",J35<Personalstamm!E$19,I35>=Personalstamm!$D$19),Personalstamm!$E$19-J35,0)))))","v":""},"","",{"$f":"IF(OR(M35=\"\",M35=\"Bitte auswählen\"),\"\",IF(M35=\"Feiertag\",T35*U35,IF(M35=\"Gleittag\",0,VLOOKUP(B35,Personalstamm!$D$8:$F$14,3,FALSE))))","v":""},{"$f":"VLOOKUP(B35,Personalstamm!$D$8:$E$14,2,FALSE)","v":{"v":8,"d":"8.00"}},"",{"v":0,"d":"0.00"},null,{"$f":"IF(COUNTIF(Allgemein!$H$8:$H$45,A35)>0,\"Feiertag\",\"\")","v":""},{"$f":"IFERROR(VLOOKUP(A35,Allgemein!$H$8:$I$45,2,FALSE),\"\")","v":""},{"$f":"VLOOKUP(B35,Personalstamm!$D$8:$F$14,3,FALSE)","v":{"v":8,"d":"8.00"}},"",""]
["2026-10-27","Dienstag","Bitte auswählen",{"$nulls":5},"","",{"$f":"IF(I36=\"\",\"\",IF(AND(I36<>\"\",J36=\"\",I36>=Personalstamm!$D$20),Personalstamm!$E$20,IF(AND(I36<>\"\",J36=\"\",I36>=Personalstamm!$D$19),Personalstamm!$E$19,IF(AND(I36<>\"\",J36<Personalstamm!$E$20,I36>=Personalstamm!$D$20),Personalstamm!$E$20-J36,IF(AND(I36<>\"\",J36<Personalstamm!E$19,I36>=Personalstamm!$D$19),Personalstamm!$E$19-J36,0)))))","v":""},"","",{"$f":"IF(OR(M36=\"\",M36=\"Bitte auswählen\"),\"\",IF(M36=\"Feiertag\",T36*U36,IF(M36=\"Gleittag\",0,VLOOKUP(B36,Personalstamm!$D$8:$F$14,3,FALSE))))","v":""},{"$f":"VLOOKUP(B36,Personalstamm!$D$8:$E$14,2,FALSE)","v":{"v":8,"d":"8.00"}},"",{"v":0,"d":"0.00"},null,{"$f":"IF(COUNTIF(Allgemein!$H$8:$H$45,A36)>0,\"Feiertag\",\"\")","v":""},{"$f":"IFERROR(VLOOKUP(A36,Allgemein!$H$8:$I$45,2,FALSE),\"\")","v":""},{"$f":"VLOOKUP(B36,Personalstamm!$D$8:$F$14,3,FALSE)","v":{"v":8,"d":"8.00"}},"",""]
["2026-10-28","Mittwoch","Bitte auswählen",{"$nulls":5},"","",{"$f":"IF(I37=\"\",\"\",IF(AND(I37<>\"\",J37=\"\",I37>=Personalstamm!$D$20),Personalstamm!$E$20,IF(AND(I37<>\"\",J37=\"\",I37>=Personalstamm!$D$19),Personalstamm!$E$19,IF(AND(I37<>\"\",J37<Personalstamm!$E$20,I37>=Personalstamm!$D$20),Personalstamm!$E$20-J37,IF(AND(I37<>\"\",J37<Personalstamm!E$19,I37>=Personalstamm!$D$19),Personalstamm!$E$19-J37,0)))))","v":""},"","",{"$f":"IF(OR(M37=\"\",M37=\"Bitte auswählen\"),\"\",IF(M37=\"Feiertag\",T37*U37,IF(M37=\"Gleittag\",0,VLOOKUP(B37,Personalstamm!$D$8:$F$14,3,FALSE))))","v":""},{"$f":"VLOOKUP(B37,Personalstamm!$D$8:$E$14,2,FALSE)","v":{"v":8,"d":"8.00"}},"",{"v":0,"d":"0.00"},null,{"$f":"IF(COUNTIF(Allgemein!$H$8:$H$45,A37)>0,\"Feiertag\",\"\")","v":""},{"$f":"IFERROR(VLOOKUP(A37,Allgemein!$H$8:$I$45,2,FALSE),\"\")","v":""},{"$f":"VLOOKUP(B37,Personalstamm!$D$8:$F$14,3,FALSE)","v":{"v":8,"d":"8.00"}},"",""]
["2026-10-29","Donnerstag","Bitte auswählen",{"$nulls":5},"","",{"$f":"IF(I38=\"\",\"\",IF(AND(I38<>\"\",J38=\"\",I38>=Personalstamm!$D$20),Personalstamm!$E$20,IF(AND(I38<>\"\",J38=\"\",I38>=Personalstamm!$D$19),Personalstamm!$E$19,IF(AND(I38<>\"\",J38<Personalstamm!$E$20,I38>=Personalstamm!$D$20),Personalstamm!$E$20-J38,IF(AND(I38<>\"\",J38<Personalstamm!E$19,I38>=Personalstamm!$D$19),Personalstamm!$E$19-J38,0)))))","v":""},"","",{"$f":"IF(OR(M38=\"\",M38=\"Bitte auswählen\"),\"\",IF(M38=\"Feiertag\",T38*U38,IF(M38=\"Gleittag\",0,VLOOKUP(B38,Personalstamm!$D$8:$F$14,3,FALSE))))","v":""},{"$f":"VLOOKUP(B38,Personalstamm!$D$8:$E$14,2,FALSE)","v":{"v":8,"d":"8.00"}},"",{"v":0,"d":"0.00"},null,{"$f":"IF(COUNTIF(Allgemein!$H$8:$H$45,A38)>0,\"Feiertag\",\"\")","v":""},{"$f":"IFERROR(VLOOKUP(A38,Allgemein!$H$8:$I$45,2,FALSE),\"\")","v":""},{"$f":"VLOOKUP(B38,Personalstamm!$D$8:$F$14,3,FALSE)","v":{"v":8,"d":"8.00"}},"",""]
["2026-10-30","Freitag","Bitte auswählen",{"$nulls":5},"","",{"$f":"IF(I39=\"\",\"\",IF(AND(I39<>\"\",J39=\"\",I39>=Personalstamm!$D$20),Personalstamm!$E$20,IF(AND(I39<>\"\",J39=\"\",I39>=Personalstamm!$D$19),Personalstamm!$E$19,IF(AND(I39<>\"\",J39<Personalstamm!$E$20,I39>=Personalstamm!$D$20),Personalstamm!$E$20-J39,IF(AND(I39<>\"\",J39<Personalstamm!E$19,I39>=Personalstamm!$D$19),Personalstamm!$E$19-J39,0)))))","v":""},"","",{"$f":"IF(OR(M39=\"\",M39=\"Bitte auswählen\"),\"\",IF(M39=\"Feiertag\",T39*U39,IF(M39=\"Gleittag\",0,VLOOKUP(B39,Personalstamm!$D$8:$F$14,3,FALSE))))","v":""},{"$f":"VLOOKUP(B39,Personalstamm!$D$8:$E$14,2,FALSE)","v":{"v":8,"d":"8.00"}},"",{"v":0,"d":"0.00"},null,{"$f":"IF(COUNTIF(Allgemein!$H$8:$H$45,A39)>0,\"Feiertag\",\"\")","v":""},{"$f":"IFERROR(VLOOKUP(A39,Allgemein!$H$8:$I$45,2,FALSE),\"\")","v":""},{"$f":"VLOOKUP(B39,Personalstamm!$D$8:$F$14,3,FALSE)","v":{"v":8,"d":"8.00"}},"",""]
["2026-10-31","Samstag","Wochenende",{"$nulls":5},"","",{"$f":"IF(I40=\"\",\"\",IF(AND(I40<>\"\",J40=\"\",I40>=Personalstamm!$D$20),Personalstamm!$E$20,IF(AND(I40<>\"\",J40=\"\",I40>=Personalstamm!$D$19),Personalstamm!$E$19,IF(AND(I40<>\"\",J40<Personalstamm!$E$20,I40>=Personalstamm!$D$20),Personalstamm!$E$20-J40,IF(AND(I40<>\"\",J40<Personalstamm!E$19,I40>=Personalstamm!$D$19),Personalstamm!$E$19-J40,0)))))","v":""},"","",{"$f":"IF(OR(M40=\"\",M40=\"Bitte auswählen\"),\"\",IF(M40=\"Feiertag\",T40*U40,IF(M40=\"Gleittag\",0,VLOOKUP(B40,Personalstamm!$D$8:$F$14,3,FALSE))))","v":""},{"$f":"VLOOKUP(B40,Personalstamm!$D$8:$E$14,2,FALSE)","v":{"v":0,"d":"0.00"}},"",{"$f":"IF(P40=\"\",Q39,Q39+P40)","v":{"v":0,"d":"0.00"}},null,{"$f":"IF(COUNTIF(Allgemein!$H$8:$H$45,A40)>0,\"Feiertag\",\"\")","v":"Feiertag"},{"$f":"IFERROR(VLOOKUP(A40,Allgemein!$H$8:$I$45,2,FALSE),\"\")","v":{"v":0,"d":"0.00"}},{"$f":"VLOOKUP(B40,Personalstamm!$D$8:$F$14,3,FALSE)","v":{"v":0,"d":"0.00"}},"",""]
["Summe",{"$nulls":7},{"$f":"SUM(I10:I40)","v":{"v":0,"d":"0.00"}},{"$f":"SUM(J10:J40)","v":{"v":0,"d":"0.00"}},{"$f":"SUM(K10:K40)","v":{"v":0,"d":"0.00"}},{"$f":"SUM(L10:L40)","v":{"v":0,"d":"0.00"}},null,{"$f":"SUM(N10:N40)","v":{"v":0,"d":"0.00"}},{"$f":"SUM(O10:O40)","v":{"v":176,"d":"176.00"}},{"$f":"SUM(P10:P40)","v":{"v":0,"d":"0.00"}}]
[]
["Art","Anzahl Tage",null,"Fehlzeitenart","Anzahl Tage","Anzahl Stunden",null,"Urlaub genommen","Urlaub geplant"]
["Monat",{"$f":"COUNTIF($C$10:$C$40,\"*\")","v":{"v":31,"d":"31.00"}},null,"Urlaub",{"$f":"COUNTIF($M$10:$M$40,Allgemein!$I$50)","v":{"v":0,"d":"0.00"}},{"$f":"SUMIF($M$10:$M$40,Allgemein!$I$50,$N$10:$N$40)","v":{"v":0,"d":"0.00"}},null,{"$f":"COUNTIFS($A$10:$A$40,\"<\"&TODAY(),$M$10:$M$40,\"Urlaub\")","v":{"v":0,"d":"0.00"}},{"$f":"COUNTIFS($A$10:$A$40,\">=\"&TODAY(),$M$10:$M$40,\"Urlaub\")","v":{"v":0,"d":"0.00"}}]
["Anwesenheit",{"$f":"COUNTIF($C$10:$C$40,Allgemein!$G$50)","v":{"v":0,"d":"0.00"}},null,"Krankheit",{"$f":"COUNTIF($M$10:$M$40,Allgemein!$I$51)","v":{"v":0,"d":"0.00"}},{"$f":"SUMIF($M$10:$M$40,Allgemein!$I$51,$N$10:$N$40)","v":{"v":0,"d":"0.00"}}]
["Fehlzeit",{"$f":"COUNTIF($C$10:$C$40,Allgemein!$G$51)","v":{"v":1,"d":"1.00"}},null,"Kurzarbeit",{"$f":"COUNTIF($M$10:$M$40,Allgemein!$I$52)","v":{"v":0,"d":"0.00"}},{"$f":"SUMIF($M$10:$M$40,Allgemein!$I$52,$N$10:$N$40)","v":{"v":0,"d":"0.00"}}]
["Wochenende",{"$f":"COUNTIF($C$10:$C$40,Allgemein!$G$52)","v":{"v":8,"d":"8.00"}},null,"Mutterschutz",{"$f":"COUNTIF($M$10:$M$40,Allgemein!$I$53)","v":{"v":0,"d":"0.00"}},{"$f":"SUMIF($M$10:$M$40,Allgemein!$I$53,$N$10:$N$40)","v":{"v":0,"d":"0.00"}}]
["Undefiniert",{"$f":"COUNTIF($C$10:$C$40,Allgemein!$G$49)","v":{"v":22,"d":"22.00"}},null,"Fortbildung",{"$f":"COUNTIF($M$10:$M$40,Allgemein!$I$54)","v":{"v":0,"d":"0.00"}},{"$f":"SUMIF($M$10:$M$40,Allgemein!$I$54,$N$10:$N$40)","v":{"v":0,"d":"0.00"}}]
[{"$nulls":3},"Elternzeit",{"$f":"COUNTIF($M$10:$M$40,Allgemein!$I$55)","v":{"v":0,"d":"0.00"}},{"$f":"SUMIF($M$10:$M$40,Allgemein!$I$55,$N$10:$N$40)","v":{"v":0,"d":"0.00"}}]
[{"$nulls":3},"Gleittag",{"$f":"COUNTIF($M$10:$M$40,Allgemein!$I$56)","v":{"v":0,"d":"0.00"}},{"$f":"SUMIF($M$10:$M$40,Allgemein!$I$56,$V$10:$V$40)","v":{"v":0,"d":"0.00"}}]
[{"$nulls":3},"Schule",{"$f":"COUNTIF($M$10:$M$40,Allgemein!$I$57)","v":{"v":0,"d":"0.00"}},{"$f":"SUMIF($M$10:$M$40,Allgemein!$I$57,$N$10:$N$40)","v":{"v":0,"d":"0.00"}}]
[{"$nulls":3},"Feiertag",{"$f":"COUNTIF($M$10:$M$40,Allgemein!$I$58)","v":{"v":1,"d":"1.00"}},{"$f":"SUMIF($M$10:$M$40,Allgemein!$I$58,$N$10:$N$40)","v":{"v":0,"d":"0.00"}}]
[{"$nulls":3},"Undefiniert",{"$f":"COUNTIF($M$10:$M$40,Allgemein!$I$49)","v":{"v":0,"d":"0.00"}},{"$f":"SUMIF($M$10:$M$40,Allgemein!$I$49,$N$10:$N$40)","v":{"v":0,"d":"0.00"}}]

{"sheet":"Nov.","index":15,"n_rows":52,"n_cols":23,"rows_kept":52}
[]
[]
[]
[]
[]
["Urlaubsvortrag",{"$f":"Okt.!$F$6","v":{"v":30,"d":"30.00"}},"Urlaub genommen",{"$f":"$H$43","v":{"v":0,"d":"0.00"}},"Resturlaub",{"$f":"$B$6-$D$6","v":{"v":30,"d":"30.00"}}]
["Saldovortrag",{"$f":"Okt.!$F$7","v":{"v":0,"d":"0.00"}},"Saldoänderung",{"$f":"$P$40","v":{"v":0,"d":"0.00"}},"Kumulierter Saldo",{"$f":"$B$7+$D$7","v":{"v":0,"d":"0.00"}}]
[]
["Datum","Wochentag","Art","Arbeitsort","Von Uhrzeit","Bis Uhrzeit","Von Uhrzeit","Bis Uhrzeit","Bruttoarbeitszeit","Geb. Pause","Mindestpause","Nettoarbeitszeit","Fehlzeitenart","Fehlstunden","Sollstunden","Tagessaldo","Kumulierter Saldo",null,"Feiertag","Feiertag Anteil Tag","FZ-Gutschrift","Gleittag","Ausgewertet"]
["2026-11-01",{"$f":"TEXT(A10,\"tttt\")","v":"Sonntag"},{"$f":"IF(AND(S10=\"Feiertag\",T10>0),\"Fehlzeit\",IF(OR(B10=\"Samstag\",B10=\"Sonntag\"),\"Wochenende\",\"Bitte auswählen\"))","v":"Fehlzeit"},{"$nulls":5},{"$f":"IF(AND(OR(C10=\"Anwesenheit\",C10=\"Wochenende\"),E10<>\"\",F10<>\"\",W10=\"Ja\"),((F10-E10)+(H10-G10))*24,\"\")","v":""},{"$f":"IF(I10=\"\",\"\",IF(AND(G10<>\"\",H10<>\"\"),(G10-F10)*24,0))","v":""},{"$f":"IF(I10=\"\",\"\",IF(AND(I10<>\"\",J10=\"\",I10>=Personalstamm!$D$20),Personalstamm!$E$20,IF(AND(I10<>\"\",J10=\"\",I10>=Personalstamm!$D$19),Personalstamm!$E$19,IF(AND(I10<>\"\",J10<Personalstamm!$E$20,I10>=Personalstamm!$D$20),Personalstamm!$E$20-J10,IF(AND(I10<>\"\",J10<Personalstamm!E$19,I10>=Personalstamm!$D$19),Personalstamm!$E$19-J10,0)))))","v":""},{"$f":"IF(I10<>\"\",I10-K10,\"\")","v":""},{"$f":"IF(AND(S10=\"Feiertag\",T10>0),\"Feiertag\",IF(C10=\"Fehlzeit\",\"Bitte auswählen\",\"\"))","v":"Feiertag"},{"$f":"IF(OR(M10=\"\",M10=\"Bitte auswählen\"),\"\",IF(M10=\"Feiertag\",T10*U10,IF(M10=\"Gleittag\",0,VLOOKUP(B10,Personalstamm!$D$8:$F$14,3,FALSE))))","v":{"v":0,"d":"0.00"}},{"$f":"VLOOKUP(B10,Personalstamm!$D$8:$E$14,2,FALSE)","v":{"v":0,"d":"0.00"}},{"$f":"IF(AND(OR(C10=\"Anwesenheit\",C10=\"Wochenende\"),L10<>\"\"),L10-O10,IF(AND(C10=\"Fehlzeit\",N10<>\"\",W10=\"Ja\"),N10-O10,IF(W10=\"Ja\",-O10,\"\")))","v":""},{"$f":"IF(P10=\"\",B7,B7+P10)","v":{"v":0,"d":"0.00"}},null,{"$f":"IF(COUNTIF(Allgemein!$H$8:$H$45,A10)>0,\"Feiertag\",\"\")","v":"Feiertag"},{"$f":"IFERROR(VLOOKUP(A10,Allgemein!$H$8:$I$45,2,FALSE),\"\")","v":{"v":1,"d":"1.00"}},{"$f":"VLOOKUP(B10,Personalstamm!$D$8:$F$14,3,FALSE)","v":{"v":0,"d":"0.00"}},{"$f":"IF(M10=\"Gleittag\",ABS(P10),\"\")","v":""},{"$f":"IF(A10<=TODAY(),\"Ja\",\"\")","v":""}]
["2026-11-02",{"$f":"TEXT(A11,\"tttt\")","v":"Montag"},{"$f":"IF(AND(S11=\"Feiertag\",T11>0),\"Fehlzeit\",IF(OR(B11=\"Samstag\",B11=\"Sonntag\"),\"Wochenende\",\"Bitte auswählen\"))","v":"Bitte auswählen"},{"$nulls":5},{"$f":"IF(AND(OR(C11=\"Anwesenheit\",C11=\"Wochenende\"),E11<>\"\",F11<>\"\",W11=\"Ja\"),((F11-E11)+(H11-G11))*24,\"\")","v":""},{"$f":"IF(I11=\"\",\"\",IF(AND(G11<>\"\",H11<>\"\"),(G11-F11)*24,0))","v":""},{"$f":"IF(I11=\"\",\"\",IF(AND(I11<>\"\",J11=\"\",I11>=Personalstamm!$D$20),Personalstamm!$E$20,IF(AND(I11<>\"\",J11=\"\",I11>=Personalstamm!$D$19),Personalstamm!$E$19,IF(AND(I11<>\"\",J11<Personalstamm!$E$20,I11>=Personalstamm!$D$20),Personalstamm!$E$20-J11,IF(AND(I11<>\"\",J11<Personalstamm!E$19,I11>=Personalstamm!$D$19),Personalstamm!$E$19-J11,0)))))","v":""},{"$f":"IF(I11<>\"\",I11-K11,\"\")","v":""},{"$f":"IF(AND(S11=\"Feiertag\",T11>0),\"Feiertag\",IF(C11=\"Fehlzeit\",\"Bitte auswählen\",\"\"))","v":""},{"$f":"IF(OR(M11=\"\",M11=\"Bitte auswählen\"),\"\",IF(M11=\"Feiertag\",T11*U11,IF(M11=\"Gleittag\",0,VLOOKUP(B11,Personalstamm!$D$8:$F$14,3,FALSE))))","v":""},{"$f":"VLOOKUP(B11,Personalstamm!$D$8:$E$14,2,FALSE)","v":{"v":8,"d":"8.00"}},{"$f":"IF(AND(OR(C11=\"Anwesenheit\",C11=\"Wochenende\"),L11<>\"\"),L11-O11,IF(AND(C11=\"Fehlzeit\",N11<>\"\",W11=\"Ja\"),N11-O11,IF(W11=\"Ja\",-O11,\"\")))","v":""},{"$f":"IF(P11=\"\",Q10,Q10+P11)","v":{"v":0,"d":"0.00"}},null,{"$f":"IF(COUNTIF(Allgemein!$H$8:$H$45,A11)>0,\"Feiertag\",\"\")","v":"Feiertag"},{"$f":"IFERROR(VLOOKUP(A11,Allgemein!$H$8:$I$45,2,FALSE),\"\")","v":{"v":0,"d":"0.00"}},{"$f":"VLOOKUP(B11,Personalstamm!$D$8:$F$14,3,FALSE)","v":{"v":8,"d":"8.00"}},{"$f":"IF(M11=\"Gleittag\",ABS(P11),\"\")","v":""},{"$f":"IF(A11<=TODAY(),\"Ja\",\"\")","v":""}]
["2026-11-03","Dienstag","Bitte auswählen",{"$nulls":5},"","",{"$f":"IF(I12=\"\",\"\",IF(AND(I12<>\"\",J12=\"\",I12>=Personalstamm!$D$20),Personalstamm!$E$20,IF(AND(I12<>\"\",J12=\"\",I12>=Personalstamm!$D$19),Personalstamm!$E$19,IF(AND(I12<>\"\",J12<Personalstamm!$E$20,I12>=Personalstamm!$D$20),Personalstamm!$E$20-J12,IF(AND(I12<>\"\",J12<Personalstamm!E$19,I12>=Personalstamm!$D$19),Personalstamm!$E$19-J12,0)))))","v":""},"","",{"$f":"IF(OR(M12=\"\",M12=\"Bitte auswählen\"),\"\",IF(M12=\"Feiertag\",T12*U12,IF(M12=\"Gleittag\",0,VLOOKUP(B12,Personalstamm!$D$8:$F$14,3,FALSE))))","v":""},{"$f":"VLOOKUP(B12,Personalstamm!$D$8:$E$14,2,FALSE)","v":{"v":8,"d":"8.00"}},"",{"$f":"IF(P12=\"\",Q11,Q11+P12)","v":{"v":0,"d":"0.00"}},null,{"$f":"IF(COUNTIF(Allgemein!$H$8:$H$45,A12)>0,\"Feiertag\",\"\")","v":""},{"$f":"IFERROR(VLOOKUP(A12,Allgemein!$H$8:$I$45,2,FALSE),\"\")","v":""},{"$f":"VLOOKUP(B12,Personalstamm!$D$8:$F$14,3,FALSE)","v":{"v":8,"d":"8.00"}},"",""]
["2026-11-04","Mittwoch","Bitte auswählen",{"$nulls":5},"","",{"$f":"IF(I13=\"\",\"\",IF(AND(I13<>\"\",J13=\"\",I13>=Personalstamm!$D$20),Personalstamm!$E$20,IF(AND(I13<>\"\",J13=\"\",I13>=Personalstamm!$D$19),Personalstamm!$E$19,IF(AND(I13<>\"\",J13<Personalstamm!$E$20,I13>=Personalstamm!$D$20),Personalstamm!$E$20-J13,IF(AND(I13<>\"\",J13<Personalstamm!E$19,I13>=Personalstamm!$D$19),Personalstamm!$E$19-J13,0)))))","v":""},"","",{"$f":"IF(OR(M13=\"\",M13=\"Bitte auswählen\"),\"\",IF(M13=\"Feiertag\",T13*U13,IF(M13=\"Gleittag\",0,VLOOKUP(B13,Personalstamm!$D$8:$F$14,3,FALSE))))","v":""},{"$f":"VLOOKUP(B13,Personalstamm!$D$8:$E$14,2,FALSE)","v":{"v":8,"d":"8.00"}},"",{"v":0,"d":"0.00"},null,{"$f":"IF(COUNTIF(Allgemein!$H$8:$H$45,A13)>0,\"Feiertag\",\"\")","v":""},{"$f":"IFERROR(VLOOKUP(A13,Allgemein!$H$8:$I$45,2,FALSE),\"\")","v":""},{"$f":"VLOOKUP(B13,Personalstamm!$D$8:$F$14,3,FALSE)","v":{"v":8,"d":"8.00"}},"",""]
["2026-11-05","Donnerstag","Bitte auswählen",{"$nulls":5},"","",{"$f":"IF(I14=\"\",\"\",IF(AND(I14<>\"\",J14=\"\",I14>=Personalstamm!$D$20),Personalstamm!$E$20,IF(AND(I14<>\"\",J14=\"\",I14>=Personalstamm!$D$19),Personalstamm!$E$19,IF(AND(I14<>\"\",J14<Personalstamm!$E$20,I14>=Personalstamm!$D$20),Personalstamm!$E$20-J14,IF(AND(I14<>\"\",J14<Personalstamm!E$19,I14>=Personalstamm!$D$19),Personalstamm!$E$19-J14,0)))))","v":""},"","",{"$f":"IF(OR(M14=\"\",M14=\"Bitte auswählen\"),\"\",IF(M14=\"Feiertag\",T14*U14,IF(M14=\"Gleittag\",0,VLOOKUP(B14,Personalstamm!$D$8:$F$14,3,FALSE))))","v":""},{"$f":"VLOOKUP(B14,Personalstamm!$D$8:$E$14,2,FALSE)","v":{"v":8,"d":"8.00"}},"",{"v":0,"d":"0.00"},null,{"$f":"IF(COUNTIF(Allgemein!$H$8:$H$45,A14)>0,\"Feiertag\",\"\")","v":""},{"$f":"IFERROR(VLOOKUP(A14,Allgemein!$H$8:$I$45,2,FALSE),\"\")","v":""},{"$f":"VLOOKUP(B14,Personalstamm!$D$8:$F$14,3,FALSE)","v":{"v":8,"d":"8.00"}},"",""]
["2026-11-06","Freitag","Bitte auswählen",{"$nulls":5},"","",{"$f":"IF(I15=\"\",\"\",IF(AND(I15<>\"\",J15=\"\",I15>=Personalstamm!$D$20),Personalstamm!$E$20,IF(AND(I15<>\"\",J15=\"\",I15>=Personalstamm!$D$19),Personalstamm!$E$19,IF(AND(I15<>\"\",J15<Personalstamm!$E$20,I15>=Personalstamm!$D$20),Personalstamm!$E$20-J15,IF(AND(I15<>\"\",J15<Personalstamm!E$19,I15>=Personalstamm!$D$19),Personalstamm!$E$19-J15,0)))))","v":""},"","",{"$f":"IF(OR(M15=\"\",M15=\"Bitte auswählen\"),\"\",IF(M15=\"Feiertag\",T15*U15,IF(M15=\"Gleittag\",0,VLOOKUP(B15,Personalstamm!$D$8:$F$14,3,FALSE))))","v":""},{"$f":"VLOOKUP(B15,Personalstamm!$D$8:$E$14,2,FALSE)","v":{"v":8,"d":"8.00"}},"",{"v":0,"d":"0.00"},null,{"$f":"IF(COUNTIF(Allgemein!$H$8:$H$45,A15)>0,\"Feiertag\",\"\")","v":""},{"$f":"IFERROR(VLOOKUP(A15,Allgemein!$H$8:$I$45,2,FALSE),\"\")","v":""},{"$f":"VLOOKUP(B15,Personalstamm!$D$8:$F$14,3,FALSE)","v":{"v":8,"d":"8.00"}},"",""]
["2026-11-07","Samstag","Wochenende",{"$nulls":5},"","",{"$f":"IF(I16=\"\",\"\",IF(AND(I16<>\"\",J16=\"\",I16>=Personalstamm!$D$20),Personalstamm!$E$20,IF(AND(I16<>\"\",J16=\"\",I16>=Personalstamm!$D$19),Personalstamm!$E$19,IF(AND(I16<>\"\",J16<Personalstamm!$E$20,I16>=Personalstamm!$D$20),Personalstamm!$E$20-J16,IF(AND(I16<>\"\",J16<Personalstamm!E$19,I16>=Personalstamm!$D$19),Personalstamm!$E$19-J16,0)))))","v":""},"","",{"$f":"IF(OR(M16=\"\",M16=\"Bitte auswählen\"),\"\",IF(M16=\"Feiertag\",T16*U16,IF(M16=\"Gleittag\",0,VLOOKUP(B16,Personalstamm!$D$8:$F$14,3,FALSE))))","v":""},{"$f":"VLOOKUP(B16,Personalstamm!$D$8:$E$14,2,FALSE)","v":{"v":0,"d":"0.00"}},"",{"v":0,"d":"0.00"},null,{"$f":"IF(COUNTIF(Allgemein!$H$8:$H$45,A16)>0,\"Feiertag\",\"\")","v":""},{"$f":"IFERROR(VLOOKUP(A16,Allgemein!$H$8:$I$45,2,FALSE),\"\")","v":""},{"$f":"VLOOKUP(B16,Personalstamm!$D$8:$F$14,3,FALSE)","v":{"v":0,"d":"0.00"}},"",""]
["2026-11-08","Sonntag","Wochenende",{"$nulls":5},"","",{"$f":"IF(I17=\"\",\"\",IF(AND(I17<>\"\",J17=\"\",I17>=Personalstamm!$D$20),Personalstamm!$E$20,IF(AND(I17<>\"\",J17=\"\",I17>=Personalstamm!$D$19),Personalstamm!$E$19,IF(AND(I17<>\"\",J17<Personalstamm!$E$20,I17>=Personalstamm!$D$20),Personalstamm!$E$20-J17,IF(AND(I17<>\"\",J17<Personalstamm!E$19,I17>=Personalstamm!$D$19),Personalstamm!$E$19-J17,0)))))","v":""},"","",{"$f":"IF(OR(M17=\"\",M17=\"Bitte auswählen\"),\"\",IF(M17=\"Feiertag\",T17*U17,IF(M17=\"Gleittag\",0,VLOOKUP(B17,Personalstamm!$D$8:$F$14,3,FALSE))))","v":""},{"$f":"VLOOKUP(B17,Personalstamm!$D$8:$E$14,2,FALSE)","v":{"v":0,"d":"0.00"}},"",{"v":0,"d":"0.00"},null,{"$f":"IF(COUNTIF(Allgemein!$H$8:$H$45,A17)>0,\"Feiertag\",\"\")","v":""},{"$f":"IFERROR(VLOOKUP(A17,Allgemein!$H$8:$I$45,2,FALSE),\"\")","v":""},{"$f":"VLOOKUP(B17,Personalstamm!$D$8:$F$14,3,FALSE)","v":{"v":0,"d":"0.00"}},"",""]
["2026-11-09","Montag","Bitte auswählen",{"$nulls":5},"","",{"$f":"IF(I18=\"\",\"\",IF(AND(I18<>\"\",J18=\"\",I18>=Personalstamm!$D$20),Personalstamm!$E$20,IF(AND(I18<>\"\",J18=\"\",I18>=Personalstamm!$D$19),Personalstamm!$E$19,IF(AND(I18<>\"\",J18<Personalstamm!$E$20,I18>=Personalstamm!$D$20),Personalstamm!$E$20-J18,IF(AND(I18<>\"\",J18<Personalstamm!E$19,I18>=Personalstamm!$D$19),Personalstamm!$E$19-J18,0)))))","v":""},"","",{"$f":"IF(OR(M18=\"\",M18=\"Bitte auswählen\"),\"\",IF(M18=\"Feiertag\",T18*U18,IF(M18=\"Gleittag\",0,VLOOKUP(B18,Personalstamm!$D$8:$F$14,3,FALSE))))","v":""},{"$f":"VLOOKUP(B18,Personalstamm!$D$8:$E$14,2,FALSE)","v":{"v":8,"d":"8.00"}},"",{"v":0,"d":"0.00"},null,{"$f":"IF(COUNTIF(Allgemein!$H$8:$H$45,A18)>0,\"Feiertag\",\"\")","v":""},{"$f":"IFERROR(VLOOKUP(A18,Allgemein!$H$8:$I$45,2,FALSE),\"\")","v":""},{"$f":"VLOOKUP(B18,Personalstamm!$D$8:$F$14,3,FALSE)","v":{"v":8,"d":"8.00"}},"",""]
["2026-11-10","Dienstag","Bitte auswählen",{"$nulls":5},"","",{"$f":"IF(I19=\"\",\"\",IF(AND(I19<>\"\",J19=\"\",I19>=Personalstamm!$D$20),Personalstamm!$E$20,IF(AND(I19<>\"\",J19=\"\",I19>=Personalstamm!$D$19),Personalstamm!$E$19,IF(AND(I19<>\"\",J19<Personalstamm!$E$20,I19>=Personalstamm!$D$20),Personalstamm!$E$20-J19,IF(AND(I19<>\"\",J19<Personalstamm!E$19,I19>=Personalstamm!$D$19),Personalstamm!$E$19-J19,0)))))","v":""},"","",{"$f":"IF(OR(M19=\"\",M19=\"Bitte auswählen\"),\"\",IF(M19=\"Feiertag\",T19*U19,IF(M19=\"Gleittag\",0,VLOOKUP(B19,Personalstamm!$D$8:$F$14,3,FALSE))))","v":""},{"$f":"VLOOKUP(B19,Personalstamm!$D$8:$E$14,2,FALSE)","v":{"v":8,"d":"8.00"}},"",{"v":0,"d":"0.00"},null,{"$f":"IF(COUNTIF(Allgemein!$H$8:$H$45,A19)>0,\"Feiertag\",\"\")","v":""},{"$f":"IFERROR(VLOOKUP(A19,Allgemein!$H$8:$I$45,2,FALSE),\"\")","v":""},{"$f":"VLOOKUP(B19,Personalstamm!$D$8:$F$14,3,FALSE)","v":{"v":8,"d":"8.00"}},"",""]
["2026-11-11","Mittwoch","Bitte auswählen",{"$nulls":5},"","",{"$f":"IF(I20=\"\",\"\",IF(AND(I20<>\"\",J20=\"\",I20>=Personalstamm!$D$20),Personalstamm!$E$20,IF(AND(I20<>\"\",J20=\"\",I20>=Personalstamm!$D$19),Personalstamm!$E$19,IF(AND(I20<>\"\",J20<Personalstamm!$E$20,I20>=Personalstamm!$D$20),Personalstamm!$E$20-J20,IF(AND(I20<>\"\",J20<Personalstamm!E$19,I20>=Personalstamm!$D$19),Personalstamm!$E$19-J20,0)))))","v":""},"","",{"$f":"IF(OR(M20=\"\",M20=\"Bitte auswählen\"),\"\",IF(M20=\"Feiertag\",T20*U20,IF(M20=\"Gleittag\",0,VLOOKUP(B20,Personalstamm!$D$8:$F$14,3,FALSE))))","v":""},{"$f":"VLOOKUP(B20,Personalstamm!$D$8:$E$14,2,FALSE)","v":{"v":8,"d":"8.00"}},"",{"v":0,"d":"0.00"},null,{"$f":"IF(COUNTIF(Allgemein!$H$8:$H$45,A20)>0,\"Feiertag\",\"\")","v":""},{"$f":"IFERROR(VLOOKUP(A20,Allgemein!$H$8:$I$45,2,FALSE),\"\")","v":""},{"$f":"VLOOKUP(B20,Personalstamm!$D$8:$F$14,3,FALSE)","v":{"v":8,"d":"8.00"}},"",""]
["2026-11-12","Donnerstag","Bitte auswählen",{"$nulls":5},"","",{"$f":"IF(I21=\"\",\"\",IF(AND(I21<>\"\",J21=\"\",I21>=Personalstamm!$D$20),Personalstamm!$E$20,IF(AND(I21<>\"\",J21=\"\",I21>=Personalstamm!$D$19),Personalstamm!$E$19,IF(AND(I21<>\"\",J21<Personalstamm!$E$20,I21>=Personalstamm!$D$20),Personalstamm!$E$20-J21,IF(AND(I21<>\"\",J21<Personalstamm!E$19,I21>=Personalstamm!$D$19),Personalstamm!$E$19-J21,0)))))","v":""},"","",{"$f":"IF(OR(M21=\"\",M21=\"Bitte auswählen\"),\"\",IF(M21=\"Feiertag\",T21*U21,IF(M21=\"Gleittag\",0,VLOOKUP(B21,Personalstamm!$D$8:$F$14,3,FALSE))))","v":""},{"$f":"VLOOKUP(B21,Personalstamm!$D$8:$E$14,2,FALSE)","v":{"v":8,"d":"8.00"}},"",{"v":0,"d":"0.00"},null,{"$f":"IF(COUNTIF(Allgemein!$H$8:$H$45,A21)>0,\"Feiertag\",\"\")","v":""},{"$f":"IFERROR(VLOOKUP(A21,Allgemein!$H$8:$I$45,2,FALSE),\"\")","v":""},{"$f":"VLOOKUP(B21,Personalstamm!$D$8:$F$14,3,FALSE)","v":{"v":8,"d":"8.00"}},"",""]
["2026-11-13","Freitag","Bitte auswählen",{"$nulls":5},"","",{"$f":"IF(I22=\"\",\"\",IF(AND(I22<>\"\",J22=\"\",I22>=Personalstamm!$D$20),Personalstamm!$E$20,IF(AND(I22<>\"\",J22=\"\",I22>=Personalstamm!$D$19),Personalstamm!$E$19,IF(AND(I22<>\"\",J22<Personalstamm!$E$20,I22>=Personalstamm!$D$20),Personalstamm!$E$20-J22,IF(AND(I22<>\"\",J22<Personalstamm!E$19,I22>=Personalstamm!$D$19),Personalstamm!$E$19-J22,0)))))","v":""},"","",{"$f":"IF(OR(M22=\"\",M22=\"Bitte auswählen\"),\"\",IF(M22=\"Feiertag\",T22*U22,IF(M22=\"Gleittag\",0,VLOOKUP(B22,Personalstamm!$D$8:$F$14,3,FALSE))))","v":""},{"$f":"VLOOKUP(B22,Personalstamm!$D$8:$E$14,2,FALSE)","v":{"v":8,"d":"8.00"}},"",{"v":0,"d":"0.00"},null,{"$f":"IF(COUNTIF(Allgemein!$H$8:$H$45,A22)>0,\"Feiertag\",\"\")","v":""},{"$f":"IFERROR(VLOOKUP(A22,Allgemein!$H$8:$I$45,2,FALSE),\"\")","v":""},{"$f":"VLOOKUP(B22,Personalstamm!$D$8:$F$14,3,FALSE)","v":{"v":8,"d":"8.00"}},"",""]
["2026-11-14","Samstag","Wochenende",{"$nulls":5},"","",{"$f":"IF(I23=\"\",\"\",IF(AND(I23<>\"\",J23=\"\",I23>=Personalstamm!$D$20),Personalstamm!$E$20,IF(AND(I23<>\"\",J23=\"\",I23>=Personalstamm!$D$19),Personalstamm!$E$19,IF(AND(I23<>\"\",J23<Personalstamm!$E$20,I23>=Personalstamm!$D$20),Personalstamm!$E$20-J23,IF(AND(I23<>\"\",J23<Personalstamm!E$19,I23>=Personalstamm!$D$19),Personalstamm!$E$19-J23,0)))))","v":""},"","",{"$f":"IF(OR(M23=\"\",M23=\"Bitte auswählen\"),\"\",IF(M23=\"Feiertag\",T23*U23,IF(M23=\"Gleittag\",0,VLOOKUP(B23,Personalstamm!$D$8:$F$14,3,FALSE))))","v":""},{"$f":"VLOOKUP(B23,Personalstamm!$D$8:$E$14,2,FALSE)","v":{"v":0,"d":"0.00"}},"",{"v":0,"d":"0.00"},null,{"$f":"IF(COUNTIF(Allgemein!$H$8:$H$45,A23)>0,\"Feiertag\",\"\")","v":""},{"$f":"IFERROR(VLOOKUP(A23,Allgemein!$H$8:$I$45,2,FALSE),\"\")","v":""},{"$f":"VLOOKUP(B23,Personalstamm!$D$8:$F$14,3,FALSE)","v":{"v":0,"d":"0.00"}},"",""]
["2026-11-15","Sonntag","Wochenende",{"$nulls":5},"","",{"$f":"IF(I24=\"\",\"\",IF(AND(I24<>\"\",J24=\"\",I24>=Personalstamm!$D$20),Personalstamm!$E$20,IF(AND(I24<>\"\",J24=\"\",I24>=Personalstamm!$D$19),Personalstamm!$E$19,IF(AND(I24<>\"\",J24<Personalstamm!$E$20,I24>=Personalstamm!$D$20),Personalstamm!$E$20-J24,IF(AND(I24<>\"\",J24<Personalstamm!E$19,I24>=Personalstamm!$D$19),Personalstamm!$E$19-J24,0)))))","v":""},"","",{"$f":"IF(OR(M24=\"\",M24=\"Bitte auswählen\"),\"\",IF(M24=\"Feiertag\",T24*U24,IF(M24=\"Gleittag\",0,VLOOKUP(B24,Personalstamm!$D$8:$F$14,3,FALSE))))","v":""},{"$f":"VLOOKUP(B24,Personalstamm!$D$8:$E$14,2,FALSE)","v":{"v":0,"d":"0.00"}},"",{"v":0,"d":"0.00"},null,{"$f":"IF(COUNTIF(Allgemein!$H$8:$H$45,A24)>0,\"Feiertag\",\"\")","v":"Feiertag"},{"$f":"IFERROR(VLOOKUP(A24,Allgemein!$H$8:$I$45,2,FALSE),\"\")","v":{"v":0,"d":"0.00"}},{"$f":"VLOOKUP(B24,Personalstamm!$D$8:$F$14,3,FALSE)","v":{"v":0,"d":"0.00"}},"",""]
["2026-11-16","Montag","Bitte auswählen",{"$nulls":5},"","",{"$f":"IF(I25=\"\",\"\",IF(AND(I25<>\"\",J25=\"\",I25>=Personalstamm!$D$20),Personalstamm!$E$20,IF(AND(I25<>\"\",J25=\"\",I25>=Personalstamm!$D$19),Personalstamm!$E$19,IF(AND(I25<>\"\",J25<Personalstamm!$E$20,I25>=Personalstamm!$D$20),Personalstamm!$E$20-J25,IF(AND(I25<>\"\",J25<Personalstamm!E$19,I25>=Personalstamm!$D$19),Personalstamm!$E$19-J25,0)))))","v":""},"","",{"$f":"IF(OR(M25=\"\",M25=\"Bitte auswählen\"),\"\",IF(M25=\"Feiertag\",T25*U25,IF(M25=\"Gleittag\",0,VLOOKUP(B25,Personalstamm!$D$8:$F$14,3,FALSE))))","v":""},{"$f":"VLOOKUP(B25,Personalstamm!$D$8:$E$14,2,FALSE)","v":{"v":8,"d":"8.00"}},"",{"v":0,"d":"0.00"},null,{"$f":"IF(COUNTIF(Allgemein!$H$8:$H$45,A25)>0,\"Feiertag\",\"\")","v":""},{"$f":"IFERROR(VLOOKUP(A25,Allgemein!$H$8:$I$45,2,FALSE),\"\")","v":""},{"$f":"VLOOKUP(B25,Personalstamm!$D$8:$F$14,3,FALSE)","v":{"v":8,"d":"8.00"}},"",""]
["2026-11-17","Dienstag","Bitte auswählen",{"$nulls":5},"","",{"$f":"IF(I26=\"\",\"\",IF(AND(I26<>\"\",J26=\"\",I26>=Personalstamm!$D$20),Personalstamm!$E$20,IF(AND(I26<>\"\",J26=\"\",I26>=Personalstamm!$D$19),Personalstamm!$E$19,IF(AND(I26<>\"\",J26<Personalstamm!$E$20,I26>=Personalstamm!$D$20),Personalstamm!$E$20-J26,IF(AND(I26<>\"\",J26<Personalstamm!E$19,I26>=Personalstamm!$D$19),Personalstamm!$E$19-J26,0)))))","v":""},"","",{"$f":"IF(OR(M26=\"\",M26=\"Bitte auswählen\"),\"\",IF(M26=\"Feiertag\",T26*U26,IF(M26=\"Gleittag\",0,VLOOKUP(B26,Personalstamm!$D$8:$F$14,3,FALSE))))","v":""},{"$f":"VLOOKUP(B26,Personalstamm!$D$8:$E$14,2,FALSE)","v":{"v":8,"d":"8.00"}},"",{"v":0,"d":"0.00"},null,{"$f":"IF(COUNTIF(Allgemein!$H$8:$H$45,A26)>0,\"Feiertag\",\"\")","v":""},{"$f":"IFERROR(VLOOKUP(A26,Allgemein!$H$8:$I$45,2,FALSE),\"\")","v":""},{"$f":"VLOOKUP(B26,Personalstamm!$D$8:$F$14,3,FALSE)","v":{"v":8,"d":"8.00"}},"",""]
["2026-11-18","Mittwoch","Bitte auswählen",{"$nulls":5},"","",{"$f":"IF(I27=\"\",\"\",IF(AND(I27<>\"\",J27=\"\",I27>=Personalstamm!$D$20),Personalstamm!$E$20,IF(AND(I27<>\"\",J27=\"\",I27>=Personalstamm!$D$19),Personalstamm!$E$19,IF(AND(I27<>\"\",J27<Personalstamm!$E$20,I27>=Personalstamm!$D$20),Personalstamm!$E$20-J27,IF(AND(I27<>\"\",J27<Personalstamm!E$19,I27>=Personalstamm!$D$19),Personalstamm!$E$19-J27,0)))))","v":""},"","",{"$f":"IF(OR(M27=\"\",M27=\"Bitte auswählen\"),\"\",IF(M27=\"Feiertag\",T27*U27,IF(M27=\"Gleittag\",0,VLOOKUP(B27,Personalstamm!$D$8:$F$14,3,FALSE))))","v":""},{"$f":"VLOOKUP(B27,Personalstamm!$D$8:$E$14,2,FALSE)","v":{"v":8,"d":"8.00"}},"",{"v":0,"d":"0.00"},null,{"$f":"IF(COUNTIF(Allgemein!$H$8:$H$45,A27)>0,\"Feiertag\",\"\")","v":"Feiertag"},{"$f":"IFERROR(VLOOKUP(A27,Allgemein!$H$8:$I$45,2,FALSE),\"\")","v":{"v":0,"d":"0.00"}},{"$f":"VLOOKUP(B27,Personalstamm!$D$8:$F$14,3,FALSE)","v":{"v":8,"d":"8.00"}},"",""]
["2026-11-19","Donnerstag","Bitte auswählen",{"$nulls":5},"","",{"$f":"IF(I28=\"\",\"\",IF(AND(I28<>\"\",J28=\"\",I28>=Personalstamm!$D$20),Personalstamm!$E$20,IF(AND(I28<>\"\",J28=\"\",I28>=Personalstamm!$D$19),Personalstamm!$E$19,IF(AND(I28<>\"\",J28<Personalstamm!$E$20,I28>=Personalstamm!$D$20),Personalstamm!$E$20-J28,IF(AND(I28<>\"\",J28<Personalstamm!E$19,I28>=Personalstamm!$D$19),Personalstamm!$E$19-J28,0)))))","v":""},"","",{"$f":"IF(OR(M28=\"\",M28=\"Bitte auswählen\"),\"\",IF(M28=\"Feiertag\",T28*U28,IF(M28=\"Gleittag\",0,VLOOKUP(B28,Personalstamm!$D$8:$F$14,3,FALSE))))","v":""},{"$f":"VLOOKUP(B28,Personalstamm!$D$8:$E$14,2,FALSE)","v":{"v":8,"d":"8.00"}},"",{"v":0,"d":"0.00"},null,{"$f":"IF(COUNTIF(Allgemein!$H$8:$H$45,A28)>0,\"Feiertag\",\"\")","v":""},{"$f":"IFERROR(VLOOKUP(A28,Allgemein!$H$8:$I$45,2,FALSE),\"\")","v":""},{"$f":"VLOOKUP(B28,Personalstamm!$D$8:$F$14,3,FALSE)","v":{"v":8,"d":"8.00"}},"",""]
["2026-11-20","Freitag","Bitte auswählen",{"$nulls":5},"","",{"$f":"IF(I29=\"\",\"\",IF(AND(I29<>\"\",J29=\"\",I29>=Personalstamm!$D$20),Personalstamm!$E$20,IF(AND(I29<>\"\",J29=\"\",I29>=Personalstamm!$D$19),Personalstamm!$E$19,IF(AND(I29<>\"\",J29<Personalstamm!$E$20,I29>=Personalstamm!$D$20),Personalstamm!$E$20-J29,IF(AND(I29<>\"\",J29<Personalstamm!E$19,I29>=Personalstamm!$D$19),Personalstamm!$E$19-J29,0)))))","v":""},"","",{"$f":"IF(OR(M29=\"\",M29=\"Bitte auswählen\"),\"\",IF(M29=\"Feiertag\",T29*U29,IF(M29=\"Gleittag\",0,VLOOKUP(B29,Personalstamm!$D$8:$F$14,3,FALSE))))","v":""},{"$f":"VLOOKUP(B29,Personalstamm!$D$8:$E$14,2,FALSE)","v":{"v":8,"d":"8.00"}},"",{"v":0,"d":"0.00"},null,{"$f":"IF(COUNTIF(Allgemein!$H$8:$H$45,A29)>0,\"Feiertag\",\"\")","v":""},{"$f":"IFERROR(VLOOKUP(A29,Allgemein!$H$8:$I$45,2,FALSE),\"\")","v":""},{"$f":"VLOOKUP(B29,Personalstamm!$D$8:$F$14,3,FALSE)","v":{"v":8,"d":"8.00"}},"",""]
["2026-11-21","Samstag","Wochenende",{"$nulls":5},"","",{"$f":"IF(I30=\"\",\"\",IF(AND(I30<>\"\",J30=\"\",I30>=Personalstamm!$D$20),Personalstamm!$E$20,IF(AND(I30<>\"\",J30=\"\",I30>=Personalstamm!$D$19),Personalstamm!$E$19,IF(AND(I30<>\"\",J30<Personalstamm!$E$20,I30>=Personalstamm!$D$20),Personalstamm!$E$20-J30,IF(AND(I30<>\"\",J30<Personalstamm!E$19,I30>=Personalstamm!$D$19),Personalstamm!$E$19-J30,0)))))","v":""},"","",{"$f":"IF(OR(M30=\"\",M30=\"Bitte auswählen\"),\"\",IF(M30=\"Feiertag\",T30*U30,IF(M30=\"Gleittag\",0,VLOOKUP(B30,Personalstamm!$D$8:$F$14,3,FALSE))))","v":""},{"$f":"VLOOKUP(B30,Personalstamm!$D$8:$E$14,2,FALSE)","v":{"v":0,"d":"0.00"}},"",{"v":0,"d":"0.00"},null,{"$f":"IF(COUNTIF(Allgemein!$H$8:$H$45,A30)>0,\"Feiertag\",\"\")","v":""},{"$f":"IFERROR(VLOOKUP(A30,Allgemein!$H$8:$I$45,2,FALSE),\"\")","v":""},{"$f":"VLOOKUP(B30,Personalstamm!$D$8:$F$14,3,FALSE)","v":{"v":0,"d":"0.00"}},"",""]
["2026-11-22","Sonntag","Wochenende",{"$nulls":5},"","",{"$f":"IF(I31=\"\",\"\",IF(AND(I31<>\"\",J31=\"\",I31>=Personalstamm!$D$20),Personalstamm!$E$20,IF(AND(I31<>\"\",J31=\"\",I31>=Personalstamm!$D$19),Personalstamm!$E$19,IF(AND(I31<>\"\",J31<Personalstamm!$E$20,I31>=Personalstamm!$D$20),Personalstamm!$E$20-J31,IF(AND(I31<>\"\",J31<Personalstamm!E$19,I31>=Personalstamm!$D$19),Personalstamm!$E$19-J31,0)))))","v":""},"","",{"$f":"IF(OR(M31=\"\",M31=\"Bitte auswählen\"),\"\",IF(M31=\"Feiertag\",T31*U31,IF(M31=\"Gleittag\",0,VLOOKUP(B31,Personalstamm!$D$8:$F$14,3,FALSE))))","v":""},{"$f":"VLOOKUP(B31,Personalstamm!$D$8:$E$14,2,FALSE)","v":{"v":0,"d":"0.00"}},"",{"v":0,"d":"0.00"},null,{"$f":"IF(COUNTIF(Allgemein!$H$8:$H$45,A31)>0,\"Feiertag\",\"\")","v":"Feiertag"},{"$f":"IFERROR(VLOOKUP(A31,Allgemein!$H$8:$I$45,2,FALSE),\"\")","v":{"v":0,"d":"0.00"}},{"$f":"VLOOKUP(B31,Personalstamm!$D$8:$F$14,3,FALSE)","v":{"v":0,"d":"0.00"}},"",""]
["2026-11-23","Montag","Bitte auswählen",{"$nulls":5},"","",{"$f":"IF(I32=\"\",\"\",IF(AND(I32<>\"\",J32=\"\",I32>=Personalstamm!$D$20),Personalstamm!$E$20,IF(AND(I32<>\"\",J32=\"\",I32>=Personalstamm!$D$19),Personalstamm!$E$19,IF(AND(I32<>\"\",J32<Personalstamm!$E$20,I32>=Personalstamm!$D$20),Personalstamm!$E$20-J32,IF(AND(I32<>\"\",J32<Personalstamm!E$19,I32>=Personalstamm!$D$19),Personalstamm!$E$19-J32,0)))))","v":""},"","",{"$f":"IF(OR(M32=\"\",M32=\"Bitte auswählen\"),\"\",IF(M32=\"Feiertag\",T32*U32,IF(M32=\"Gleittag\",0,VLOOKUP(B32,Personalstamm!$D$8:$F$14,3,FALSE))))","v":""},{"$f":"VLOOKUP(B32,Personalstamm!$D$8:$E$14,2,FALSE)","v":{"v":8,"d":"8.00"}},"",{"v":0,"d":"0.00"},null,{"$f":"IF(COUNTIF(Allgemein!$H$8:$H$45,A32)>0,\"Feiertag\",\"\")","v":""},{"$f":"IFERROR(VLOOKUP(A32,Allgemein!$H$8:$I$45,2,FALSE),\"\")","v":""},{"$f":"VLOOKUP(B32,Personalstamm!$D$8:$F$14,3,FALSE)","v":{"v":8,"d":"8.00"}},"",""]
["2026-11-24","Dienstag","Bitte auswählen",{"$nulls":5},"","",{"$f":"IF(I33=\"\",\"\",IF(AND(I33<>\"\",J33=\"\",I33>=Personalstamm!$D$20),Personalstamm!$E$20,IF(AND(I33<>\"\",J33=\"\",I33>=Personalstamm!$D$19),Personalstamm!$E$19,IF(AND(I33<>\"\",J33<Personalstamm!$E$20,I33>=Personalstamm!$D$20),Personalstamm!$E$20-J33,IF(AND(I33<>\"\",J33<Personalstamm!E$19,I33>=Personalstamm!$D$19),Personalstamm!$E$19-J33,0)))))","v":""},"","",{"$f":"IF(OR(M33=\"\",M33=\"Bitte auswählen\"),\"\",IF(M33=\"Feiertag\",T33*U33,IF(M33=\"Gleittag\",0,VLOOKUP(B33,Personalstamm!$D$8:$F$14,3,FALSE))))","v":""},{"$f":"VLOOKUP(B33,Personalstamm!$D$8:$E$14,2,FALSE)","v":{"v":8,"d":"8.00"}},"",{"v":0,"d":"0.00"},null,{"$f":"IF(COUNTIF(Allgemein!$H$8:$H$45,A33)>0,\"Feiertag\",\"\")","v":""},{"$f":"IFERROR(VLOOKUP(A33,Allgemein!$H$8:$I$45,2,FALSE),\"\")","v":""},{"$f":"VLOOKUP(B33,Personalstamm!$D$8:$F$14,3,FALSE)","v":{"v":8,"d":"8.00"}},"",""]
["2026-11-25","Mittwoch","Bitte auswählen",{"$nulls":5},"","",{"$f":"IF(I34=\"\",\"\",IF(AND(I34<>\"\",J34=\"\",I34>=Personalstamm!$D$20),Personalstamm!$E$20,IF(AND(I34<>\"\",J34=\"\",I34>=Personalstamm!$D$19),Personalstamm!$E$19,IF(AND(I34<>\"\",J34<Personalstamm!$E$20,I34>=Personalstamm!$D$20),Personalstamm!$E$20-J34,IF(AND(I34<>\"\",J34<Personalstamm!E$19,I34>=Personalstamm!$D$19),Personalstamm!$E$19-J34,0)))))","v":""},"","",{"$f":"IF(OR(M34=\"\",M34=\"Bitte auswählen\"),\"\",IF(M34=\"Feiertag\",T34*U34,IF(M34=\"Gleittag\",0,VLOOKUP(B34,Personalstamm!$D$8:$F$14,3,FALSE))))","v":""},{"$f":"VLOOKUP(B34,Personalstamm!$D$8:$E$14,2,FALSE)","v":{"v":8,"d":"8.00"}},"",{"v":0,"d":"0.00"},null,{"$f":"IF(COUNTIF(Allgemein!$H$8:$H$45,A34)>0,\"Feiertag\",\"\")","v":""},{"$f":"IFERROR(VLOOKUP(A34,Allgemein!$H$8:$I$45,2,FALSE),\"\")","v":""},{"$f":"VLOOKUP(B34,Personalstamm!$D$8:$F$14,3,FALSE)","v":{"v":8,"d":"8.00"}},"",""]
["2026-11-26","Donnerstag","Bitte auswählen",{"$nulls":5},"","",{"$f":"IF(I35=\"\",\"\",IF(AND(I35<>\"\",J35=\"\",I35>=Personalstamm!$D$20),Personalstamm!$E$20,IF(AND(I35<>\"\",J35=\"\",I35>=Personalstamm!$D$19),Personalstamm!$E$19,IF(AND(I35<>\"\",J35<Personalstamm!$E$20,I35>=Personalstamm!$D$20),Personalstamm!$E$20-J35,IF(AND(I35<>\"\",J35<Personalstamm!E$19,I35>=Personalstamm!$D$19),Personalstamm!$E$19-J35,0)))))","v":""},"","",{"$f":"IF(OR(M35=\"\",M35=\"Bitte auswählen\"),\"\",IF(M35=\"Feiertag\",T35*U35,IF(M35=\"Gleittag\",0,VLOOKUP(B35,Personalstamm!$D$8:$F$14,3,FALSE))))","v":""},{"$f":"VLOOKUP(B35,Personalstamm!$D$8:$E$14,2,FALSE)","v":{"v":8,"d":"8.00"}},"",{"v":0,"d":"0.00"},null,{"$f":"IF(COUNTIF(Allgemein!$H$8:$H$45,A35)>0,\"Feiertag\",\"\")","v":""},{"$f":"IFERROR(VLOOKUP(A35,Allgemein!$H$8:$I$45,2,FALSE),\"\")","v":""},{"$f":"VLOOKUP(B35,Personalstamm!$D$8:$F$14,3,FALSE)","v":{"v":8,"d":"8.00"}},"",""]
["2026-11-27","Freitag","Bitte auswählen",{"$nulls":5},"","",{"$f":"IF(I36=\"\",\"\",IF(AND(I36<>\"\",J36=\"\",I36>=Personalstamm!$D$20),Personalstamm!$E$20,IF(AND(I36<>\"\",J36=\"\",I36>=Personalstamm!$D$19),Personalstamm!$E$19,IF(AND(I36<>\"\",J36<Personalstamm!$E$20,I36>=Personalstamm!$D$20),Personalstamm!$E$20-J36,IF(AND(I36<>\"\",J36<Personalstamm!E$19,I36>=Personalstamm!$D$19),Personalstamm!$E$19-J36,0)))))","v":""},"","",{"$f":"IF(OR(M36=\"\",M36=\"Bitte auswählen\"),\"\",IF(M36=\"Feiertag\",T36*U36,IF(M36=\"Gleittag\",0,VLOOKUP(B36,Personalstamm!$D$8:$F$14,3,FALSE))))","v":""},{"$f":"VLOOKUP(B36,Personalstamm!$D$8:$E$14,2,FALSE)","v":{"v":8,"d":"8.00"}},"",{"v":0,"d":"0.00"},null,{"$f":"IF(COUNTIF(Allgemein!$H$8:$H$45,A36)>0,\"Feiertag\",\"\")","v":""},{"$f":"IFERROR(VLOOKUP(A36,Allgemein!$H$8:$I$45,2,FALSE),\"\")","v":""},{"$f":"VLOOKUP(B36,Personalstamm!$D$8:$F$14,3,FALSE)","v":{"v":8,"d":"8.00"}},"",""]
["2026-11-28","Samstag","Wochenende",{"$nulls":5},"","",{"$f":"IF(I37=\"\",\"\",IF(AND(I37<>\"\",J37=\"\",I37>=Personalstamm!$D$20),Personalstamm!$E$20,IF(AND(I37<>\"\",J37=\"\",I37>=Personalstamm!$D$19),Personalstamm!$E$19,IF(AND(I37<>\"\",J37<Personalstamm!$E$20,I37>=Personalstamm!$D$20),Personalstamm!$E$20-J37,IF(AND(I37<>\"\",J37<Personalstamm!E$19,I37>=Personalstamm!$D$19),Personalstamm!$E$19-J37,0)))))","v":""},"","",{"$f":"IF(OR(M37=\"\",M37=\"Bitte auswählen\"),\"\",IF(M37=\"Feiertag\",T37*U37,IF(M37=\"Gleittag\",0,VLOOKUP(B37,Personalstamm!$D$8:$F$14,3,FALSE))))","v":""},{"$f":"VLOOKUP(B37,Personalstamm!$D$8:$E$14,2,FALSE)","v":{"v":0,"d":"0.00"}},"",{"v":0,"d":"0.00"},null,{"$f":"IF(COUNTIF(Allgemein!$H$8:$H$45,A37)>0,\"Feiertag\",\"\")","v":""},{"$f":"IFERROR(VLOOKUP(A37,Allgemein!$H$8:$I$45,2,FALSE),\"\")","v":""},{"$f":"VLOOKUP(B37,Personalstamm!$D$8:$F$14,3,FALSE)","v":{"v":0,"d":"0.00"}},"",""]
["2026-11-29","Sonntag","Wochenende",{"$nulls":5},"","",{"$f":"IF(I38=\"\",\"\",IF(AND(I38<>\"\",J38=\"\",I38>=Personalstamm!$D$20),Personalstamm!$E$20,IF(AND(I38<>\"\",J38=\"\",I38>=Personalstamm!$D$19),Personalstamm!$E$19,IF(AND(I38<>\"\",J38<Personalstamm!$E$20,I38>=Personalstamm!$D$20),Personalstamm!$E$20-J38,IF(AND(I38<>\"\",J38<Personalstamm!E$19,I38>=Personalstamm!$D$19),Personalstamm!$E$19-J38,0)))))","v":""},"","",{"$f":"IF(OR(M38=\"\",M38=\"Bitte auswählen\"),\"\",IF(M38=\"Feiertag\",T38*U38,IF(M38=\"Gleittag\",0,VLOOKUP(B38,Personalstamm!$D$8:$F$14,3,FALSE))))","v":""},{"$f":"VLOOKUP(B38,Personalstamm!$D$8:$E$14,2,FALSE)","v":{"v":0,"d":"0.00"}},"",{"v":0,"d":"0.00"},null,{"$f":"IF(COUNTIF(Allgemein!$H$8:$H$45,A38)>0,\"Feiertag\",\"\")","v":""},{"$f":"IFERROR(VLOOKUP(A38,Allgemein!$H$8:$I$45,2,FALSE),\"\")","v":""},{"$f":"VLOOKUP(B38,Personalstamm!$D$8:$F$14,3,FALSE)","v":{"v":0,"d":"0.00"}},"",""]
["2026-11-30","Montag","Bitte auswählen",{"$nulls":5},"","",{"$f":"IF(I39=\"\",\"\",IF(AND(I39<>\"\",J39=\"\",I39>=Personalstamm!$D$20),Personalstamm!$E$20,IF(AND(I39<>\"\",J39=\"\",I39>=Personalstamm!$D$19),Personalstamm!$E$19,IF(AND(I39<>\"\",J39<Personalstamm!$E$20,I39>=Personalstamm!$D$20),Personalstamm!$E$20-J39,IF(AND(I39<>\"\",J39<Personalstamm!E$19,I39>=Personalstamm!$D$19),Personalstamm!$E$19-J39,0)))))","v":""},"","",{"$f":"IF(OR(M39=\"\",M39=\"Bitte auswählen\"),\"\",IF(M39=\"Feiertag\",T39*U39,IF(M39=\"Gleittag\",0,VLOOKUP(B39,Personalstamm!$D$8:$F$14,3,FALSE))))","v":""},{"$f":"VLOOKUP(B39,Personalstamm!$D$8:$E$14,2,FALSE)","v":{"v":8,"d":"8.00"}},"",{"v":0,"d":"0.00"},null,{"$f":"IF(COUNTIF(Allgemein!$H$8:$H$45,A39)>0,\"Feiertag\",\"\")","v":""},{"$f":"IFERROR(VLOOKUP(A39,Allgemein!$H$8:$I$45,2,FALSE),\"\")","v":""},{"$f":"VLOOKUP(B39,Personalstamm!$D$8:$F$14,3,FALSE)","v":{"v":8,"d":"8.00"}},"",""]
["Summe",{"$nulls":7},{"$f":"SUM(I10:I39)","v":{"v":0,"d":"0.00"}},{"$f":"SUM(J10:J39)","v":{"v":0,"d":"0.00"}},{"$f":"SUM(K10:K39)","v":{"v":0,"d":"0.00"}},{"$f":"SUM(L10:L39)","v":{"v":0,"d":"0.00"}},null,{"$f":"SUM(N10:N39)","v":{"v":0,"d":"0.00"}},{"$f":"SUM(O10:O39)","v":{"v":168,"d":"168.00"}},{"$f":"SUM(P10:P39)","v":{"v":0,"d":"0.00"}}]
[]
["Art","Anzahl Tage",null,"Fehlzeitenart","Anzahl Tage","Anzahl Stunden",null,"Urlaub genommen","Urlaub geplant"]
["Monat",{"$f":"COUNTIF($C$10:$C$39,\"*\")","v":{"v":30,"d":"30.00"}},null,"Urlaub",{"$f":"COUNTIF($M$10:$M$39,Allgemein!$I$50)","v":{"v":0,"d":"0.00"}},{"$f":"SUMIF($M$10:$M$39,Allgemein!$I$50,$N$10:$N$39)","v":{"v":0,"d":"0.00"}},null,{"$f":"COUNTIFS($A$10:$A$39,\"<\"&TODAY(),$M$10:$M$39,\"Urlaub\")","v":{"v":0,"d":"0.00"}},{"$f":"COUNTIFS($A$10:$A$39,\">=\"&TODAY(),$M$10:$M$39,\"Urlaub\")","v":{"v":0,"d":"0.00"}}]
["Anwesenheit",{"$f":"COUNTIF($C$10:$C$39,Allgemein!$G$50)","v":{"v":0,"d":"0.00"}},null,"Krankheit",{"$f":"COUNTIF($M$10:$M$39,Allgemein!$I$51)","v":{"v":0,"d":"0.00"}},{"$f":"SUMIF($M$10:$M$39,Allgemein!$I$51,$N$10:$N$39)","v":{"v":0,"d":"0.00"}}]
["Fehlzeit",{"$f":"COUNTIF($C$10:$C$39,Allgemein!$G$51)","v":{"v":1,"d":"1.00"}},null,"Kurzarbeit",{"$f":"COUNTIF($M$10:$M$39,Allgemein!$I$52)","v":{"v":0,"d":"0.00"}},{"$f":"SUMIF($M$10:$M$39,Allgemein!$I$52,$N$10:$N$39)","v":{"v":0,"d":"0.00"}}]
["Wochenende",{"$f":"COUNTIF($C$10:$C$39,Allgemein!$G$52)","v":{"v":8,"d":"8.00"}},null,"Mutterschutz",{"$f":"COUNTIF($M$10:$M$39,Allgemein!$I$53)","v":{"v":0,"d":"0.00"}},{"$f":"SUMIF($M$10:$M$39,Allgemein!$I$53,$N$10:$N$39)","v":{"v":0,"d":"0.00"}}]
["Undefiniert",{"$f":"COUNTIF($C$10:$C$39,Allgemein!$G$49)","v":{"v":21,"d":"21.00"}},null,"Fortbildung",{"$f":"COUNTIF($M$10:$M$39,Allgemein!$I$54)","v":{"v":0,"d":"0.00"}},{"$f":"SUMIF($M$10:$M$39,Allgemein!$I$54,$N$10:$N$39)","v":{"v":0,"d":"0.00"}}]
[{"$nulls":3},"Elternzeit",{"$f":"COUNTIF($M$10:$M$39,Allgemein!$I$55)","v":{"v":0,"d":"0.00"}},{"$f":"SUMIF($M$10:$M$39,Allgemein!$I$55,$N$10:$N$39)","v":{"v":0,"d":"0.00"}}]
[{"$nulls":3},"Gleittag",{"$f":"COUNTIF($M$10:$M$39,Allgemein!$I$56)","v":{"v":0,"d":"0.00"}},{"$f":"SUMIF($M$10:$M$39,Allgemein!$I$56,$V$10:$V$39)","v":{"v":0,"d":"0.00"}}]
[{"$nulls":3},"Schule",{"$f":"COUNTIF($M$10:$M$39,Allgemein!$I$57)","v":{"v":0,"d":"0.00"}},{"$f":"SUMIF($M$10:$M$39,Allgemein!$I$57,$N$10:$N$39)","v":{"v":0,"d":"0.00"}}]
[{"$nulls":3},"Feiertag",{"$f":"COUNTIF($M$10:$M$39,Allgemein!$I$58)","v":{"v":1,"d":"1.00"}},{"$f":"SUMIF($M$10:$M$39,Allgemein!$I$58,$N$10:$N$39)","v":{"v":0,"d":"0.00"}}]
[{"$nulls":3},"Undefiniert",{"$f":"COUNTIF($M$10:$M$39,Allgemein!$I$49)","v":{"v":0,"d":"0.00"}},{"$f":"SUMIF($M$10:$M$39,Allgemein!$I$49,$N$10:$N$39)","v":{"v":0,"d":"0.00"}}]

{"sheet":"Dez.","index":16,"n_rows":53,"n_cols":23,"rows_kept":53}
[]
[]
[]
[]
[]
["Urlaubsvortrag",{"$f":"Nov.!$F$6","v":{"v":30,"d":"30.00"}},"Urlaub genommen",{"$f":"$H$44","v":{"v":0,"d":"0.00"}},"Resturlaub",{"$f":"$B$6-$D$6","v":{"v":30,"d":"30.00"}}]
["Saldovortrag",{"$f":"Nov.!$F$7","v":{"v":0,"d":"0.00"}},"Saldoänderung",{"$f":"$P$41","v":{"v":0,"d":"0.00"}},"Kumulierter Saldo",{"$f":"$B$7+$D$7","v":{"v":0,"d":"0.00"}}]
[]
["Datum","Wochentag","Art","Arbeitsort","Von Uhrzeit","Bis Uhrzeit","Von Uhrzeit","Bis Uhrzeit","Bruttoarbeitszeit","Geb. Pause","Mindestpause","Nettoarbeitszeit","Fehlzeitenart","Fehlstunden","Sollstunden","Tagessaldo","Kumulierter Saldo",null,"Feiertag","Feiertag Anteil Tag","FZ-Gutschrift","Gleittag","Ausgewertet"]
["2026-12-01",{"$f":"TEXT(A10,\"tttt\")","v":"Dienstag"},{"$f":"IF(AND(S10=\"Feiertag\",T10>0),\"Fehlzeit\",IF(OR(B10=\"Samstag\",B10=\"Sonntag\"),\"Wochenende\",\"Bitte auswählen\"))","v":"Bitte auswählen"},{"$nulls":5},{"$f":"IF(AND(OR(C10=\"Anwesenheit\",C10=\"Wochenende\"),E10<>\"\",F10<>\"\",W10=\"Ja\"),((F10-E10)+(H10-G10))*24,\"\")","v":""},{"$f":"IF(I10=\"\",\"\",IF(AND(G10<>\"\",H10<>\"\"),(G10-F10)*24,0))","v":""},{"$f":"IF(I10=\"\",\"\",IF(AND(I10<>\"\",J10=\"\",I10>=Personalstamm!$D$20),Personalstamm!$E$20,IF(AND(I10<>\"\",J10=\"\",I10>=Personalstamm!$D$19),Personalstamm!$E$19,IF(AND(I10<>\"\",J10<Personalstamm!$E$20,I10>=Personalstamm!$D$20),Personalstamm!$E$20-J10,IF(AND(I10<>\"\",J10<Personalstamm!E$19,I10>=Personalstamm!$D$19),Personalstamm!$E$19-J10,0)))))","v":""},{"$f":"IF(I10<>\"\",I10-K10,\"\")","v":""},{"$f":"IF(AND(S10=\"Feiertag\",T10>0),\"Feiertag\",IF(C10=\"Fehlzeit\",\"Bitte auswählen\",\"\"))","v":""},{"$f":"IF(OR(M10=\"\",M10=\"Bitte auswählen\"),\"\",IF(M10=\"Feiertag\",T10*U10,IF(M10=\"Gleittag\",0,VLOOKUP(B10,Personalstamm!$D$8:$F$14,3,FALSE))))","v":""},{"$f":"VLOOKUP(B10,Personalstamm!$D$8:$E$14,2,FALSE)","v":{"v":8,"d":"8.00"}},{"$f":"IF(AND(OR(C10=\"Anwesenheit\",C10=\"Wochenende\"),L10<>\"\"),L10-O10,IF(AND(C10=\"Fehlzeit\",N10<>\"\",W10=\"Ja\"),N10-O10,IF(W10=\"Ja\",-O10,\"\")))","v":""},{"$f":"IF(P10=\"\",B7,B7+P10)","v":{"v":0,"d":"0.00"}},null,{"$f":"IF(COUNTIF(Allgemein!$H$8:$H$45,A10)>0,\"Feiertag\",\"\")","v":""},{"$f":"IFERROR(VLOOKUP(A10,Allgemein!$H$8:$I$45,2,FALSE),\"\")","v":""},{"$f":"VLOOKUP(B10,Personalstamm!$D$8:$F$14,3,FALSE)","v":{"v":8,"d":"8.00"}},{"$f":"IF(M10=\"Gleittag\",ABS(P10),\"\")","v":""},{"$f":"IF(A10<=TODAY(),\"Ja\",\"\")","v":""}]
["2026-12-02",{"$f":"TEXT(A11,\"tttt\")","v":"Mittwoch"},{"$f":"IF(AND(S11=\"Feiertag\",T11>0),\"Fehlzeit\",IF(OR(B11=\"Samstag\",B11=\"Sonntag\"),\"Wochenende\",\"Bitte auswählen\"))","v":"Bitte auswählen"},{"$nulls":5},{"$f":"IF(AND(OR(C11=\"Anwesenheit\",C11=\"Wochenende\"),E11<>\"\",F11<>\"\",W11=\"Ja\"),((F11-E11)+(H11-G11))*24,\"\")","v":""},{"$f":"IF(I11=\"\",\"\",IF(AND(G11<>\"\",H11<>\"\"),(G11-F11)*24,0))","v":""},{"$f":"IF(I11=\"\",\"\",IF(AND(I11<>\"\",J11=\"\",I11>=Personalstamm!$D$20),Personalstamm!$E$20,IF(AND(I11<>\"\",J11=\"\",I11>=Personalstamm!$D$19),Personalstamm!$E$19,IF(AND(I11<>\"\",J11<Personalstamm!$E$20,I11>=Personalstamm!$D$20),Personalstamm!$E$20-J11,IF(AND(I11<>\"\",J11<Personalstamm!E$19,I11>=Personalstamm!$D$19),Personalstamm!$E$19-J11,0)))))","v":""},{"$f":"IF(I11<>\"\",I11-K11,\"\")","v":""},{"$f":"IF(AND(S11=\"Feiertag\",T11>0),\"Feiertag\",IF(C11=\"Fehlzeit\",\"Bitte auswählen\",\"\"))","v":""},{"$f":"IF(OR(M11=\"\",M11=\"Bitte auswählen\"),\"\",IF(M11=\"Feiertag\",T11*U11,IF(M11=\"Gleittag\",0,VLOOKUP(B11,Personalstamm!$D$8:$F$14,3,FALSE))))","v":""},{"$f":"VLOOKUP(B11,Personalstamm!$D$8:$E$14,2,FALSE)","v":{"v":8,"d":"8.00"}},{"$f":"IF(AND(OR(C11=\"Anwesenheit\",C11=\"Wochenende\"),L11<>\"\"),L11-O11,IF(AND(C11=\"Fehlzeit\",N11<>\"\",W11=\"Ja\"),N11-O11,IF(W11=\"Ja\",-O11,\"\")))","v":""},{"$f":"IF(P11=\"\",Q10,Q10+P11)","v":{"v":0,"d":"0.00"}},null,{"$f":"IF(COUNTIF(Allgemein!$H$8:$H$45,A11)>0,\"Feiertag\",\"\")","v":""},{"$f":"IFERROR(VLOOKUP(A11,Allgemein!$H$8:$I$45,2,FALSE),\"\")","v":""},{"$f":"VLOOKUP(B11,Personalstamm!$D$8:$F$14,3,FALSE)","v":{"v":8,"d":"8.00"}},{"$f":"IF(M11=\"Gleittag\",ABS(P11),\"\")","v":""},{"$f":"IF(A11<=TODAY(),\"Ja\",\"\")","v":""}]
["2026-12-03","Donnerstag","Bitte auswählen",{"$nulls":5},"","",{"$f":"IF(I12=\"\",\"\",IF(AND(I12<>\"\",J12=\"\",I12>=Personalstamm!$D$20),Personalstamm!$E$20,IF(AND(I12<>\"\",J12=\"\",I12>=Personalstamm!$D$19),Personalstamm!$E$19,IF(AND(I12<>\"\",J12<Personalstamm!$E$20,I12>=Personalstamm!$D$20),Personalstamm!$E$20-J12,IF(AND(I12<>\"\",J12<Personalstamm!E$19,I12>=Personalstamm!$D$19),Personalstamm!$E$19-J12,0)))))","v":""},"","",{"$f":"IF(OR(M12=\"\",M12=\"Bitte auswählen\"),\"\",IF(M12=\"Feiertag\",T12*U12,IF(M12=\"Gleittag\",0,VLOOKUP(B12,Personalstamm!$D$8:$F$14,3,FALSE))))","v":""},{"$f":"VLOOKUP(B12,Personalstamm!$D$8:$E$14,2,FALSE)","v":{"v":8,"d":"8.00"}},"",{"$f":"IF(P12=\"\",Q11,Q11+P12)","v":{"v":0,"d":"0.00"}},null,{"$f":"IF(COUNTIF(Allgemein!$H$8:$H$45,A12)>0,\"Feiertag\",\"\")","v":""},{"$f":"IFERROR(VLOOKUP(A12,Allgemein!$H$8:$I$45,2,FALSE),\"\")","v":""},{"$f":"VLOOKUP(B12,Personalstamm!$D$8:$F$14,3,FALSE)","v":{"v":8,"d":"8.00"}},"",""]
["2026-12-04","Freitag","Bitte auswählen",{"$nulls":5},"","",{"$f":"IF(I13=\"\",\"\",IF(AND(I13<>\"\",J13=\"\",I13>=Personalstamm!$D$20),Personalstamm!$E$20,IF(AND(I13<>\"\",J13=\"\",I13>=Personalstamm!$D$19),Personalstamm!$E$19,IF(AND(I13<>\"\",J13<Personalstamm!$E$20,I13>=Personalstamm!$D$20),Personalstamm!$E$20-J13,IF(AND(I13<>\"\",J13<Personalstamm!E$19,I13>=Personalstamm!$D$19),Personalstamm!$E$19-J13,0)))))","v":""},"","",{"$f":"IF(OR(M13=\"\",M13=\"Bitte auswählen\"),\"\",IF(M13=\"Feiertag\",T13*U13,IF(M13=\"Gleittag\",0,VLOOKUP(B13,Personalstamm!$D$8:$F$14,3,FALSE))))","v":""},{"$f":"VLOOKUP(B13,Personalstamm!$D$8:$E$14,2,FALSE)","v":{"v":8,"d":"8.00"}},"",{"v":0,"d":"0.00"},null,{"$f":"IF(COUNTIF(Allgemein!$H$8:$H$45,A13)>0,\"Feiertag\",\"\")","v":""},{"$f":"IFERROR(VLOOKUP(A13,Allgemein!$H$8:$I$45,2,FALSE),\"\")","v":""},{"$f":"VLOOKUP(B13,Personalstamm!$D$8:$F$14,3,FALSE)","v":{"v":8,"d":"8.00"}},"",""]
["2026-12-05","Samstag","Wochenende",{"$nulls":5},"","",{"$f":"IF(I14=\"\",\"\",IF(AND(I14<>\"\",J14=\"\",I14>=Personalstamm!$D$20),Personalstamm!$E$20,IF(AND(I14<>\"\",J14=\"\",I14>=Personalstamm!$D$19),Personalstamm!$E$19,IF(AND(I14<>\"\",J14<Personalstamm!$E$20,I14>=Personalstamm!$D$20),Personalstamm!$E$20-J14,IF(AND(I14<>\"\",J14<Personalstamm!E$19,I14>=Personalstamm!$D$19),Personalstamm!$E$19-J14,0)))))","v":""},"","",{"$f":"IF(OR(M14=\"\",M14=\"Bitte auswählen\"),\"\",IF(M14=\"Feiertag\",T14*U14,IF(M14=\"Gleittag\",0,VLOOKUP(B14,Personalstamm!$D$8:$F$14,3,FALSE))))","v":""},{"$f":"VLOOKUP(B14,Personalstamm!$D$8:$E$14,2,FALSE)","v":{"v":0,"d":"0.00"}},"",{"v":0,"d":"0.00"},null,{"$f":"IF(COUNTIF(Allgemein!$H$8:$H$45,A14)>0,\"Feiertag\",\"\")","v":""},{"$f":"IFERROR(VLOOKUP(A14,Allgemein!$H$8:$I$45,2,FALSE),\"\")","v":""},{"$f":"VLOOKUP(B14,Personalstamm!$D$8:$F$14,3,FALSE)","v":{"v":0,"d":"0.00"}},"",""]
["2026-12-06","Sonntag","Wochenende",{"$nulls":5},"","",{"$f":"IF(I15=\"\",\"\",IF(AND(I15<>\"\",J15=\"\",I15>=Personalstamm!$D$20),Personalstamm!$E$20,IF(AND(I15<>\"\",J15=\"\",I15>=Personalstamm!$D$19),Personalstamm!$E$19,IF(AND(I15<>\"\",J15<Personalstamm!$E$20,I15>=Personalstamm!$D$20),Personalstamm!$E$20-J15,IF(AND(I15<>\"\",J15<Personalstamm!E$19,I15>=Personalstamm!$D$19),Personalstamm!$E$19-J15,0)))))","v":""},"","",{"$f":"IF(OR(M15=\"\",M15=\"Bitte auswählen\"),\"\",IF(M15=\"Feiertag\",T15*U15,IF(M15=\"Gleittag\",0,VLOOKUP(B15,Personalstamm!$D$8:$F$14,3,FALSE))))","v":""},{"$f":"VLOOKUP(B15,Personalstamm!$D$8:$E$14,2,FALSE)","v":{"v":0,"d":"0.00"}},"",{"v":0,"d":"0.00"},null,{"$f":"IF(COUNTIF(Allgemein!$H$8:$H$45,A15)>0,\"Feiertag\",\"\")","v":""},{"$f":"IFERROR(VLOOKUP(A15,Allgemein!$H$8:$I$45,2,FALSE),\"\")","v":""},{"$f":"VLOOKUP(B15,Personalstamm!$D$8:$F$14,3,FALSE)","v":{"v":0,"d":"0.00"}},"",""]
["2026-12-07","Montag","Bitte auswählen",{"$nulls":5},"","",{"$f":"IF(I16=\"\",\"\",IF(AND(I16<>\"\",J16=\"\",I16>=Personalstamm!$D$20),Personalstamm!$E$20,IF(AND(I16<>\"\",J16=\"\",I16>=Personalstamm!$D$19),Personalstamm!$E$19,IF(AND(I16<>\"\",J16<Personalstamm!$E$20,I16>=Personalstamm!$D$20),Personalstamm!$E$20-J16,IF(AND(I16<>\"\",J16<Personalstamm!E$19,I16>=Personalstamm!$D$19),Personalstamm!$E$19-J16,0)))))","v":""},"","",{"$f":"IF(OR(M16=\"\",M16=\"Bitte auswählen\"),\"\",IF(M16=\"Feiertag\",T16*U16,IF(M16=\"Gleittag\",0,VLOOKUP(B16,Personalstamm!$D$8:$F$14,3,FALSE))))","v":""},{"$f":"VLOOKUP(B16,Personalstamm!$D$8:$E$14,2,FALSE)","v":{"v":8,"d":"8.00"}},"",{"v":0,"d":"0.00"},null,{"$f":"IF(COUNTIF(Allgemein!$H$8:$H$45,A16)>0,\"Feiertag\",\"\")","v":""},{"$f":"IFERROR(VLOOKUP(A16,Allgemein!$H$8:$I$45,2,FALSE),\"\")","v":""},{"$f":"VLOOKUP(B16,Personalstamm!$D$8:$F$14,3,FALSE)","v":{"v":8,"d":"8.00"}},"",""]
["2026-12-08","Dienstag","Bitte auswählen",{"$nulls":5},"","",{"$f":"IF(I17=\"\",\"\",IF(AND(I17<>\"\",J17=\"\",I17>=Personalstamm!$D$20),Personalstamm!$E$20,IF(AND(I17<>\"\",J17=\"\",I17>=Personalstamm!$D$19),Personalstamm!$E$19,IF(AND(I17<>\"\",J17<Personalstamm!$E$20,I17>=Personalstamm!$D$20),Personalstamm!$E$20-J17,IF(AND(I17<>\"\",J17<Personalstamm!E$19,I17>=Personalstamm!$D$19),Personalstamm!$E$19-J17,0)))))","v":""},"","",{"$f":"IF(OR(M17=\"\",M17=\"Bitte auswählen\"),\"\",IF(M17=\"Feiertag\",T17*U17,IF(M17=\"Gleittag\",0,VLOOKUP(B17,Personalstamm!$D$8:$F$14,3,FALSE))))","v":""},{"$f":"VLOOKUP(B17,Personalstamm!$D$8:$E$14,2,FALSE)","v":{"v":8,"d":"8.00"}},"",{"v":0,"d":"0.00"},null,{"$f":"IF(COUNTIF(Allgemein!$H$8:$H$45,A17)>0,\"Feiertag\",\"\")","v":""},{"$f":"IFERROR(VLOOKUP(A17,Allgemein!$H$8:$I$45,2,FALSE),\"\")","v":""},{"$f":"VLOOKUP(B17,Personalstamm!$D$8:$F$14,3,FALSE)","v":{"v":8,"d":"8.00"}},"",""]
["2026-12-09","Mittwoch","Bitte auswählen",{"$nulls":5},"","",{"$f":"IF(I18=\"\",\"\",IF(AND(I18<>\"\",J18=\"\",I18>=Personalstamm!$D$20),Personalstamm!$E$20,IF(AND(I18<>\"\",J18=\"\",I18>=Personalstamm!$D$19),Personalstamm!$E$19,IF(AND(I18<>\"\",J18<Personalstamm!$E$20,I18>=Personalstamm!$D$20),Personalstamm!$E$20-J18,IF(AND(I18<>\"\",J18<Personalstamm!E$19,I18>=Personalstamm!$D$19),Personalstamm!$E$19-J18,0)))))","v":""},"","",{"$f":"IF(OR(M18=\"\",M18=\"Bitte auswählen\"),\"\",IF(M18=\"Feiertag\",T18*U18,IF(M18=\"Gleittag\",0,VLOOKUP(B18,Personalstamm!$D$8:$F$14,3,FALSE))))","v":""},{"$f":"VLOOKUP(B18,Personalstamm!$D$8:$E$14,2,FALSE)","v":{"v":8,"d":"8.00"}},"",{"v":0,"d":"0.00"},null,{"$f":"IF(COUNTIF(Allgemein!$H$8:$H$45,A18)>0,\"Feiertag\",\"\")","v":""},{"$f":"IFERROR(VLOOKUP(A18,Allgemein!$H$8:$I$45,2,FALSE),\"\")","v":""},{"$f":"VLOOKUP(B18,Personalstamm!$D$8:$F$14,3,FALSE)","v":{"v":8,"d":"8.00"}},"",""]
["2026-12-10","Donnerstag","Bitte auswählen",{"$nulls":5},"","",{"$f":"IF(I19=\"\",\"\",IF(AND(I19<>\"\",J19=\"\",I19>=Personalstamm!$D$20),Personalstamm!$E$20,IF(AND(I19<>\"\",J19=\"\",I19>=Personalstamm!$D$19),Personalstamm!$E$19,IF(AND(I19<>\"\",J19<Personalstamm!$E$20,I19>=Personalstamm!$D$20),Personalstamm!$E$20-J19,IF(AND(I19<>\"\",J19<Personalstamm!E$19,I19>=Personalstamm!$D$19),Personalstamm!$E$19-J19,0)))))","v":""},"","",{"$f":"IF(OR(M19=\"\",M19=\"Bitte auswählen\"),\"\",IF(M19=\"Feiertag\",T19*U19,IF(M19=\"Gleittag\",0,VLOOKUP(B19,Personalstamm!$D$8:$F$14,3,FALSE))))","v":""},{"$f":"VLOOKUP(B19,Personalstamm!$D$8:$E$14,2,FALSE)","v":{"v":8,"d":"8.00"}},"",{"v":0,"d":"0.00"},null,{"$f":"IF(COUNTIF(Allgemein!$H$8:$H$45,A19)>0,\"Feiertag\",\"\")","v":""},{"$f":"IFERROR(VLOOKUP(A19,Allgemein!$H$8:$I$45,2,FALSE),\"\")","v":""},{"$f":"VLOOKUP(B19,Personalstamm!$D$8:$F$14,3,FALSE)","v":{"v":8,"d":"8.00"}},"",""]
["2026-12-11","Freitag","Bitte auswählen",{"$nulls":5},"","",{"$f":"IF(I20=\"\",\"\",IF(AND(I20<>\"\",J20=\"\",I20>=Personalstamm!$D$20),Personalstamm!$E$20,IF(AND(I20<>\"\",J20=\"\",I20>=Personalstamm!$D$19),Personalstamm!$E$19,IF(AND(I20<>\"\",J20<Personalstamm!$E$20,I20>=Personalstamm!$D$20),Personalstamm!$E$20-J20,IF(AND(I20<>\"\",J20<Personalstamm!E$19,I20>=Personalstamm!$D$19),Personalstamm!$E$19-J20,0)))))","v":""},"","",{"$f":"IF(OR(M20=\"\",M20=\"Bitte auswählen\"),\"\",IF(M20=\"Feiertag\",T20*U20,IF(M20=\"Gleittag\",0,VLOOKUP(B20,Personalstamm!$D$8:$F$14,3,FALSE))))","v":""},{"$f":"VLOOKUP(B20,Personalstamm!$D$8:$E$14,2,FALSE)","v":{"v":8,"d":"8.00"}},"",{"v":0,"d":"0.00"},null,{"$f":"IF(COUNTIF(Allgemein!$H$8:$H$45,A20)>0,\"Feiertag\",\"\")","v":""},{"$f":"IFERROR(VLOOKUP(A20,Allgemein!$H$8:$I$45,2,FALSE),\"\")","v":""},{"$f":"VLOOKUP(B20,Personalstamm!$D$8:$F$14,3,FALSE)","v":{"v":8,"d":"8.00"}},"",""]
["2026-12-12","Samstag","Wochenende",{"$nulls":5},"","",{"$f":"IF(I21=\"\",\"\",IF(AND(I21<>\"\",J21=\"\",I21>=Personalstamm!$D$20),Personalstamm!$E$20,IF(AND(I21<>\"\",J21=\"\",I21>=Personalstamm!$D$19),Personalstamm!$E$19,IF(AND(I21<>\"\",J21<Personalstamm!$E$20,I21>=Personalstamm!$D$20),Personalstamm!$E$20-J21,IF(AND(I21<>\"\",J21<Personalstamm!E$19,I21>=Personalstamm!$D$19),Personalstamm!$E$19-J21,0)))))","v":""},"","",{"$f":"IF(OR(M21=\"\",M21=\"Bitte auswählen\"),\"\",IF(M21=\"Feiertag\",T21*U21,IF(M21=\"Gleittag\",0,VLOOKUP(B21,Personalstamm!$D$8:$F$14,3,FALSE))))","v":""},{"$f":"VLOOKUP(B21,Personalstamm!$D$8:$E$14,2,FALSE)","v":{"v":0,"d":"0.00"}},"",{"v":0,"d":"0.00"},null,{"$f":"IF(COUNTIF(Allgemein!$H$8:$H$45,A21)>0,\"Feiertag\",\"\")","v":""},{"$f":"IFERROR(VLOOKUP(A21,Allgemein!$H$8:$I$45,2,FALSE),\"\")","v":""},{"$f":"VLOOKUP(B21,Personalstamm!$D$8:$F$14,3,FALSE)","v":{"v":0,"d":"0.00"}},"",""]
["2026-12-13","Sonntag","Wochenende",{"$nulls":5},"","",{"$f":"IF(I22=\"\",\"\",IF(AND(I22<>\"\",J22=\"\",I22>=Personalstamm!$D$20),Personalstamm!$E$20,IF(AND(I22<>\"\",J22=\"\",I22>=Personalstamm!$D$19),Personalstamm!$E$19,IF(AND(I22<>\"\",J22<Personalstamm!$E$20,I22>=Personalstamm!$D$20),Personalstamm!$E$20-J22,IF(AND(I22<>\"\",J22<Personalstamm!E$19,I22>=Personalstamm!$D$19),Personalstamm!$E$19-J22,0)))))","v":""},"","",{"$f":"IF(OR(M22=\"\",M22=\"Bitte auswählen\"),\"\",IF(M22=\"Feiertag\",T22*U22,IF(M22=\"Gleittag\",0,VLOOKUP(B22,Personalstamm!$D$8:$F$14,3,FALSE))))","v":""},{"$f":"VLOOKUP(B22,Personalstamm!$D$8:$E$14,2,FALSE)","v":{"v":0,"d":"0.00"}},"",{"v":0,"d":"0.00"},null,{"$f":"IF(COUNTIF(Allgemein!$H$8:$H$45,A22)>0,\"Feiertag\",\"\")","v":""},{"$f":"IFERROR(VLOOKUP(A22,Allgemein!$H$8:$I$45,2,FALSE),\"\")","v":""},{"$f":"VLOOKUP(B22,Personalstamm!$D$8:$F$14,3,FALSE)","v":{"v":0,"d":"0.00"}},"",""]
["2026-12-14","Montag","Bitte auswählen",{"$nulls":5},"","",{"$f":"IF(I23=\"\",\"\",IF(AND(I23<>\"\",J23=\"\",I23>=Personalstamm!$D$20),Personalstamm!$E$20,IF(AND(I23<>\"\",J23=\"\",I23>=Personalstamm!$D$19),Personalstamm!$E$19,IF(AND(I23<>\"\",J23<Personalstamm!$E$20,I23>=Personalstamm!$D$20),Personalstamm!$E$20-J23,IF(AND(I23<>\"\",J23<Personalstamm!E$19,I23>=Personalstamm!$D$19),Personalstamm!$E$19-J23,0)))))","v":""},"","",{"$f":"IF(OR(M23=\"\",M23=\"Bitte auswählen\"),\"\",IF(M23=\"Feiertag\",T23*U23,IF(M23=\"Gleittag\",0,VLOOKUP(B23,Personalstamm!$D$8:$F$14,3,FALSE))))","v":""},{"$f":"VLOOKUP(B23,Personalstamm!$D$8:$E$14,2,FALSE)","v":{"v":8,"d":"8.00"}},"",{"v":0,"d":"0.00"},null,{"$f":"IF(COUNTIF(Allgemein!$H$8:$H$45,A23)>0,\"Feiertag\",\"\")","v":""},{"$f":"IFERROR(VLOOKUP(A23,Allgemein!$H$8:$I$45,2,FALSE),\"\")","v":""},{"$f":"VLOOKUP(B23,Personalstamm!$D$8:$F$14,3,FALSE)","v":{"v":8,"d":"8.00"}},"",""]
["2026-12-15","Dienstag","Bitte auswählen",{"$nulls":5},"","",{"$f":"IF(I24=\"\",\"\",IF(AND(I24<>\"\",J24=\"\",I24>=Personalstamm!$D$20),Personalstamm!$E$20,IF(AND(I24<>\"\",J24=\"\",I24>=Personalstamm!$D$19),Personalstamm!$E$19,IF(AND(I24<>\"\",J24<Personalstamm!$E$20,I24>=Personalstamm!$D$20),Personalstamm!$E$20-J24,IF(AND(I24<>\"\",J24<Personalstamm!E$19,I24>=Personalstamm!$D$19),Personalstamm!$E$19-J24,0)))))","v":""},"","",{"$f":"IF(OR(M24=\"\",M24=\"Bitte auswählen\"),\"\",IF(M24=\"Feiertag\",T24*U24,IF(M24=\"Gleittag\",0,VLOOKUP(B24,Personalstamm!$D$8:$F$14,3,FALSE))))","v":""},{"$f":"VLOOKUP(B24,Personalstamm!$D$8:$E$14,2,FALSE)","v":{"v":8,"d":"8.00"}},"",{"v":0,"d":"0.00"},null,{"$f":"IF(COUNTIF(Allgemein!$H$8:$H$45,A24)>0,\"Feiertag\",\"\")","v":""},{"$f":"IFERROR(VLOOKUP(A24,Allgemein!$H$8:$I$45,2,FALSE),\"\")","v":""},{"$f":"VLOOKUP(B24,Personalstamm!$D$8:$F$14,3,FALSE)","v":{"v":8,"d":"8.00"}},"",""]
["2026-12-16","Mittwoch","Bitte auswählen",{"$nulls":5},"","",{"$f":"IF(I25=\"\",\"\",IF(AND(I25<>\"\",J25=\"\",I25>=Personalstamm!$D$20),Personalstamm!$E$20,IF(AND(I25<>\"\",J25=\"\",I25>=Personalstamm!$D$19),Personalstamm!$E$19,IF(AND(I25<>\"\",J25<Personalstamm!$E$20,I25>=Personalstamm!$D$20),Personalstamm!$E$20-J25,IF(AND(I25<>\"\",J25<Personalstamm!E$19,I25>=Personalstamm!$D$19),Personalstamm!$E$19-J25,0)))))","v":""},"","",{"$f":"IF(OR(M25=\"\",M25=\"Bitte auswählen\"),\"\",IF(M25=\"Feiertag\",T25*U25,IF(M25=\"Gleittag\",0,VLOOKUP(B25,Personalstamm!$D$8:$F$14,3,FALSE))))","v":""},{"$f":"VLOOKUP(B25,Personalstamm!$D$8:$E$14,2,FALSE)","v":{"v":8,"d":"8.00"}},"",{"v":0,"d":"0.00"},null,{"$f":"IF(COUNTIF(Allgemein!$H$8:$H$45,A25)>0,\"Feiertag\",\"\")","v":""},{"$f":"IFERROR(VLOOKUP(A25,Allgemein!$H$8:$I$45,2,FALSE),\"\")","v":""},{"$f":"VLOOKUP(B25,Personalstamm!$D$8:$F$14,3,FALSE)","v":{"v":8,"d":"8.00"}},"",""]
["2026-12-17","Donnerstag","Bitte auswählen",{"$nulls":5},"","",{"$f":"IF(I26=\"\",\"\",IF(AND(I26<>\"\",J26=\"\",I26>=Personalstamm!$D$20),Personalstamm!$E$20,IF(AND(I26<>\"\",J26=\"\",I26>=Personalstamm!$D$19),Personalstamm!$E$19,IF(AND(I26<>\"\",J26<Personalstamm!$E$20,I26>=Personalstamm!$D$20),Personalstamm!$E$20-J26,IF(AND(I26<>\"\",J26<Personalstamm!E$19,I26>=Personalstamm!$D$19),Personalstamm!$E$19-J26,0)))))","v":""},"","",{"$f":"IF(OR(M26=\"\",M26=\"Bitte auswählen\"),\"\",IF(M26=\"Feiertag\",T26*U26,IF(M26=\"Gleittag\",0,VLOOKUP(B26,Personalstamm!$D$8:$F$14,3,FALSE))))","v":""},{"$f":"VLOOKUP(B26,Personalstamm!$D$8:$E$14,2,FALSE)","v":{"v":8,"d":"8.00"}},"",{"v":0,"d":"0.00"},null,{"$f":"IF(COUNTIF(Allgemein!$H$8:$H$45,A26)>0,\"Feiertag\",\"\")","v":""},{"$f":"IFERROR(VLOOKUP(A26,Allgemein!$H$8:$I$45,2,FALSE),\"\")","v":""},{"$f":"VLOOKUP(B26,Personalstamm!$D$8:$F$14,3,FALSE)","v":{"v":8,"d":"8.00"}},"",""]
["2026-12-18","Freitag","Bitte auswählen",{"$nulls":5},"","",{"$f":"IF(I27=\"\",\"\",IF(AND(I27<>\"\",J27=\"\",I27>=Personalstamm!$D$20),Personalstamm!$E$20,IF(AND(I27<>\"\",J27=\"\",I27>=Personalstamm!$D$19),Personalstamm!$E$19,IF(AND(I27<>\"\",J27<Personalstamm!$E$20,I27>=Personalstamm!$D$20),Personalstamm!$E$20-J27,IF(AND(I27<>\"\",J27<Personalstamm!E$19,I27>=Personalstamm!$D$19),Personalstamm!$E$19-J27,0)))))","v":""},"","",{"$f":"IF(OR(M27=\"\",M27=\"Bitte auswählen\"),\"\",IF(M27=\"Feiertag\",T27*U27,IF(M27=\"Gleittag\",0,VLOOKUP(B27,Personalstamm!$D$8:$F$14,3,FALSE))))","v":""},{"$f":"VLOOKUP(B27,Personalstamm!$D$8:$E$14,2,FALSE)","v":{"v":8,"d":"8.00"}},"",{"v":0,"d":"0.00"},null,{"$f":"IF(COUNTIF(Allgemein!$H$8:$H$45,A27)>0,\"Feiertag\",\"\")","v":""},{"$f":"IFERROR(VLOOKUP(A27,Allgemein!$H$8:$I$45,2,FALSE),\"\")","v":""},{"$f":"VLOOKUP(B27,Personalstamm!$D$8:$F$14,3,FALSE)","v":{"v":8,"d":"8.00"}},"",""]
["2026-12-19","Samstag","Wochenende",{"$nulls":5},"","",{"$f":"IF(I28=\"\",\"\",IF(AND(I28<>\"\",J28=\"\",I28>=Personalstamm!$D$20),Personalstamm!$E$20,IF(AND(I28<>\"\",J28=\"\",I28>=Personalstamm!$D$19),Personalstamm!$E$19,IF(AND(I28<>\"\",J28<Personalstamm!$E$20,I28>=Personalstamm!$D$20),Personalstamm!$E$20-J28,IF(AND(I28<>\"\",J28<Personalstamm!E$19,I28>=Personalstamm!$D$19),Personalstamm!$E$19-J28,0)))))","v":""},"","",{"$f":"IF(OR(M28=\"\",M28=\"Bitte auswählen\"),\"\",IF(M28=\"Feiertag\",T28*U28,IF(M28=\"Gleittag\",0,VLOOKUP(B28,Personalstamm!$D$8:$F$14,3,FALSE))))","v":""},{"$f":"VLOOKUP(B28,Personalstamm!$D$8:$E$14,2,FALSE)","v":{"v":0,"d":"0.00"}},"",{"v":0,"d":"0.00"},null,{"$f":"IF(COUNTIF(Allgemein!$H$8:$H$45,A28)>0,\"Feiertag\",\"\")","v":""},{"$f":"IFERROR(VLOOKUP(A28,Allgemein!$H$8:$I$45,2,FALSE),\"\")","v":""},{"$f":"VLOOKUP(B28,Personalstamm!$D$8:$F$14,3,FALSE)","v":{"v":0,"d":"0.00"}},"",""]
["2026-12-20","Sonntag","Wochenende",{"$nulls":5},"","",{"$f":"IF(I29=\"\",\"\",IF(AND(I29<>\"\",J29=\"\",I29>=Personalstamm!$D$20),Personalstamm!$E$20,IF(AND(I29<>\"\",J29=\"\",I29>=Personalstamm!$D$19),Personalstamm!$E$19,IF(AND(I29<>\"\",J29<Personalstamm!$E$20,I29>=Personalstamm!$D$20),Personalstamm!$E$20-J29,IF(AND(I29<>\"\",J29<Personalstamm!E$19,I29>=Personalstamm!$D$19),Personalstamm!$E$19-J29,0)))))","v":""},"","",{"$f":"IF(OR(M29=\"\",M29=\"Bitte auswählen\"),\"\",IF(M29=\"Feiertag\",T29*U29,IF(M29=\"Gleittag\",0,VLOOKUP(B29,Personalstamm!$D$8:$F$14,3,FALSE))))","v":""},{"$f":"VLOOKUP(B29,Personalstamm!$D$8:$E$14,2,FALSE)","v":{"v":0,"d":"0.00"}},"",{"v":0,"d":"0.00"},null,{"$f":"IF(COUNTIF(Allgemein!$H$8:$H$45,A29)>0,\"Feiertag\",\"\")","v":""},{"$f":"IFERROR(VLOOKUP(A29,Allgemein!$H$8:$I$45,2,FALSE),\"\")","v":""},{"$f":"VLOOKUP(B29,Personalstamm!$D$8:$F$14,3,FALSE)","v":{"v":0,"d":"0.00"}},"",""]
["2026-12-21","Montag","Bitte auswählen",{"$nulls":5},"","",{"$f":"IF(I30=\"\",\"\",IF(AND(I30<>\"\",J30=\"\",I30>=Personalstamm!$D$20),Personalstamm!$E$20,IF(AND(I30<>\"\",J30=\"\",I30>=Personalstamm!$D$19),Personalstamm!$E$19,IF(AND(I30<>\"\",J30<Personalstamm!$E$20,I30>=Personalstamm!$D$20),Personalstamm!$E$20-J30,IF(AND(I30<>\"\",J30<Personalstamm!E$19,I30>=Personalstamm!$D$19),Personalstamm!$E$19-J30,0)))))","v":""},"","",{"$f":"IF(OR(M30=\"\",M30=\"Bitte auswählen\"),\"\",IF(M30=\"Feiertag\",T30*U30,IF(M30=\"Gleittag\",0,VLOOKUP(B30,Personalstamm!$D$8:$F$14,3,FALSE))))","v":""},{"$f":"VLOOKUP(B30,Personalstamm!$D$8:$E$14,2,FALSE)","v":{"v":8,"d":"8.00"}},"",{"v":0,"d":"0.00"},null,{"$f":"IF(COUNTIF(Allgemein!$H$8:$H$45,A30)>0,\"Feiertag\",\"\")","v":""},{"$f":"IFERROR(VLOOKUP(A30,Allgemein!$H$8:$I$45,2,FALSE),\"\")","v":""},{"$f":"VLOOKUP(B30,Personalstamm!$D$8:$F$14,3,FALSE)","v":{"v":8,"d":"8.00"}},"",""]
["2026-12-22","Dienstag","Bitte auswählen",{"$nulls":5},"","",{"$f":"IF(I31=\"\",\"\",IF(AND(I31<>\"\",J31=\"\",I31>=Personalstamm!$D$20),Personalstamm!$E$20,IF(AND(I31<>\"\",J31=\"\",I31>=Personalstamm!$D$19),Personalstamm!$E$19,IF(AND(I31<>\"\",J31<Personalstamm!$E$20,I31>=Personalstamm!$D$20),Personalstamm!$E$20-J31,IF(AND(I31<>\"\",J31<Personalstamm!E$19,I31>=Personalstamm!$D$19),Personalstamm!$E$19-J31,0)))))","v":""},"","",{"$f":"IF(OR(M31=\"\",M31=\"Bitte auswählen\"),\"\",IF(M31=\"Feiertag\",T31*U31,IF(M31=\"Gleittag\",0,VLOOKUP(B31,Personalstamm!$D$8:$F$14,3,FALSE))))","v":""},{"$f":"VLOOKUP(B31,Personalstamm!$D$8:$E$14,2,FALSE)","v":{"v":8,"d":"8.00"}},"",{"v":0,"d":"0.00"},null,{"$f":"IF(COUNTIF(Allgemein!$H$8:$H$45,A31)>0,\"Feiertag\",\"\")","v":""},{"$f":"IFERROR(VLOOKUP(A31,Allgemein!$H$8:$I$45,2,FALSE),\"\")","v":""},{"$f":"VLOOKUP(B31,Personalstamm!$D$8:$F$14,3,FALSE)","v":{"v":8,"d":"8.00"}},"",""]
["2026-12-23","Mittwoch","Bitte auswählen",{"$nulls":5},"","",{"$f":"IF(I32=\"\",\"\",IF(AND(I32<>\"\",J32=\"\",I32>=Personalstamm!$D$20),Personalstamm!$E$20,IF(AND(I32<>\"\",J32=\"\",I32>=Personalstamm!$D$19),Personalstamm!$E$19,IF(AND(I32<>\"\",J32<Personalstamm!$E$20,I32>=Personalstamm!$D$20),Personalstamm!$E$20-J32,IF(AND(I32<>\"\",J32<Personalstamm!E$19,I32>=Personalstamm!$D$19),Personalstamm!$E$19-J32,0)))))","v":""},"","",{"$f":"IF(OR(M32=\"\",M32=\"Bitte auswählen\"),\"\",IF(M32=\"Feiertag\",T32*U32,IF(M32=\"Gleittag\",0,VLOOKUP(B32,Personalstamm!$D$8:$F$14,3,FALSE))))","v":""},{"$f":"VLOOKUP(B32,Personalstamm!$D$8:$E$14,2,FALSE)","v":{"v":8,"d":"8.00"}},"",{"v":0,"d":"0.00"},null,{"$f":"IF(COUNTIF(Allgemein!$H$8:$H$45,A32)>0,\"Feiertag\",\"\")","v":""},{"$f":"IFERROR(VLOOKUP(A32,Allgemein!$H$8:$I$45,2,FALSE),\"\")","v":""},{"$f":"VLOOKUP(B32,Personalstamm!$D$8:$F$14,3,FALSE)","v":{"v":8,"d":"8.00"}},"",""]
["2026-12-24","Donnerstag","Fehlzeit",{"$nulls":5},"","",{"$f":"IF(I33=\"\",\"\",IF(AND(I33<>\"\",J33=\"\",I33>=Personalstamm!$D$20),Personalstamm!$E$20,IF(AND(I33<>\"\",J33=\"\",I33>=Personalstamm!$D$19),Personalstamm!$E$19,IF(AND(I33<>\"\",J33<Personalstamm!$E$20,I33>=Personalstamm!$D$20),Personalstamm!$E$20-J33,IF(AND(I33<>\"\",J33<Personalstamm!E$19,I33>=Personalstamm!$D$19),Personalstamm!$E$19-J33,0)))))","v":""},"","Feiertag",{"$f":"IF(OR(M33=\"\",M33=\"Bitte auswählen\"),\"\",IF(M33=\"Feiertag\",T33*U33,IF(M33=\"Gleittag\",0,VLOOKUP(B33,Personalstamm!$D$8:$F$14,3,FALSE))))","v":{"v":4,"d":"4.00"}},{"$f":"VLOOKUP(B33,Personalstamm!$D$8:$E$14,2,FALSE)","v":{"v":8,"d":"8.00"}},"",{"v":0,"d":"0.00"},null,{"$f":"IF(COUNTIF(Allgemein!$H$8:$H$45,A33)>0,\"Feiertag\",\"\")","v":"Feiertag"},{"$f":"IFERROR(VLOOKUP(A33,Allgemein!$H$8:$I$45,2,FALSE),\"\")","v":{"v":0.5,"d":"0.50"}},{"$f":"VLOOKUP(B33,Personalstamm!$D$8:$F$14,3,FALSE)","v":{"v":8,"d":"8.00"}},"",""]
["2026-12-25","Freitag","Fehlzeit",{"$nulls":5},"","",{"$f":"IF(I34=\"\",\"\",IF(AND(I34<>\"\",J34=\"\",I34>=Personalstamm!$D$20),Personalstamm!$E$20,IF(AND(I34<>\"\",J34=\"\",I34>=Personalstamm!$D$19),Personalstamm!$E$19,IF(AND(I34<>\"\",J34<Personalstamm!$E$20,I34>=Personalstamm!$D$20),Personalstamm!$E$20-J34,IF(AND(I34<>\"\",J34<Personalstamm!E$19,I34>=Personalstamm!$D$19),Personalstamm!$E$19-J34,0)))))","v":""},"","Feiertag",{"$f":"IF(OR(M34=\"\",M34=\"Bitte auswählen\"),\"\",IF(M34=\"Feiertag\",T34*U34,IF(M34=\"Gleittag\",0,VLOOKUP(B34,Personalstamm!$D$8:$F$14,3,FALSE))))","v":{"v":8,"d":"8.00"}},{"$f":"VLOOKUP(B34,Personalstamm!$D$8:$E$14,2,FALSE)","v":{"v":8,"d":"8.00"}},"",{"v":0,"d":"0.00"},null,{"$f":"IF(COUNTIF(Allgemein!$H$8:$H$45,A34)>0,\"Feiertag\",\"\")","v":"Feiertag"},{"$f":"IFERROR(VLOOKUP(A34,Allgemein!$H$8:$I$45,2,FALSE),\"\")","v":{"v":1,"d":"1.00"}},{"$f":"VLOOKUP(B34,Personalstamm!$D$8:$F$14,3,FALSE)","v":{"v":8,"d":"8.00"}},"",""]
["2026-12-26","Samstag","Fehlzeit",{"$nulls":5},"","",{"$f":"IF(I35=\"\",\"\",IF(AND(I35<>\"\",J35=\"\",I35>=Personalstamm!$D$20),Personalstamm!$E$20,IF(AND(I35<>\"\",J35=\"\",I35>=Personalstamm!$D$19),Personalstamm!$E$19,IF(AND(I35<>\"\",J35<Personalstamm!$E$20,I35>=Personalstamm!$D$20),Personalstamm!$E$20-J35,IF(AND(I35<>\"\",J35<Personalstamm!E$19,I35>=Personalstamm!$D$19),Personalstamm!$E$19-J35,0)))))","v":""},"","Feiertag",{"$f":"IF(OR(M35=\"\",M35=\"Bitte auswählen\"),\"\",IF(M35=\"Feiertag\",T35*U35,IF(M35=\"Gleittag\",0,VLOOKUP(B35,Personalstamm!$D$8:$F$14,3,FALSE))))","v":{"v":0,"d":"0.00"}},{"$f":"VLOOKUP(B35,Personalstamm!$D$8:$E$14,2,FALSE)","v":{"v":0,"d":"0.00"}},"",{"v":0,"d":"0.00"},null,{"$f":"IF(COUNTIF(Allgemein!$H$8:$H$45,A35)>0,\"Feiertag\",\"\")","v":"Feiertag"},{"$f":"IFERROR(VLOOKUP(A35,Allgemein!$H$8:$I$45,2,FALSE),\"\")","v":{"v":1,"d":"1.00"}},{"$f":"VLOOKUP(B35,Personalstamm!$D$8:$F$14,3,FALSE)","v":{"v":0,"d":"0.00"}},"",""]
["2026-12-27","Sonntag","Wochenende",{"$nulls":5},"","",{"$f":"IF(I36=\"\",\"\",IF(AND(I36<>\"\",J36=\"\",I36>=Personalstamm!$D$20),Personalstamm!$E$20,IF(AND(I36<>\"\",J36=\"\",I36>=Personalstamm!$D$19),Personalstamm!$E$19,IF(AND(I36<>\"\",J36<Personalstamm!$E$20,I36>=Personalstamm!$D$20),Personalstamm!$E$20-J36,IF(AND(I36<>\"\",J36<Personalstamm!E$19,I36>=Personalstamm!$D$19),Personalstamm!$E$19-J36,0)))))","v":""},"","",{"$f":"IF(OR(M36=\"\",M36=\"Bitte auswählen\"),\"\",IF(M36=\"Feiertag\",T36*U36,IF(M36=\"Gleittag\",0,VLOOKUP(B36,Personalstamm!$D$8:$F$14,3,FALSE))))","v":""},{"$f":"VLOOKUP(B36,Personalstamm!$D$8:$E$14,2,FALSE)","v":{"v":0,"d":"0.00"}},"",{"v":0,"d":"0.00"},null,{"$f":"IF(COUNTIF(Allgemein!$H$8:$H$45,A36)>0,\"Feiertag\",\"\")","v":""},{"$f":"IFERROR(VLOOKUP(A36,Allgemein!$H$8:$I$45,2,FALSE),\"\")","v":""},{"$f":"VLOOKUP(B36,Personalstamm!$D$8:$F$14,3,FALSE)","v":{"v":0,"d":"0.00"}},"",""]
["2026-12-28","Montag","Bitte auswählen",{"$nulls":5},"","",{"$f":"IF(I37=\"\",\"\",IF(AND(I37<>\"\",J37=\"\",I37>=Personalstamm!$D$20),Personalstamm!$E$20,IF(AND(I37<>\"\",J37=\"\",I37>=Personalstamm!$D$19),Personalstamm!$E$19,IF(AND(I37<>\"\",J37<Personalstamm!$E$20,I37>=Personalstamm!$D$20),Personalstamm!$E$20-J37,IF(AND(I37<>\"\",J37<Personalstamm!E$19,I37>=Personalstamm!$D$19),Personalstamm!$E$19-J37,0)))))","v":""},"","",{"$f":"IF(OR(M37=\"\",M37=\"Bitte auswählen\"),\"\",IF(M37=\"Feiertag\",T37*U37,IF(M37=\"Gleittag\",0,VLOOKUP(B37,Personalstamm!$D$8:$F$14,3,FALSE))))","v":""},{"$f":"VLOOKUP(B37,Personalstamm!$D$8:$E$14,2,FALSE)","v":{"v":8,"d":"8.00"}},"",{"v":0,"d":"0.00"},null,{"$f":"IF(COUNTIF(Allgemein!$H$8:$H$45,A37)>0,\"Feiertag\",\"\")","v":""},{"$f":"IFERROR(VLOOKUP(A37,Allgemein!$H$8:$I$45,2,FALSE),\"\")","v":""},{"$f":"VLOOKUP(B37,Personalstamm!$D$8:$F$14,3,FALSE)","v":{"v":8,"d":"8.00"}},"",""]
["2026-12-29","Dienstag","Bitte auswählen",{"$nulls":5},"","",{"$f":"IF(I38=\"\",\"\",IF(AND(I38<>\"\",J38=\"\",I38>=Personalstamm!$D$20),Personalstamm!$E$20,IF(AND(I38<>\"\",J38=\"\",I38>=Personalstamm!$D$19),Personalstamm!$E$19,IF(AND(I38<>\"\",J38<Personalstamm!$E$20,I38>=Personalstamm!$D$20),Personalstamm!$E$20-J38,IF(AND(I38<>\"\",J38<Personalstamm!E$19,I38>=Personalstamm!$D$19),Personalstamm!$E$19-J38,0)))))","v":""},"","",{"$f":"IF(OR(M38=\"\",M38=\"Bitte auswählen\"),\"\",IF(M38=\"Feiertag\",T38*U38,IF(M38=\"Gleittag\",0,VLOOKUP(B38,Personalstamm!$D$8:$F$14,3,FALSE))))","v":""},{"$f":"VLOOKUP(B38,Personalstamm!$D$8:$E$14,2,FALSE)","v":{"v":8,"d":"8.00"}},"",{"v":0,"d":"0.00"},null,{"$f":"IF(COUNTIF(Allgemein!$H$8:$H$45,A38)>0,\"Feiertag\",\"\")","v":""},{"$f":"IFERROR(VLOOKUP(A38,Allgemein!$H$8:$I$45,2,FALSE),\"\")","v":""},{"$f":"VLOOKUP(B38,Personalstamm!$D$8:$F$14,3,FALSE)","v":{"v":8,"d":"8.00"}},"",""]
["2026-12-30","Mittwoch","Bitte auswählen",{"$nulls":5},"","",{"$f":"IF(I39=\"\",\"\",IF(AND(I39<>\"\",J39=\"\",I39>=Personalstamm!$D$20),Personalstamm!$E$20,IF(AND(I39<>\"\",J39=\"\",I39>=Personalstamm!$D$19),Personalstamm!$E$19,IF(AND(I39<>\"\",J39<Personalstamm!$E$20,I39>=Personalstamm!$D$20),Personalstamm!$E$20-J39,IF(AND(I39<>\"\",J39<Personalstamm!E$19,I39>=Personalstamm!$D$19),Personalstamm!$E$19-J39,0)))))","v":""},"","",{"$f":"IF(OR(M39=\"\",M39=\"Bitte auswählen\"),\"\",IF(M39=\"Feiertag\",T39*U39,IF(M39=\"Gleittag\",0,VLOOKUP(B39,Personalstamm!$D$8:$F$14,3,FALSE))))","v":""},{"$f":"VLOOKUP(B39,Personalstamm!$D$8:$E$14,2,FALSE)","v":{"v":8,"d":"8.00"}},"",{"v":0,"d":"0.00"},null,{"$f":"IF(COUNTIF(Allgemein!$H$8:$H$45,A39)>0,\"Feiertag\",\"\")","v":""},{"$f":"IFERROR(VLOOKUP(A39,Allgemein!$H$8:$I$45,2,FALSE),\"\")","v":""},{"$f":"VLOOKUP(B39,Personalstamm!$D$8:$F$14,3,FALSE)","v":{"v":8,"d":"8.00"}},"",""]
["2026-12-31","Donnerstag","Fehlzeit",{"$nulls":5},"","",{"$f":"IF(I40=\"\",\"\",IF(AND(I40<>\"\",J40=\"\",I40>=Personalstamm!$D$20),Personalstamm!$E$20,IF(AND(I40<>\"\",J40=\"\",I40>=Personalstamm!$D$19),Personalstamm!$E$19,IF(AND(I40<>\"\",J40<Personalstamm!$E$20,I40>=Personalstamm!$D$20),Personalstamm!$E$20-J40,IF(AND(I40<>\"\",J40<Personalstamm!E$19,I40>=Personalstamm!$D$19),Personalstamm!$E$19-J40,0)))))","v":""},"","Feiertag",{"$f":"IF(OR(M40=\"\",M40=\"Bitte auswählen\"),\"\",IF(M40=\"Feiertag\",T40*U40,IF(M40=\"Gleittag\",0,VLOOKUP(B40,Personalstamm!$D$8:$F$14,3,FALSE))))","v":{"v":4,"d":"4.00"}},{"$f":"VLOOKUP(B40,Personalstamm!$D$8:$E$14,2,FALSE)","v":{"v":8,"d":"8.00"}},"",{"v":0,"d":"0.00"},null,{"$f":"IF(COUNTIF(Allgemein!$H$8:$H$45,A40)>0,\"Feiertag\",\"\")","v":"Feiertag"},{"$f":"IFERROR(VLOOKUP(A40,Allgemein!$H$8:$I$45,2,FALSE),\"\")","v":{"v":0.5,"d":"0.50"}},{"$f":"VLOOKUP(B40,Personalstamm!$D$8:$F$14,3,FALSE)","v":{"v":8,"d":"8.00"}},"",""]
["Summe",{"$nulls":7},{"$f":"SUM(I10:I40)","v":{"v":0,"d":"0.00"}},{"$f":"SUM(J10:J40)","v":{"v":0,"d":"0.00"}},{"$f":"SUM(K10:K40)","v":{"v":0,"d":"0.00"}},{"$f":"SUM(L10:L40)","v":{"v":0,"d":"0.00"}},null,{"$f":"SUM(N10:N40)","v":{"v":16,"d":"16.00"}},{"$f":"SUM(O10:O40)","v":{"v":184,"d":"184.00"}},{"$f":"SUM(P10:P40)","v":{"v":0,"d":"0.00"}}]
[]
["Art","Anzahl Tage",null,"Fehlzeitenart","Anzahl Tage","Anzahl Stunden",null,"Urlaub genommen","Urlaub geplant"]
["Monat",{"$f":"COUNTIF($C$10:$C$40,\"*\")","v":{"v":31,"d":"31.00"}},null,"Urlaub",{"$f":"COUNTIF($M$10:$M$40,Allgemein!$I$50)","v":{"v":0,"d":"0.00"}},{"$f":"SUMIF($M$10:$M$40,Allgemein!$I$50,$N$10:$N$40)","v":{"v":0,"d":"0.00"}},null,{"$f":"COUNTIFS($A$10:$A$40,\"<\"&TODAY(),$M$10:$M$40,\"Urlaub\")","v":{"v":0,"d":"0.00"}},{"$f":"COUNTIFS($A$10:$A$40,\">=\"&TODAY(),$M$10:$M$40,\"Urlaub\")","v":{"v":0,"d":"0.00"}}]
["Anwesenheit",{"$f":"COUNTIF($C$10:$C$40,Allgemein!$G$50)","v":{"v":0,"d":"0.00"}},null,"Krankheit",{"$f":"COUNTIF($M$10:$M$40,Allgemein!$I$51)","v":{"v":0,"d":"0.00"}},{"$f":"SUMIF($M$10:$M$40,Allgemein!$I$51,$N$10:$N$40)","v":{"v":0,"d":"0.00"}}]
["Fehlzeit",{"$f":"COUNTIF($C$10:$C$40,Allgemein!$G$51)","v":{"v":4,"d":"4.00"}},null,"Kurzarbeit",{"$f":"COUNTIF($M$10:$M$40,Allgemein!$I$52)","v":{"v":0,"d":"0.00"}},{"$f":"SUMIF($M$10:$M$40,Allgemein!$I$52,$N$10:$N$40)","v":{"v":0,"d":"0.00"}}]
["Wochenende",{"$f":"COUNTIF($C$10:$C$40,Allgemein!$G$52)","v":{"v":7,"d":"7.00"}},null,"Mutterschutz",{"$f":"COUNTIF($M$10:$M$40,Allgemein!$I$53)","v":{"v":0,"d":"0.00"}},{"$f":"SUMIF($M$10:$M$40,Allgemein!$I$53,$N$10:$N$40)","v":{"v":0,"d":"0.00"}}]
["Undefiniert",{"$f":"COUNTIF($C$10:$C$40,Allgemein!$G$49)","v":{"v":20,"d":"20.00"}},null,"Fortbildung",{"$f":"COUNTIF($M$10:$M$40,Allgemein!$I$54)","v":{"v":0,"d":"0.00"}},{"$f":"SUMIF($M$10:$M$40,Allgemein!$I$54,$N$10:$N$40)","v":{"v":0,"d":"0.00"}}]
[{"$nulls":3},"Elternzeit",{"$f":"COUNTIF($M$10:$M$40,Allgemein!$I$55)","v":{"v":0,"d":"0.00"}},{"$f":"SUMIF($M$10:$M$40,Allgemein!$I$55,$N$10:$N$40)","v":{"v":0,"d":"0.00"}}]
[{"$nulls":3},"Gleittag",{"$f":"COUNTIF($M$10:$M$40,Allgemein!$I$56)","v":{"v":0,"d":"0.00"}},{"$f":"SUMIF($M$10:$M$40,Allgemein!$I$56,$V$10:$V$40)","v":{"v":0,"d":"0.00"}}]
[{"$nulls":3},"Schule",{"$f":"COUNTIF($M$10:$M$40,Allgemein!$I$57)","v":{"v":0,"d":"0.00"}},{"$f":"SUMIF($M$10:$M$40,Allgemein!$I$57,$N$10:$N$40)","v":{"v":0,"d":"0.00"}}]
[{"$nulls":3},"Feiertag",{"$f":"COUNTIF($M$10:$M$40,Allgemein!$I$58)","v":{"v":4,"d":"4.00"}},{"$f":"SUMIF($M$10:$M$40,Allgemein!$I$58,$N$10:$N$40)","v":{"v":16,"d":"16.00"}}]
[{"$nulls":3},"Undefiniert",{"$f":"COUNTIF($M$10:$M$40,Allgemein!$I$49)","v":{"v":0,"d":"0.00"}},{"$f":"SUMIF($M$10:$M$40,Allgemein!$I$49,$N$10:$N$40)","v":{"v":0,"d":"0.00"}}]